{"text_format":"1","workbook":"xlsx","n_sheets":5,"sheets":["Лист2","полотно","Алюм коробки Фрист","Деревянные коробки","Лист4"],"not_rendered":{"charts":0,"images":0,"macros":1,"external_links":0,"defined_names":1,"comments":0,"pivot_tables":0},"unopened":[],"bounds":{"document_bytes":16777216,"sheet_cells":100000,"rows_first":2000,"rows_last":500,"rows_between":2000,"halvings":0,"cell_chars":16384,"cell_head_chars":4096},"cells_cut":0,"cells_raw":0,"read":"whole","date_system":"1900"}

{"sheet":"Лист2","index":0,"n_rows":10,"n_cols":23,"rows_kept":10,"cut":false,"hidden":false,"merged":[[1,4,1,6]]}
[]
[]
[null,"полотно",null,null,"высота мм",null,"ширина мм","толщина проема мм","площадь м2",null,"Вид отделки",null,"Стоимость","тонировка шпона","стоимость","  Вид пластика",null,"Тип коробки","стоимость","Тип наличников",null,null,"И Т О Г О"]
[null,3,null,null,2100,1,900,90,{"$f":"E4*G4/1000000","v":1.89},null,2,null,{"$f":"I4*INDEX(полотно!$B$3:$F$8,K4,B4)+IF(LEFT(INDEX(полотно!$B$1:$F$1,B4),3)=\"(ПП\",(2*E4+G4)*полотно!B21/1000,0)+CHOOSE(K4,0,0,полотно!B18,полотно!C18,0,0)","v":0},1,{"$f":"INDIRECT(\"полотно!B\" & N4+11)","v":630},null,6,4,{"$f":"INDIRECT(\"Лист4!C\" & R4+307)","v":2479.11},1,null,{"$f":"INDIRECT(\"'Деревянные коробки'!B\" & T4+40)","v":1632},{"$f":"Q4+O4+M4+J4","v":636}]
[]
[]
[]
[]
[]
[null,null,null,null,null,null,null,null,null,null,null,null,null,null,null,{"$f":"INDEX(Лист4!$B$335:$E$340,R4,S4)*IF(AND(ISNUMBER(FIND(\"V\",INDEX(Лист4!$A$335:$A$340,R4))),E4*2+G4>5800),1.5,1)","v":{"$error":"#REF!"}}]

{"sheet":"полотно","index":1,"n_rows":29,"n_cols":6,"rows_kept":29,"cut":false,"hidden":false,"merged":[[15,0,15,2]]}
[null,"Сотовое полотно","трубчатое полотно","полнотелое полотно","(ПП IE 30)","(ПП IE 60)"]
["Вид отделки","цена руб/м2","цена руб/м2","цена руб/м2","цена руб/м2","цена руб/м2"]
["шпон эконом"]
["шпон натурал"]
["Пластик белый"]
["Пластик под дерево"]
["эмаль"]
[]
[]
[]
["тонировка шпона","цена руб/м2"]
["ДА",630]
["НЕТ",0]
[]
[]
["Доп опция пластика"]
["вид отделки","белый","дерево"]
["цена руб/лист"]
[]
[]
["Фрезеровка"]
[]
[]
[]
["сотовое"]
["трубчатое"]
["полнотелое"]
["(ПП IE 30)"]
["(ПП IE 60)"]

{"sheet":"Алюм коробки Фрист","index":2,"n_rows":41,"n_cols":18,"rows_kept":41,"cut":false,"hidden":false,"merged":[[0,7,0,9],[0,11,0,13],[0,15,0,17],[35,0,35,5],[0,0,0,5],[7,0,7,5],[14,0,14,4],[21,0,21,5],[28,0,28,5]]}
["Под глухое полотно RAL 9016",null,null,null,null,null,null,"RAL 9016",null,null,null,"Анодировка",null,null,null,"неокрашено"]
[null,700,900,1200,1500,1800,null,"высота","ширина","стоимость",null,"высота","ширина","стоимость",null,"высота","ширина","стоимость"]
[2100,2860,2860,2940,2960,2975,null,{"$f":"Лист2!E4","v":2100},{"$f":"Лист2!G4","v":900},{"$f":"INDEX(B3:F6,MIN(4,SUMPRODUCT(--(A3:A6<H3))+1),MIN(5,SUMPRODUCT(--(B2:F2<I3))+1))","v":2860},null,{"$f":"H3","v":2100},900,{"$f":"INDEX(B10:F13,MIN(4,SUMPRODUCT(--(A10:A13<L3))+1),MIN(5,SUMPRODUCT(--(B9:F9<M3))+1))","v":3060},null,{"$f":"L3","v":2100},900,{"$f":"INDEX(B17:F20,MIN(4,SUMPRODUCT(--(A17:A20<P3))+1),MIN(5,SUMPRODUCT(--(B16:F16<Q3))+1))","v":2730}]
[2300,2950,2950,2965,2980,2995,null,{"$f":"Лист2!#REF!","v":{"$error":"#REF!"}},{"$f":"Лист2!#REF!","v":{"$error":"#REF!"}},{"$f":"INDEX(B3:F6,MIN(4,SUMPRODUCT(--(A3:A6<H4))+1),MIN(5,SUMPRODUCT(--(B2:F2<I4))+1))","v":{"$error":"#REF!"}},null,{"$f":"H4","v":{"$error":"#REF!"}},{"$error":"#REF!"},{"$f":"INDEX(B10:F13,MIN(4,SUMPRODUCT(--(A10:A13<L4))+1),MIN(5,SUMPRODUCT(--(B9:F9<M4))+1))","v":{"$error":"#REF!"}},null,{"$error":"#REF!"},{"$error":"#REF!"},{"$f":"INDEX(B17:F20,MIN(4,SUMPRODUCT(--(A17:A20<P4))+1),MIN(5,SUMPRODUCT(--(B16:F16<Q4))+1))","v":{"$error":"#REF!"}}]
[2700,2980,2990,3010,3025,3035,null,{"$f":"Лист2!#REF!","v":{"$error":"#REF!"}},{"$f":"Лист2!#REF!","v":{"$error":"#REF!"}},{"$f":"INDEX(B3:F6,MIN(4,SUMPRODUCT(--(A3:A6<H5))+1),MIN(5,SUMPRODUCT(--(B2:F2<I5))+1))","v":{"$error":"#REF!"}},null,{"$error":"#REF!"},{"$error":"#REF!"},{"$f":"INDEX(B10:F13,MIN(4,SUMPRODUCT(--(A10:A13<L5))+1),MIN(5,SUMPRODUCT(--(B9:F9<M5))+1))","v":{"$error":"#REF!"}},null,{"$error":"#REF!"},{"$error":"#REF!"},{"$f":"INDEX(B17:F20,MIN(4,SUMPRODUCT(--(A17:A20<P5))+1),MIN(5,SUMPRODUCT(--(B16:F16<Q5))+1))","v":{"$error":"#REF!"}}]
[3000,3010,3025,3035,3055,3065,null,{"$f":"Лист2!#REF!","v":{"$error":"#REF!"}},{"$f":"Лист2!#REF!","v":{"$error":"#REF!"}},{"$f":"INDEX(B3:F6,MIN(4,SUMPRODUCT(--(A3:A6<H6))+1),MIN(5,SUMPRODUCT(--(B2:F2<I6))+1))","v":{"$error":"#REF!"}},null,{"$error":"#REF!"},{"$error":"#REF!"},{"$f":"INDEX(B10:F13,MIN(4,SUMPRODUCT(--(A10:A13<L6))+1),MIN(5,SUMPRODUCT(--(B9:F9<M6))+1))","v":{"$error":"#REF!"}},null,{"$error":"#REF!"},{"$error":"#REF!"},{"$f":"INDEX(B17:F20,MIN(4,SUMPRODUCT(--(A17:A20<P6))+1),MIN(5,SUMPRODUCT(--(B16:F16<Q6))+1))","v":{"$error":"#REF!"}}]
[null,null,null,null,null,null,null,{"$f":"Лист2!#REF!","v":{"$error":"#REF!"}},{"$f":"Лист2!#REF!","v":{"$error":"#REF!"}},{"$f":"INDEX(B3:F6,MIN(4,SUMPRODUCT(--(A3:A6<H7))+1),MIN(5,SUMPRODUCT(--(B2:F2<I7))+1))","v":{"$error":"#REF!"}},null,{"$error":"#REF!"},{"$error":"#REF!"},{"$f":"INDEX(B10:F13,MIN(4,SUMPRODUCT(--(A10:A13<L7))+1),MIN(5,SUMPRODUCT(--(B9:F9<M7))+1))","v":{"$error":"#REF!"}},null,{"$error":"#REF!"},{"$error":"#REF!"},{"$f":"INDEX(B17:F20,MIN(4,SUMPRODUCT(--(A17:A20<P7))+1),MIN(5,SUMPRODUCT(--(B16:F16<Q7))+1))","v":{"$error":"#REF!"}}]
["Под глухое полотно анодировка"]
[null,700,900,1200,1500,1800]
[2100,3060,3060,3075,3095,3105]
[2300,3070,3080,3100,3115,3130]
[2700,3110,3125,3140,3160,3180]
[3000,3145,3160,3175,3190,3210]
[]
["Под глухое полотно неокрашено"]
[null,700,900,1200,1500,1800]
[2100,2730,2730,2740,2760,2770]
[2300,2740,2750,2765,2775,2790]
[2700,2775,2785,2800,2820,2830]
[3000,2810,2820,2830,2845,2860]
[]
["Под цельностеклянное полотно Ral 9016"]
[null,700,900,1200,1500,1800]
[2100,3570,3570,3935,3955,3975]
[2300,3570,3945,3960,3980,4005]
[2700,3980,3995,4015,4035,4055]
[3000,4020,4035,4055,4070,4095]
[]
["Под цельностеклянное полотно анодировка"]
[null,700,900,1200,1500,1800]
[2100,3740,3740,4125,4140,4165]
[2300,3740,4130,4150,4170,4195]
[2700,4170,4185,4205,4230,4250]
[3000,4215,4230,4250,4270,4290]
[]
["Под цельностеклянное полотно неокрашено"]
[null,700,900,1200,1500,1800]
[2100]
[2300]
[2700]
[3000]

{"sheet":"Деревянные коробки","index":3,"n_rows":42,"n_cols":6,"rows_kept":42,"cut":false,"hidden":false,"merged":[[15,0,15,2],[28,0,28,2],[0,0,0,1],[8,0,8,1]]}
["коробка деревянная стандартная"]
["цена за п/м руб","стоимость"]
[430,{"$f":"(Лист2!E4*2+Лист2!G4)*'Деревянные коробки'!A3/1000","v":2193}]
[430,{"$f":"(Лист2!#REF!*2+Лист2!#REF!)*'Деревянные коробки'!A4/1000","v":{"$error":"#REF!"}}]
[430,{"$f":"(Лист2!#REF!*2+Лист2!#REF!)*'Деревянные коробки'!A5/1000","v":{"$error":"#REF!"}}]
[430,{"$f":"(Лист2!#REF!*2+Лист2!#REF!)*'Деревянные коробки'!A6/1000","v":{"$error":"#REF!"}}]
[430,{"$f":"(Лист2!#REF!*2+Лист2!#REF!)*'Деревянные коробки'!A7/1000","v":{"$error":"#REF!"}}]
[]
["коробка деревянная усиленная"]
[570,{"$f":"(Лист2!E4*2+Лист2!G4)*'Деревянные коробки'!A10/1000","v":2907}]
[570,{"$f":"(Лист2!#REF!*2+Лист2!#REF!)*'Деревянные коробки'!A11/1000","v":{"$error":"#REF!"}}]
[570,{"$f":"(Лист2!#REF!*2+Лист2!#REF!)*'Деревянные коробки'!A12/1000","v":{"$error":"#REF!"}}]
[570,{"$f":"(Лист2!#REF!*2+Лист2!#REF!)*'Деревянные коробки'!A13/1000","v":{"$error":"#REF!"}}]
[570,{"$f":"(Лист2!#REF!*2+Лист2!#REF!)*'Деревянные коробки'!A14/1000","v":{"$error":"#REF!"}}]
[]
["наличники "]
["наименование","цена за п/м руб","стоимость"]
["плоский",320,{"$f":"(Лист2!E4*2+Лист2!G4)*'Деревянные коробки'!B18/1000","v":1632}]
["плоский",320,{"$f":"(Лист2!#REF!*2+Лист2!#REF!)*'Деревянные коробки'!B19/1000","v":{"$error":"#REF!"}}]
["плоский",320,{"$f":"(Лист2!#REF!*2+Лист2!#REF!)*'Деревянные коробки'!B20/1000","v":{"$error":"#REF!"}}]
["плоский",320,{"$f":"(Лист2!#REF!*2+Лист2!#REF!)*'Деревянные коробки'!B21/1000","v":{"$error":"#REF!"}}]
["плоский",320,{"$f":"(Лист2!#REF!*2+Лист2!#REF!)*'Деревянные коробки'!B22/1000","v":{"$error":"#REF!"}}]
["телескопический",380,{"$f":"(Лист2!E4*2+Лист2!G4)*'Деревянные коробки'!B23/1000","v":1938}]
["телескопический",380,{"$f":"(Лист2!#REF!*2+Лист2!#REF!)*'Деревянные коробки'!B24/1000","v":{"$error":"#REF!"}}]
["телескопический",380,{"$f":"(Лист2!#REF!*2+Лист2!#REF!)*'Деревянные коробки'!B25/1000","v":{"$error":"#REF!"}}]
["телескопический",380,{"$f":"(Лист2!#REF!*2+Лист2!#REF!)*'Деревянные коробки'!B26/1000","v":{"$error":"#REF!"}}]
["телескопический",380,{"$f":"(Лист2!#REF!*2+Лист2!#REF!)*'Деревянные коробки'!B27/1000","v":{"$error":"#REF!"}}]
[]
["доборы"]
[null,"стоимость","цена"]
[1,{"$f":"(Лист2!E4*2+Лист2!G4)/1000*(Лист2!H4-100)/1000*C31+(Лист2!E4*2+Лист2!G4)/1000*B37","v":286.10999999999996},2890]
[2,{"$f":"(Лист2!#REF!*2+Лист2!#REF!)/1000*(Лист2!#REF!-100)/1000*C32+(Лист2!#REF!*2+Лист2!#REF!)/1000*B37","v":{"$error":"#REF!"}},2890]
[3,{"$f":"(Лист2!#REF!*2+Лист2!#REF!)/1000*(Лист2!#REF!-90)/1000*C33+(Лист2!#REF!*2+Лист2!#REF!)/1000*B37","v":{"$error":"#REF!"}},2890]
[4,{"$f":"(Лист2!#REF!*2+Лист2!#REF!)/1000*(Лист2!#REF!-90)/1000*C34+(Лист2!#REF!*2+Лист2!#REF!)/1000*B37","v":{"$error":"#REF!"}},2890]
[5,{"$f":"(Лист2!#REF!*2+Лист2!#REF!)/1000*(Лист2!#REF!-90)/1000*C35+(Лист2!#REF!*2+Лист2!#REF!)/1000*B37","v":{"$error":"#REF!"}},2890]
[]
["Фрезеровка",85]
[]
[null,"Сотовое полотно","трубчатое полотно","полнотелое полотно","(ПП IE 30)","(ПП IE 60)"]
[null,"цена руб/м2","цена руб/м2","цена руб/м2","цена руб/м2","цена руб/м2"]
["плоский",{"$f":"C18","v":1632},{"$f":"C19","v":{"$error":"#REF!"}},{"$f":"C20","v":{"$error":"#REF!"}},{"$f":"C21","v":{"$error":"#REF!"}},{"$f":"C22","v":{"$error":"#REF!"}}]
["телескопический",{"$f":"C23","v":1938},{"$f":"C24","v":{"$error":"#REF!"}},{"$f":"C25","v":{"$error":"#REF!"}},{"$f":"C26","v":{"$error":"#REF!"}},{"$f":"C27","v":{"$error":"#REF!"}}]

{"sheet":"Лист4","index":4,"n_rows":345,"n_cols":13,"rows_kept":345,"cut":false,"hidden":false,"merged":[[322,0,326,0],[327,0,331,0],[307,0,311,0],[312,0,316,0],[317,0,321,0],[3,0,3,2],[62,0,62,2],[121,0,121,2],[180,0,180,2],[239,0,239,2]]}
["Тип","Высота","Ширина","Толщина","Цена Коробки","Количество коробок, шт","Сумма","Добор 50мм, шт","Добор 80мм, шт","Цена добор 50мм","Цена добор 80мм","Сумма","ИТОГО"]
[{"$f":"Лист2!R4","v":4},{"$f":"Лист2!E4","v":2100},{"$f":"Лист2!G4","v":900},{"$f":"Лист2!H4","v":90},{"$f":"B15+B28","v":0},1,{"$f":"F2*E2","v":0},{"$f":"B59","v":0},{"$f":"B58","v":0},{"$f":"B37","v":0},{"$f":"B46","v":0},{"$f":"H2*J2+I2*K2","v":0},{"$f":"G2+L2","v":0}]
[]
[]
[null,null,null,null,"Размер по проему: (высота х ширина)"," Ед.изм.","Цена/руб."]
["К3",2150,1000,{"$f":"B6+C6","v":3150},"до  2150х1000","компл.",4830,{"$f":"B2","v":2100},{"$f":"C2","v":900},{"$f":"IF(H6<=B6,1,0)","v":1},{"$f":"IF(I6<=1000,1,0)","v":1},{"$f":"IF(AND(J6=1,K6=1),G6,0)","v":4830}]
["К3",2150,2000,4150,"до  2150х2000","компл.",6040,{"$f":"H6","v":2100},900,{"$f":"IF(H7<=B7,1,0)","v":1},{"$f":"IF(AND(1000<I7,I7<=2000),1,0)","v":0},0]
["К3",2500,1000,3500,"до  2500х1000","компл.",6040,2100,900,{"$f":"IF(AND(2150<H8,H8<=2500),1,0)","v":0},{"$f":"IF(I8<=1000,1,0)","v":1},0]
["К3",2500,2000,4500,"до  2500х2000","компл.",7245,2100,900,{"$f":"IF(AND(2150<H9,H9<=2500),1,0)","v":0},{"$f":"IF(AND(1000<I9,I9<=2000),1,0)","v":0},0]
["К3",2800,1000,3800,"до  2800х1000","компл.",7245,2100,900,{"$f":"IF(AND(2500<H10,H10<=2800),1,0)","v":0},{"$f":"IF(I10<=1000,1,0)","v":1},0]
["К3",2800,2000,4800,"до  2800х2000","компл.",8450,2100,900,{"$f":"IF(AND(2500<H11,H11<=2800),1,G12)","v":0},{"$f":"IF(AND(1000<I11,I11<=2000),1,0)","v":0},0]
[null,null,null,null,null,null,null,null,null,{"$f":"IF(H11>B11,1,0)","v":0},{"$f":"IF(I10<=1000,1,0)","v":1},{"$f":"IF(AND(J12=1,K12=1),G10,0)","v":0}]
[null,null,null,null,null,null,null,null,null,{"$f":"IF(H11>B11,1,0)","v":0},{"$f":"IF(AND(1000<I11,I11<=2000),1,0)","v":0},{"$f":"IF(AND(J13=1,K13=1),G11,0)","v":0}]
[]
[1,{"$f":"IF(A2=A15,L15,0)","v":0},null,null,null,null,null,null,null,null,null,{"$f":"SUM(L6:L14)","v":4830}]
[]
[]
[null,null,null,null,"Размер по проему: (высота х ширина)"," Ед.изм.","Цена/руб."]
["К4",2150,1000,{"$f":"B19+C19","v":3150},"до  2150х1000","компл.",4725,{"$f":"B2","v":2100},{"$f":"C2","v":900},{"$f":"IF(H19<=B19,1,0)","v":1},{"$f":"IF(I19<=1000,1,0)","v":1},{"$f":"IF(AND(J19=1,K19=1),G19,0)","v":4725}]
["К4",2150,2000,4150,"до  2150х2000","компл.",5910,{"$f":"H19","v":2100},900,{"$f":"IF(H20<=B20,1,0)","v":1},{"$f":"IF(AND(1000<I20,I20<=2000),1,0)","v":0},0]
["К4",2500,1000,3500,"до  2500х1000","компл.",5910,2100,900,{"$f":"IF(AND(2150<H21,H21<=2500),1,0)","v":0},{"$f":"IF(I21<=1000,1,0)","v":1},0]
["К4",2500,2000,4500,"до  2500х2000","компл.",7090,2100,900,{"$f":"IF(AND(2150<H22,H22<=2500),1,0)","v":0},{"$f":"IF(AND(1000<I22,I22<=2000),1,0)","v":0},0]
["К4",2800,1000,3800,"до  2800х1000","компл.",7090,2100,900,{"$f":"IF(AND(2500<H23,H23<=2800),1,0)","v":0},{"$f":"IF(I23<=1000,1,0)","v":1},0]
["К4",2800,2000,4800,"до  2800х2000","компл.",8265,2100,900,{"$f":"IF(AND(2500<H24,H24<=2800),1,G25)","v":0},{"$f":"IF(AND(1000<I24,I24<=2000),1,0)","v":0},0]
[null,null,null,null,null,null,null,null,null,{"$f":"IF(H24>B24,1,0)","v":0},{"$f":"IF(I23<=1000,1,0)","v":1},{"$f":"IF(AND(J25=1,K25=1),G23,0)","v":0}]
[null,null,null,null,null,null,null,null,null,{"$f":"IF(H24>B24,1,0)","v":0},{"$f":"IF(AND(1000<I24,I24<=2000),1,0)","v":0},{"$f":"IF(AND(J26=1,K26=1),G24,0)","v":0}]
[]
[2,{"$f":"IF(A2=A28,L28,0)","v":0},null,null,null,null,null,null,null,null,null,{"$f":"SUM(L19:L27)","v":4725}]
[]
["К3",2500,1000,50,"  до   2500х1000","компл.",1500,{"$f":"B2","v":2100},{"$f":"C2","v":900},{"$f":"IF(H30<=B30,1,0)","v":1},{"$f":"IF(I30<=1000,1,0)","v":1},{"$f":"IF(AND(J30=1,K30=1),G30,0)","v":1500}]
["К3",2500,2000,50,"  до   2500х2000","компл.",1790,{"$f":"H30","v":2100},900,{"$f":"IF(H31<=B31,1,0)","v":1},{"$f":"IF(AND(1000<I31,I31<=2000),1,0)","v":0},{"$f":"IF(AND(J31=1,K31=1),G31,0)","v":0}]
["К3",2800,1000,50,"  до   2800х1000","компл.",1790,2100,900,{"$f":"IF(AND(2500<H32,H32<=2800),1,0)","v":0},{"$f":"IF(I32<=1000,1,0)","v":1},{"$f":"IF(AND(J32=1,K32=1),G32,0)","v":0}]
["К3",2800,2000,50,"  до   2800х2000","компл.",2140,2100,900,{"$f":"IF(AND(2500<H33,H33<=2800),1,0)","v":0},{"$f":"IF(AND(1000<I33,I33<=2000),1,0)","v":0},{"$f":"IF(AND(J33=1,K33=1),G33,0)","v":0}]
[null,null,null,null,null,null,null,null,null,{"$f":"IF(H33>B33,1,0)","v":0},{"$f":"IF(I32<=1000,1,0)","v":1},{"$f":"IF(AND(J34=1,K34=1),G33,0)","v":0}]
[null,null,null,null,null,null,null,null,null,{"$f":"IF(H33>B33,1,0)","v":0},{"$f":"IF(AND(1000<I33,I33<=2000),1,0)","v":0},{"$f":"IF(AND(J35=1,K35=1),G33,0)","v":0}]
[]
[1,{"$f":"IF(A2=A37,L37,0)","v":0},null,null,null,null,null,null,null,null,null,{"$f":"SUM(L30:L36)","v":1500}]
[]
["К3",2500,1000,80,"  до   2500х1000","компл.",1790,{"$f":"B2","v":2100},{"$f":"C2","v":900},{"$f":"IF(H39<=B39,1,0)","v":1},{"$f":"IF(I39<=1000,1,0)","v":1},{"$f":"IF(AND(J39=1,K39=1),G39,0)","v":1790}]
["К3",2500,2000,80,"  до   2500х2000","компл.",2140,{"$f":"H39","v":2100},900,{"$f":"IF(H40<=B40,1,0)","v":1},{"$f":"IF(AND(1000<I40,I40<=2000),1,0)","v":0},{"$f":"IF(AND(J40=1,K40=1),G40,0)","v":0}]
["К3",2800,1000,80,"  до   2800х1000","компл.",2100,2100,900,{"$f":"IF(AND(2500<H41,H41<=2800),1,0)","v":0},{"$f":"IF(I41<=1000,1,0)","v":1},{"$f":"IF(AND(J41=1,K41=1),G41,0)","v":0}]
["К3",2800,2000,80,"  до   2800х2000","компл.",2520,2100,900,{"$f":"IF(AND(2500<H42,H42<=2800),1,0)","v":0},{"$f":"IF(AND(1000<I42,I42<=2000),1,0)","v":0},{"$f":"IF(AND(J42=1,K42=1),G42,0)","v":0}]
["К3",null,null,null,null,null,null,null,null,{"$f":"IF(H42>B42,1,0)","v":0},{"$f":"IF(I41<=1000,1,0)","v":1},{"$f":"IF(AND(J43=1,K43=1),G42,0)","v":0}]
[null,null,null,null,null,null,null,null,null,{"$f":"IF(H42>B42,1,0)","v":0},{"$f":"IF(AND(1000<I42,I42<=2000),1,0)","v":0},{"$f":"IF(AND(J44=1,K44=1),G42,0)","v":0}]
[]
[1,{"$f":"IF(A2=A46,L46,0)","v":0},null,null,null,null,null,null,null,null,null,{"$f":"SUM(L39:L45)","v":1790}]
[]
[]
["Толщина дверного проема",{"$f":"D2","v":90}]
["добор 80 мм",{"$f":"INT((B49-120)/80)","v":-1}]
["добор 50 мм",0]
["Остаток",{"$f":"(B49-120)-B50*80","v":50}]
[]
["Необходимое количество"]
["добор 80 мм",{"$f":"IF(B52>50,B50+1,B50)","v":-1}]
["добор 50 мм",{"$f":"IF(AND(1<B52,B52<=50),B51+1,B51)","v":1}]
[]
[1,{"$f":"IF(A2=A58,L58,0)","v":0},null,null,null,null,null,null,null,null,null,{"$f":"B55","v":-1}]
[1,{"$f":"IF(A2=A59,L59,0)","v":0},null,null,null,null,null,null,null,null,null,{"$f":"B56","v":1}]
[]
[{"$f":"Лист2!#REF!","v":{"$error":"#REF!"}},{"$f":"Лист2!#REF!","v":{"$error":"#REF!"}},{"$f":"Лист2!#REF!","v":{"$error":"#REF!"}},{"$f":"Лист2!#REF!","v":{"$error":"#REF!"}},{"$f":"B74+B87","v":{"$error":"#REF!"}},1,{"$f":"F61*E61","v":{"$error":"#REF!"}},{"$f":"B118","v":{"$error":"#REF!"}},{"$f":"B117","v":{"$error":"#REF!"}},{"$f":"B96","v":{"$error":"#REF!"}},{"$f":"B105","v":{"$error":"#REF!"}},{"$f":"H61*J61+I61*K61","v":{"$error":"#REF!"}},{"$f":"G61+L61","v":{"$error":"#REF!"}}]
[]
[]
[null,null,null,null,"Размер по проему: (высота х ширина)"," Ед.изм.","Цена/руб."]
["К3",2150,1000,{"$f":"B65+C65","v":3150},"до  2150х1000","компл.",4830,{"$f":"B61","v":{"$error":"#REF!"}},{"$f":"C61","v":{"$error":"#REF!"}},{"$f":"IF(H65<=B65,1,0)","v":{"$error":"#REF!"}},{"$f":"IF(I65<=1000,1,0)","v":{"$error":"#REF!"}},{"$f":"IF(AND(J65=1,K65=1),G65,0)","v":{"$error":"#REF!"}}]
["К3",2150,2000,4150,"до  2150х2000","компл.",6040,{"$f":"H65","v":{"$error":"#REF!"}},{"$error":"#REF!"},{"$f":"IF(H66<=B66,1,0)","v":{"$error":"#REF!"}},{"$f":"IF(AND(1000<I66,I66<=2000),1,0)","v":{"$error":"#REF!"}},{"$error":"#REF!"}]
["К3",2500,1000,3500,"до  2500х1000","компл.",6040,{"$error":"#REF!"},{"$error":"#REF!"},{"$f":"IF(AND(2150<H67,H67<=2500),1,0)","v":{"$error":"#REF!"}},{"$f":"IF(I67<=1000,1,0)","v":{"$error":"#REF!"}},{"$error":"#REF!"}]
["К3",2500,2000,4500,"до  2500х2000","компл.",7245,{"$error":"#REF!"},{"$error":"#REF!"},{"$f":"IF(AND(2150<H68,H68<=2500),1,0)","v":{"$error":"#REF!"}},{"$f":"IF(AND(1000<I68,I68<=2000),1,0)","v":{"$error":"#REF!"}},{"$error":"#REF!"}]
["К3",2800,1000,3800,"до  2800х1000","компл.",7245,{"$error":"#REF!"},{"$error":"#REF!"},{"$f":"IF(AND(2500<H69,H69<=2800),1,0)","v":{"$error":"#REF!"}},{"$f":"IF(I69<=1000,1,0)","v":{"$error":"#REF!"}},{"$error":"#REF!"}]
["К3",2800,2000,4800,"до  2800х2000","компл.",8450,{"$error":"#REF!"},{"$error":"#REF!"},{"$f":"IF(AND(2500<H70,H70<=2800),1,G71)","v":{"$error":"#REF!"}},{"$f":"IF(AND(1000<I70,I70<=2000),1,0)","v":{"$error":"#REF!"}},{"$error":"#REF!"}]
[null,null,null,null,null,null,null,null,null,{"$f":"IF(H70>B70,1,0)","v":{"$error":"#REF!"}},{"$f":"IF(I69<=1000,1,0)","v":{"$error":"#REF!"}},{"$f":"IF(AND(J71=1,K71=1),G69,0)","v":{"$error":"#REF!"}}]
[null,null,null,null,null,null,null,null,null,{"$f":"IF(H70>B70,1,0)","v":{"$error":"#REF!"}},{"$f":"IF(AND(1000<I70,I70<=2000),1,0)","v":{"$error":"#REF!"}},{"$f":"IF(AND(J72=1,K72=1),G70,0)","v":{"$error":"#REF!"}}]
[]
[1,{"$f":"IF(A61=A74,L74,0)","v":{"$error":"#REF!"}},null,null,null,null,null,null,null,null,null,{"$f":"SUM(L65:L73)","v":{"$error":"#REF!"}}]
[]
[]
[null,null,null,null,"Размер по проему: (высота х ширина)"," Ед.изм.","Цена/руб."]
["К4",2150,1000,{"$f":"B78+C78","v":3150},"до  2150х1000","компл.",4725,{"$f":"B61","v":{"$error":"#REF!"}},{"$f":"C61","v":{"$error":"#REF!"}},{"$f":"IF(H78<=B78,1,0)","v":{"$error":"#REF!"}},{"$f":"IF(I78<=1000,1,0)","v":{"$error":"#REF!"}},{"$f":"IF(AND(J78=1,K78=1),G78,0)","v":{"$error":"#REF!"}}]
["К4",2150,2000,4150,"до  2150х2000","компл.",5910,{"$f":"H78","v":{"$error":"#REF!"}},{"$error":"#REF!"},{"$f":"IF(H79<=B79,1,0)","v":{"$error":"#REF!"}},{"$f":"IF(AND(1000<I79,I79<=2000),1,0)","v":{"$error":"#REF!"}},{"$error":"#REF!"}]
["К4",2500,1000,3500,"до  2500х1000","компл.",5910,{"$error":"#REF!"},{"$error":"#REF!"},{"$f":"IF(AND(2150<H80,H80<=2500),1,0)","v":{"$error":"#REF!"}},{"$f":"IF(I80<=1000,1,0)","v":{"$error":"#REF!"}},{"$error":"#REF!"}]
["К4",2500,2000,4500,"до  2500х2000","компл.",7090,{"$error":"#REF!"},{"$error":"#REF!"},{"$f":"IF(AND(2150<H81,H81<=2500),1,0)","v":{"$error":"#REF!"}},{"$f":"IF(AND(1000<I81,I81<=2000),1,0)","v":{"$error":"#REF!"}},{"$error":"#REF!"}]
["К4",2800,1000,3800,"до  2800х1000","компл.",7090,{"$error":"#REF!"},{"$error":"#REF!"},{"$f":"IF(AND(2500<H82,H82<=2800),1,0)","v":{"$error":"#REF!"}},{"$f":"IF(I82<=1000,1,0)","v":{"$error":"#REF!"}},{"$error":"#REF!"}]
["К4",2800,2000,4800,"до  2800х2000","компл.",8265,{"$error":"#REF!"},{"$error":"#REF!"},{"$f":"IF(AND(2500<H83,H83<=2800),1,G84)","v":{"$error":"#REF!"}},{"$f":"IF(AND(1000<I83,I83<=2000),1,0)","v":{"$error":"#REF!"}},{"$error":"#REF!"}]
[null,null,null,null,null,null,null,null,null,{"$f":"IF(H83>B83,1,0)","v":{"$error":"#REF!"}},{"$f":"IF(I82<=1000,1,0)","v":{"$error":"#REF!"}},{"$f":"IF(AND(J84=1,K84=1),G82,0)","v":{"$error":"#REF!"}}]
[null,null,null,null,null,null,null,null,null,{"$f":"IF(H83>B83,1,0)","v":{"$error":"#REF!"}},{"$f":"IF(AND(1000<I83,I83<=2000),1,0)","v":{"$error":"#REF!"}},{"$f":"IF(AND(J85=1,K85=1),G83,0)","v":{"$error":"#REF!"}}]
[]
[2,{"$f":"IF(A61=A87,L87,0)","v":{"$error":"#REF!"}},null,null,null,null,null,null,null,null,null,{"$f":"SUM(L78:L86)","v":{"$error":"#REF!"}}]
[]
["К3",2500,1000,50,"  до   2500х1000","компл.",1500,{"$f":"B61","v":{"$error":"#REF!"}},{"$f":"C61","v":{"$error":"#REF!"}},{"$f":"IF(H89<=B89,1,0)","v":{"$error":"#REF!"}},{"$f":"IF(I89<=1000,1,0)","v":{"$error":"#REF!"}},{"$f":"IF(AND(J89=1,K89=1),G89,0)","v":{"$error":"#REF!"}}]
["К3",2500,2000,50,"  до   2500х2000","компл.",1790,{"$f":"H89","v":{"$error":"#REF!"}},{"$error":"#REF!"},{"$f":"IF(H90<=B90,1,0)","v":{"$error":"#REF!"}},{"$f":"IF(AND(1000<I90,I90<=2000),1,0)","v":{"$error":"#REF!"}},{"$f":"IF(AND(J90=1,K90=1),G90,0)","v":{"$error":"#REF!"}}]
["К3",2800,1000,50,"  до   2800х1000","компл.",1790,{"$error":"#REF!"},{"$error":"#REF!"},{"$f":"IF(AND(2500<H91,H91<=2800),1,0)","v":{"$error":"#REF!"}},{"$f":"IF(I91<=1000,1,0)","v":{"$error":"#REF!"}},{"$f":"IF(AND(J91=1,K91=1),G91,0)","v":{"$error":"#REF!"}}]
["К3",2800,2000,50,"  до   2800х2000","компл.",2140,{"$error":"#REF!"},{"$error":"#REF!"},{"$f":"IF(AND(2500<H92,H92<=2800),1,0)","v":{"$error":"#REF!"}},{"$f":"IF(AND(1000<I92,I92<=2000),1,0)","v":{"$error":"#REF!"}},{"$f":"IF(AND(J92=1,K92=1),G92,0)","v":{"$error":"#REF!"}}]
[null,null,null,null,null,null,null,null,null,{"$f":"IF(H92>B92,1,0)","v":{"$error":"#REF!"}},{"$f":"IF(I91<=1000,1,0)","v":{"$error":"#REF!"}},{"$f":"IF(AND(J93=1,K93=1),G92,0)","v":{"$error":"#REF!"}}]
[null,null,null,null,null,null,null,null,null,{"$f":"IF(H92>B92,1,0)","v":{"$error":"#REF!"}},{"$f":"IF(AND(1000<I92,I92<=2000),1,0)","v":{"$error":"#REF!"}},{"$f":"IF(AND(J94=1,K94=1),G92,0)","v":{"$error":"#REF!"}}]
[]
[1,{"$f":"IF(A61=A96,L96,0)","v":{"$error":"#REF!"}},null,null,null,null,null,null,null,null,null,{"$f":"SUM(L89:L95)","v":{"$error":"#REF!"}}]
[]
["К3",2500,1000,80,"  до   2500х1000","компл.",1790,{"$f":"B61","v":{"$error":"#REF!"}},{"$f":"C61","v":{"$error":"#REF!"}},{"$f":"IF(H98<=B98,1,0)","v":{"$error":"#REF!"}},{"$f":"IF(I98<=1000,1,0)","v":{"$error":"#REF!"}},{"$f":"IF(AND(J98=1,K98=1),G98,0)","v":{"$error":"#REF!"}}]
["К3",2500,2000,80,"  до   2500х2000","компл.",2140,{"$f":"H98","v":{"$error":"#REF!"}},{"$error":"#REF!"},{"$f":"IF(H99<=B99,1,0)","v":{"$error":"#REF!"}},{"$f":"IF(AND(1000<I99,I99<=2000),1,0)","v":{"$error":"#REF!"}},{"$f":"IF(AND(J99=1,K99=1),G99,0)","v":{"$error":"#REF!"}}]
["К3",2800,1000,80,"  до   2800х1000","компл.",2100,{"$error":"#REF!"},{"$error":"#REF!"},{"$f":"IF(AND(2500<H100,H100<=2800),1,0)","v":{"$error":"#REF!"}},{"$f":"IF(I100<=1000,1,0)","v":{"$error":"#REF!"}},{"$f":"IF(AND(J100=1,K100=1),G100,0)","v":{"$error":"#REF!"}}]
["К3",2800,2000,80,"  до   2800х2000","компл.",2520,{"$error":"#REF!"},{"$error":"#REF!"},{"$f":"IF(AND(2500<H101,H101<=2800),1,0)","v":{"$error":"#REF!"}},{"$f":"IF(AND(1000<I101,I101<=2000),1,0)","v":{"$error":"#REF!"}},{"$f":"IF(AND(J101=1,K101=1),G101,0)","v":{"$error":"#REF!"}}]
["К3",null,null,null,null,null,null,null,null,{"$f":"IF(H101>B101,1,0)","v":{"$error":"#REF!"}},{"$f":"IF(I100<=1000,1,0)","v":{"$error":"#REF!"}},{"$f":"IF(AND(J102=1,K102=1),G101,0)","v":{"$error":"#REF!"}}]
[null,null,null,null,null,null,null,null,null,{"$f":"IF(H101>B101,1,0)","v":{"$error":"#REF!"}},{"$f":"IF(AND(1000<I101,I101<=2000),1,0)","v":{"$error":"#REF!"}},{"$f":"IF(AND(J103=1,K103=1),G101,0)","v":{"$error":"#REF!"}}]
[]
[1,{"$f":"IF(A61=A105,L105,0)","v":{"$error":"#REF!"}},null,null,null,null,null,null,null,null,null,{"$f":"SUM(L98:L104)","v":{"$error":"#REF!"}}]
[]
[]
["Толщина дверного проема",{"$f":"D61","v":{"$error":"#REF!"}}]
["добор 80 мм",{"$f":"INT((B108-120)/80)","v":{"$error":"#REF!"}}]
["добор 50 мм",0]
["Остаток",{"$f":"(B108-120)-B109*80","v":{"$error":"#REF!"}}]
[]
["Необходимое количество"]
["добор 80 мм",{"$f":"IF(B111>50,B109+1,B109)","v":{"$error":"#REF!"}}]
["добор 50 мм",{"$f":"IF(AND(1<B111,B111<=50),B110+1,B110)","v":{"$error":"#REF!"}}]
[]
[1,{"$f":"IF(A61=A117,L117,0)","v":{"$error":"#REF!"}},null,null,null,null,null,null,null,null,null,{"$f":"B114","v":{"$error":"#REF!"}}]
[1,{"$f":"IF(A61=A118,L118,0)","v":{"$error":"#REF!"}},null,null,null,null,null,null,null,null,null,{"$f":"B115","v":{"$error":"#REF!"}}]
[]
[{"$f":"Лист2!#REF!","v":{"$error":"#REF!"}},{"$f":"Лист2!#REF!","v":{"$error":"#REF!"}},{"$f":"Лист2!#REF!","v":{"$error":"#REF!"}},{"$f":"Лист2!#REF!","v":{"$error":"#REF!"}},{"$f":"B133+B146","v":{"$error":"#REF!"}},1,{"$f":"F120*E120","v":{"$error":"#REF!"}},{"$f":"B177","v":{"$error":"#REF!"}},{"$f":"B176","v":{"$error":"#REF!"}},{"$f":"B155","v":{"$error":"#REF!"}},{"$f":"B164","v":{"$error":"#REF!"}},{"$f":"H120*J120+I120*K120","v":{"$error":"#REF!"}},{"$f":"G120+L120","v":{"$error":"#REF!"}}]
{"$rows_left_out":225}