{"text_format":"1","workbook":"xlsx","n_sheets":2,"sheets":["Sheet2","Наша база"],"not_rendered":{"charts":0,"images":0,"macros":1,"external_links":0,"defined_names":1,"comments":0,"pivot_tables":0},"unopened":[],"bounds":{"document_bytes":16777216,"sheet_cells":100000,"rows_first":2000,"rows_last":500,"rows_between":2000,"halvings":0,"cell_chars":16384,"cell_head_chars":4096},"cells_cut":0,"cells_raw":0,"read":"whole","date_system":"1900"}

{"sheet":"Sheet2","index":0,"n_rows":22,"n_cols":7,"rows_kept":22,"cut":false,"hidden":false,"merged":[[0,0,0,1],[0,2,0,6]]}
["ИСКОМЫЕ ЗНАЧЕНИЯ",null,"РЕЗУЛЬТАТ"]
["Ниаменование","Адрес","строка","стравнение","Код в нашей базе","Наименование в нашей базе","Адрес в нашей базе"]
["ООО \"ЛЕКА-ФАРМ\"","Санкт-Петербург г, Чайковского ул, д.50",{"$f":" FindBestMatchTxt(B3,'Наша база'!$C$2:$C$529, 100%)","v":357},{"$f":" TextSimilarity(B3, G3, , 1)","v":1},{"$f":" IF( C3 > 0, INDEX('Наша база'!$A$2:$A$529, C3), \"нет кода\" )","v":"20259"},{"$f":" IF( C3 > 0, INDEX('Наша база'!$B$2:$B$529, C3), \"нет\" )","v":"ООО \"Эфа\" г. Санкт-Петербург"},{"$f":" IF( C3 > 0, INDEX('Наша база'!$C$2:$C$529, C3), \"нет договора\" )","v":"191028, г. Санкт-Петербург, ул. Чайковского, д.25"}]
["ООО \"ЛЕКА-ФАРМ\"","197183, Санкт-Петербург г, Савушкина ул, д.128",{"$f":" FindBestMatchTxt(B4,'Наша база'!$C$2:$C$529, 100%)","v":91},{"$f":" TextSimilarity(B4, G4, , 1)","v":1},{"$f":" IF( C4 > 0, INDEX('Наша база'!$A$2:$A$529, C4), \"нет кода\" )","v":"2077"},{"$f":" IF( C4 > 0, INDEX('Наша база'!$B$2:$B$529, C4), \"нет\" )","v":"ООО\"Стома-2\" г. Санкт-Петербург"},{"$f":" IF( C4 > 0, INDEX('Наша база'!$C$2:$C$529, C4), \"нет договора\" )","v":"198320, г. Санкт-Петербург, ул. Савушкина, д.135"}]
["ООО \"ЛЕКА-ФАРМ\"","197227, Санкт-Петербург г, Гаккелевская ул, д.33А, корп.1",{"$f":" FindBestMatchTxt(B5,'Наша база'!$C$2:$C$529, 100%)","v":0},9.5238095238095233E-2,{"$f":" IF( C5 > 0, INDEX('Наша база'!$A$2:$A$529, C5), \"нет кода\" )","v":"нет кода"},{"$f":" IF( C5 > 0, INDEX('Наша база'!$B$2:$B$529, C5), \"нет\" )","v":"нет"},{"$f":" IF( C5 > 0, INDEX('Наша база'!$C$2:$C$529, C5), \"нет договора\" )","v":"нет договора"}]
["ООО \"ЛАБОРАТОРИЯ ЗДОРОВЬЯ\" ДВАДЦАТЬ ПЕРВЫЙ ВЕК\"","194044, Санкт-Петербург г, Сампсониевский Б. пр-кт, д.45",{"$f":" FindBestMatchTxt(B6,'Наша база'!$C$2:$C$529, 100%)","v":253},1,{"$f":" IF( C6 > 0, INDEX('Наша база'!$A$2:$A$529, C6), \"нет кода\" )","v":"78-20366"},{"$f":" IF( C6 > 0, INDEX('Наша база'!$B$2:$B$529, C6), \"нет\" )","v":"ООО \"Лаборатория здоровья \"ХХ I век\""},{"$f":" IF( C6 > 0, INDEX('Наша база'!$C$2:$C$529, C6), \"нет договора\" )","v":"194044, г. Санкт-Петербург, Сампсониевский Б. пр-кт., д.45"}]
["ООО \"БалтЗдрав\"","198095, Санкт-Петербург г, Маршала Говорова ул, д.37",{"$f":" FindBestMatchTxt(B7,'Наша база'!$C$2:$C$529, 100%)","v":311},1,{"$f":" IF( C7 > 0, INDEX('Наша база'!$A$2:$A$529, C7), \"нет кода\" )","v":"20391"},{"$f":" IF( C7 > 0, INDEX('Наша база'!$B$2:$B$529, C7), \"нет\" )","v":"ДОГОВОР ЗАКРЫТ  - ООО \"БалтЗдрав\" г. Санкт-Петербург"},{"$f":" IF( C7 > 0, INDEX('Наша база'!$C$2:$C$529, C7), \"нет договора\" )","v":"097022, г. Санкт-Петербург, ул. Маршала Говорова, д.37"}]
["ООО \"БалтЗдрав на Говорова\"","198095, Санкт-Петербург г, Маршала Говорова ул, д.37, корп.2",{"$f":" FindBestMatchTxt(B8,'Наша база'!$C$2:$C$529, 100%)","v":347},1,{"$f":" IF( C8 > 0, INDEX('Наша база'!$A$2:$A$529, C8), \"нет кода\" )","v":"20127"},{"$f":" IF( C8 > 0, INDEX('Наша база'!$B$2:$B$529, C8), \"нет\" )","v":"ООО \"БалтЗдрав на Говорова\""},{"$f":" IF( C8 > 0, INDEX('Наша база'!$C$2:$C$529, C8), \"нет договора\" )","v":"191028, г. Санкт-Петербург, ул. Маршала Говорова, д.37, корп 2"}]
["ООО \"БалтЗдрав на Дыбенко\"","193232, Санкт-Петербург г, Дыбенко ул, д.25, корп.1",{"$f":" FindBestMatchTxt(B9,'Наша база'!$C$2:$C$529, 100%)","v":346},1,{"$f":" IF( C9 > 0, INDEX('Наша база'!$A$2:$A$529, C9), \"нет кода\" )","v":"20126"},{"$f":" IF( C9 > 0, INDEX('Наша база'!$B$2:$B$529, C9), \"нет\" )","v":"ООО \"БалтЗдрав на Дыбенко\" (г. Санкт-Петербург)"},{"$f":" IF( C9 > 0, INDEX('Наша база'!$C$2:$C$529, C9), \"нет договора\" )","v":"197762, г. Санкт-Петербург, ул. Дыбенко, д.25, корп.1"}]
["УЧРЕЖДЕНИЕ РОССИЙСКОЙ АКАДЕМИИ НАУК \"ПОЛИКЛИНИКА № 1 РАН\"","199034, Санкт-Петербург г, Университетская наб, д.5",{"$f":" FindBestMatchTxt(B10,'Наша база'!$C$2:$C$529, 100%)","v":312},1,{"$f":" IF( C10 > 0, INDEX('Наша база'!$A$2:$A$529, C10), \"нет кода\" )","v":"20088"},{"$f":" IF( C10 > 0, INDEX('Наша база'!$B$2:$B$529, C10), \"нет\" )","v":"Поликлиника №1 РАН (г.Санкт-Петербург)"},{"$f":" IF( C10 > 0, INDEX('Наша база'!$C$2:$C$529, C10), \"нет договора\" )","v":"199034, г. Санкт-Петербург, Университетская наб., д.5"}]
["ООО \"МЦ \"ОЛМЕД\"","191036, Санкт-Петербург г, Советская 5-я ул, д.23",{"$f":" FindBestMatchTxt(B11,'Наша база'!$C$2:$C$529, 100%)","v":15},1,{"$f":" IF( C11 > 0, INDEX('Наша база'!$A$2:$A$529, C11), \"нет кода\" )","v":"2029"},{"$f":" IF( C11 > 0, INDEX('Наша база'!$B$2:$B$529, C11), \"нет\" )","v":"ОУ \"ЛДЦ  МИБС\" г. Санкт-Петербург"},{"$f":" IF( C11 > 0, INDEX('Наша база'!$C$2:$C$529, C11), \"нет договора\" )","v":"191144, г. Санкт-Петербург, ул. Советская 6-я, д.24-26"}]
["ООО \"ПОЛИКЛИНИКА АЛЕКСАНДРОВСКОГО ЗАВОДА\"","192171, Санкт-Петербург г, Дудко ул, д.8",{"$f":" FindBestMatchTxt(B12,'Наша база'!$C$2:$C$529, 100%)","v":0},6.9767441860465115E-2,{"$f":" IF( C12 > 0, INDEX('Наша база'!$A$2:$A$529, C12), \"нет кода\" )","v":"нет кода"},{"$f":" IF( C12 > 0, INDEX('Наша база'!$B$2:$B$529, C12), \"нет\" )","v":"нет"},{"$f":" IF( C12 > 0, INDEX('Наша база'!$C$2:$C$529, C12), \"нет договора\" )","v":"нет договора"}]
["ООО \"МЕДСЕРВИС\" (МЦ АПЕЛЬСИН)","190020, Санкт-Петербург г, Старо-Петергофский пр-кт, д.39а",{"$f":" FindBestMatchTxt(B13,'Наша база'!$C$2:$C$529, 100%)","v":0},8.9552238805970144E-2,{"$f":" IF( C13 > 0, INDEX('Наша база'!$A$2:$A$529, C13), \"нет кода\" )","v":"нет кода"},{"$f":" IF( C13 > 0, INDEX('Наша база'!$B$2:$B$529, C13), \"нет\" )","v":"нет"},{"$f":" IF( C13 > 0, INDEX('Наша база'!$C$2:$C$529, C13), \"нет договора\" )","v":"нет договора"}]
["СПБ ГУП \"ПАССАЖИРАВТОТРАНС\"","195009, Санкт-Петербург г, Комсомола ул, д.12",{"$f":" FindBestMatchTxt(B14,'Наша база'!$C$2:$C$529, 100%)","v":37},1,{"$f":" IF( C14 > 0, INDEX('Наша база'!$A$2:$A$529, C14), \"нет кода\" )","v":"2095"},{"$f":" IF( C14 > 0, INDEX('Наша база'!$B$2:$B$529, C14), \"нет\" )","v":"ООО \"АБА\" г.Санкт-Петербург"},{"$f":" IF( C14 > 0, INDEX('Наша база'!$C$2:$C$529, C14), \"нет договора\" )","v":"195009, г. Санкт-Петербург, ул. Комсомола, д.14"}]
["ОАО \"Авиакомпания \"Россия\"","196210, Санкт-Петербург г, Пилотов ул, д.31а",{"$f":" FindBestMatchTxt(B15,'Наша база'!$C$2:$C$529, 100%)","v":0},0.1276595744680851,{"$f":" IF( C15 > 0, INDEX('Наша база'!$A$2:$A$529, C15), \"нет кода\" )","v":"нет кода"},{"$f":" IF( C15 > 0, INDEX('Наша база'!$B$2:$B$529, C15), \"нет\" )","v":"нет"},{"$f":" IF( C15 > 0, INDEX('Наша база'!$C$2:$C$529, C15), \"нет договора\" )","v":"нет договора"}]
["ООО \"ЛЕКА-ФАРМ\"","197183, Санкт-Петербург г, Савушкина ул, д.128",{"$f":" FindBestMatchTxt(B16,'Наша база'!$C$2:$C$529, 100%)","v":91},1,{"$f":" IF( C16 > 0, INDEX('Наша база'!$A$2:$A$529, C16), \"нет кода\" )","v":"2077"},{"$f":" IF( C16 > 0, INDEX('Наша база'!$B$2:$B$529, C16), \"нет\" )","v":"ООО\"Стома-2\" г. Санкт-Петербург"},{"$f":" IF( C16 > 0, INDEX('Наша база'!$C$2:$C$529, C16), \"нет договора\" )","v":"198320, г. Санкт-Петербург, ул. Савушкина, д.135"}]
["ФГБ ВОУ ВПО \"Военно-медицинская академия имени С.М.Кирова\" Минобороны РФ","Санкт-Петербург г, Боткинская ул, д.17",{"$f":" FindBestMatchTxt(B17,'Наша база'!$C$2:$C$529, 100%)","v":0},5.6603773584905662E-2,{"$f":" IF( C17 > 0, INDEX('Наша база'!$A$2:$A$529, C17), \"нет кода\" )","v":"нет кода"},{"$f":" IF( C17 > 0, INDEX('Наша база'!$B$2:$B$529, C17), \"нет\" )","v":"нет"},{"$f":" IF( C17 > 0, INDEX('Наша база'!$C$2:$C$529, C17), \"нет договора\" )","v":"нет договора"}]
["ООО \"ЛЕКА-ФАРМ\"","197227, Санкт-Петербург г, Гаккелевская ул, д.33А, корп.1",{"$f":" FindBestMatchTxt(B18,'Наша база'!$C$2:$C$529, 100%)","v":0},9.5238095238095233E-2,{"$f":" IF( C18 > 0, INDEX('Наша база'!$A$2:$A$529, C18), \"нет кода\" )","v":"нет кода"},{"$f":" IF( C18 > 0, INDEX('Наша база'!$B$2:$B$529, C18), \"нет\" )","v":"нет"},{"$f":" IF( C18 > 0, INDEX('Наша база'!$C$2:$C$529, C18), \"нет договора\" )","v":"нет договора"}]
["ФГБ ВОУ ВПО \"Военно-медицинская академия имени С.М.Кирова\" Минобороны РФ","Санкт-Петербург г, Боткинская ул, д.23",{"$f":" FindBestMatchTxt(B19,'Наша база'!$C$2:$C$529, 100%)","v":0},5.6603773584905662E-2,{"$f":" IF( C19 > 0, INDEX('Наша база'!$A$2:$A$529, C19), \"нет кода\" )","v":"нет кода"},{"$f":" IF( C19 > 0, INDEX('Наша база'!$B$2:$B$529, C19), \"нет\" )","v":"нет"},{"$f":" IF( C19 > 0, INDEX('Наша база'!$C$2:$C$529, C19), \"нет договора\" )","v":"нет договора"}]
["ФГБ ВОУ ВПО \"Военно-медицинская академия имени С.М.Кирова\" Минобороны РФ","Санкт-Петербург г, Академика Лебедева ул, д.37",{"$f":" FindBestMatchTxt(B20,'Наша база'!$C$2:$C$529, 100%)","v":90},1,{"$f":" IF( C20 > 0, INDEX('Наша база'!$A$2:$A$529, C20), \"нет кода\" )","v":"2072"},{"$f":" IF( C20 > 0, INDEX('Наша база'!$B$2:$B$529, C20), \"нет\" )","v":"ФГУЗ ВЦЭРМ им. А.М. Никифорова МЧС России г. Санкт-Петербург"},{"$f":" IF( C20 > 0, INDEX('Наша база'!$C$2:$C$529, C20), \"нет договора\" )","v":"194044, г. Санкт-Петербург, ул. Академика Лебедева, д.4/2"}]
["ООО \"ЕМС\"","196070, Санкт-Петербург г, Победы ул, д.17",{"$f":" FindBestMatchTxt(B21,'Наша база'!$C$2:$C$529, 100%)","v":0},6.6666666666666666E-2,{"$f":" IF( C21 > 0, INDEX('Наша база'!$A$2:$A$529, C21), \"нет кода\" )","v":"нет кода"},{"$f":" IF( C21 > 0, INDEX('Наша база'!$B$2:$B$529, C21), \"нет\" )","v":"нет"},{"$f":" IF( C21 > 0, INDEX('Наша база'!$C$2:$C$529, C21), \"нет договора\" )","v":"нет договора"}]
["ОАО \"БАЛТИЙСКИЙ ЗАВОД \"ФИЛИАЛ \"Медико-санитарная часть № 3\"","199026, САНКТ-ПЕТЕРБУРГ Г, КОСАЯ ЛИНИЯ, Д.5",{"$f":" FindBestMatchTxt(B22,'Наша база'!$C$2:$C$529, 100%)","v":43},1,{"$f":" IF( C22 > 0, INDEX('Наша база'!$A$2:$A$529, C22), \"нет кода\" )","v":"2049"},{"$f":" IF( C22 > 0, INDEX('Наша база'!$B$2:$B$529, C22), \"нет\" )","v":"30.06.2013  -ДОГОВОР ЗАКРЫТ -  Филиал ОАО \"Балтийский завод\" \"МСЧ N3\"г. Санкт-Петербург"},{"$f":" IF( C22 > 0, INDEX('Наша база'!$C$2:$C$529, C22), \"нет договора\" )","v":"199026, г. Санкт-Петербург, Косая линия., д.5"}]

{"sheet":"Наша база","index":1,"n_rows":529,"n_cols":3,"rows_kept":529,"cut":false,"hidden":false,"merged":[]}
["Код ЛПУ","Наименование территориального отделения","Адрес территориального отделения"]
["2015","СПб ГБУЗ \"Детская городская больница № 1\" г.Санкт-Петербург","198205, г. Санкт-Петербург, ул. Авангардная, д.14"]
["2011","ООО \"Лайф\" (Санкт-Петербург)","193317, г. Санкт-Петербург, Александра Невского пл., д.2"]
["2027","ООО\"Дункан\" г. Санкт-Петербург","194156, г. Санкт-Петербург, ул. Земледельческая, д.2"]
["2030","СПб ГУЗ \"КДЦ № 85\" г. Санкт-Петербург","198510, г. Санкт-Петербург, Стачек пр-кт., д.59, корп.3"]
["2044","НУЗ \"Дорожная поликлиника ОАО\"РЖД\" г. Санкт-Петербург","192007, г. Санкт-Петербург, ул. Боровая, д.55"]
["2078","ООО \"Институт здоровья человека\" г. Санкт-Петерург","197110, г. Санкт-Петербург, Динамо пр-кт., д.3"]
["2028","ООО\"Астра\" г. Санкт-Петербург","191186, г. Санкт-Петербург, Реки Мойки наб., д.51"]
["2052","ООО \"Стома\" г. Санкт-Петербург","197136, г. Санкт-Петербург, 26-я линия., д.15, корп.2, лит.А"]
["2068","СПб ГУЗ \"Родильный дом №9\" (Санкт-Петербург)","196158, г. Санкт-Петербург, ул. Орджоникидзе, д.47"]
["2066","ООО\"А и В\" г. Санкт-Петербург","193167, г. Санкт-Петербург, Невский пр-кт., д.173"]
["2058","ООО \"Стома- 1\" г. Санкт-Петербург","197198, г. Санкт-Петербург, ул. Блохина, д.33"]
["2074","ЗАО \"Фирма \"ЮЛАНД\" г. Санкт-Петербург","191104, г. Санкт-Петербург, ул. Чехова, д.4"]
["2075","СПб клиническая больница РАН г. Санкт-Петербург","194017, г. Санкт-Петербург, Тореза пр-кт., д.72"]
["2081","СПб ГБУЗ \"Городская Александровская больница\" г. Санкт-Петербург","193312, г. Санкт-Петербург, Солидарности пр-кт., д.4"]
["2029","ОУ \"ЛДЦ  МИБС\" г. Санкт-Петербург","191144, г. Санкт-Петербург, ул. Советская 6-я, д.24-26"]
["2055","СПб ГУЗ «Детская городская больница №19 им. К.А. Раухфуса» г. Санкт-Петербург","193036, г. Санкт-Петербург, Суворовский пр-кт., д.4, корп.лит.А"]
["2024","СПб ГУЗ Городская Больница Святого  Великомученика Георгия ","194354, г. Санкт-Петербург, Северный пр-кт., д.1"]
["2036","ООО Научно-производственное предприятие \"ИммуноБиоСервис\" г. Санкт-Петербург","199034, г. Санкт-Петербург, Московское ш., д.30, корп.2, лит. А"]
["2031","ФГБУ НИИ акушерства и гинекологии им. Д.О.Отта СЗО РАМН г.Санкт-Петербург","199034, г. Санкт-Петербург, Менделеевская линия., д.3"]
["2021","СПБ ГУЗ \"Городская многопрофильная больница №2\" (Санкт-Петербург)","194354, г. Санкт-Петербург, Учебный пер., д.5"]
["2059","ООО\"Стома плюс\" г. Санкт-Петербург","197198, г. Санкт-Петербург, ул. Блохина, д.33 - НЕТ ТЕРРИТОРИАЛЬНОГО ОТДЕЛЕНИЯ"]
["2059","ООО\"Стома плюс\" г. Санкт-Петербург","194354, г. Санкт-Петербург, ул. Сикейроса, д.1 - НЕТ ТЕРРИТОРИАЛЬНОГО ОТДЕЛЕНИЯ"]
["2061","ГУЗ\"Детская городская больница №22\" г. Санкт-Петербург","196656, г. Санкт-Петербург, г. Колпино, Заводской пр-кт., д.1, "]
["2067","ООО\"Виктория\" г. Санкт-Петербург","192286, г. Санкт-Петербург, ул. Будапештская, д.66"]
["2084","ООО\"Стомадент\" (Санкт-Петербург)","197371, г. Санкт-Петербург, Комендантский пр-кт., д.25, корп.1"]
["2098","ДОГОВОР ЗАКРЫТ 01.05.2012 г. ООО \"Ассистанс-Экспресс\" г.Санкт-Петербург","194291, г. Санкт-Петербург, Культуры пр-кт., д.4"]
["2067","ООО\"Виктория\" г. Санкт-Петербург","197739, г. Санкт-Петербург, Ленинский пр-кт., д.133, корп.2"]
["2052","ООО \"Стома\" г. Санкт-Петербург","197136, г. Санкт-Петербург, ул. Ленина, д.22  "]
["2052","ООО \"Стома\" г. Санкт-Петербург","197198, г. Санкт-Петербург, ул. Блохина, д.33 - НЕТ ТЕРРИТОРИАЛЬНОГО ОТДЕЛЕНИЯ"]
["2087","ООО \"Лечебно-диагностический центр \"Светлановский\" г. Санкт-Петербург","194156, г. Санкт-Петербург, Энгельса пр-кт., д.27"]
["2008","ДОГОВОР ЗАКРЫТ- 09.06.2011г.см.код 20390 СПКК ФГУ \"НХМЦ им. Н.И. Пирогова\" Минздравсоцразвития России г.Санкт-Петербург","190103, г. Санкт-Петербург, Реки Фонтанки наб., д.154"]
["2091","ООО \"Астра-2\" г. Санкт-Петербург","190103, г. Санкт-Петербург, ул. Красноармейская 8-я, д.3"]
["2035","ЗАО \"Меди\" г. Санкт-Петербург","197738, г. Санкт-Петербург, Чкаловский пр-кт., д.35"]
["2035","НЕТ ТЕРРИТОРИАЛЬНОГО ОТДЕЛЕНИЯ-ЗАО \"Меди\" г. Санкт-Петербург","НЕТ ТЕРРИТОРИАЛЬНОГО ОТДЕЛЕНИЯ - , г. Санкт-Петербург, ул. Советская 10-я, д.13"]
["20005","СПб ГБУЗ \"Городская Покровская больница\" г.Санкт-Петербург","199106, г. Санкт-Петербург, Большой ВО пр-кт., д.85"]
["78-20353","ООО \"Ришар\" г. Санкт-Петербург","194295, г. Санкт-Петербург, Просвещения пр-кт., д.33, корп.2, лит А"]
["2095","ООО \"АБА\" г.Санкт-Петербург","195009, г. Санкт-Петербург, ул. Комсомола, д.14"]
["20018","ООО \"Медика\" г. Санкт-Петербург","199226, г. Санкт-Петербург, ул. Нахимова, д.11, литер. А, пом. 67Н"]
["2007","СПб ГУЗ \"Городская поликлиника №40\" (Санкт-Петербург)","191025, г. Санкт-Петербург, Невский пр-кт., д.86"]
["2027","ООО\"Дункан\" г. Санкт-Петербург","195030, г. Санкт-Петербург, ул. Коммуны, д.32, корп.1, лит.А"]
["2027","ООО\"Дункан\" г. Санкт-Петербург","197371, г. Санкт-Петербург, ул. Шаврова, д.21"]
["2043","СПб ГУЗ \"Городская больница №38 им.Н.А.Семашко\" г. Санкт-Петербург","196601, г. Санкт-Петербург, г. Пушкин, ул. Госпитальная, д.5/7"]
["2049","30.06.2013  -ДОГОВОР ЗАКРЫТ -  Филиал ОАО \"Балтийский завод\" \"МСЧ N3\"г. Санкт-Петербург","199026, г. Санкт-Петербург, Косая линия., д.5"]
["20012","ГУЗ \"Родильный дом №10\" г. Санкт-Петербург","198259, г. Санкт-Петербург, ул. Тамбасова, д.21, литер. А"]
["2073","ООО\"Форум Интернэшнл Технолоджи\" г. Санкт-Петербург","190000, г. Санкт-Петербург, Морская наб., д.57, офис 18 Н"]
["2079","ООО Медицинское объединение \"ОНА\" г. Санкт-Петербург","195196, г. Санкт-Петербург, ул. Рижская, д.12"]
["20023","ООО \"АВА-ПЕТЕР\" (г. Санкт-Петербург)","194295, г. Санкт-Петербург, Художников пр-кт., д.24 НЕТ ТЕРРИТОРИАЛЬНОГО ОТДЕЛЕНИЯ, корп.1"]
["20025","ООО \"Аркадия\" (г.Санкт-Петербург)","190008, г. Санкт-Петербург, ул. Ломоносова, д.26"]
["2042","АНО \"Медицинский центр\"  XXI век\" г. Санкт-Петербург","196643, г. Санкт-Петербург, Сампсониевский Б. пр-кт., д.45, лит. А"]
["2034","ООО \"33 Зуб\" г. Санкт-Петербург","198332, г. Санкт-Петербург, Маршала Жукова пр-кт., д.33, корп.1 лит.А пом.6Н"]
["2052","ООО \"Стома сити\" г. Санкт-Петербург","г. Санкт-Петербург, Невский пр-кт., д.163 НЕТ ТЕРРИТОРИАЛЬНОГО ОТДЕЛЕНИЯ"]
["2052","ООО \"Стома\" г. Санкт-Петербург","194156, г. Санкт-Петербург, Театральная пл., д.6 - НЕТ ТЕРРИТОРИАЛЬНОГО ОТДЕЛЕНИЯ"]
["2052","ООО \"Стома\" г. Санкт-Петербург","194354, г. Санкт-Петербург, ул. Сикейроса, д.1  НЕТ ТЕРРИТОРИАЛЬНОГО ОТДЕЛЕНИЯ"]
["6604","ООО \"Стоматологическая поликлиника \"Шанс-плюс\" г. Великий Новгород","652373, Новгородская обл., Новгородский р-н., г. Великий Новгород, ул. Большая Санкт-Петербургская, д.9"]
["2063","ДОГОВОР ЗАКРЫТ - ФГБУ \"СПб НИИ ЛОР\" Минздрава России г. Санкт-Петербург","190013, г. Санкт-Петербург, ул. Бронницкая, д.9"]
["2004","ЕР сервис Петербургская неотложка (Санкт-Петербург)","191014, г. Санкт-Петербург, Басков пер., д.13-15, пом 28"]
["2013","ООО\"Ортодонтический центр \"ДентИдеал\" (Санкт-Петербург)","198013, г. Санкт-Петербург, Подъездной пер., д.3 лит.Б пом.5-Н"]
["2032","В СТАДИИ РАСТОРЖЕНИЯ 14.01.2014, см. код 20464 ЗАО \"Городской пародонтологический центр \"ПАКС\" г. Санкт-Петербург","191186, г. Санкт-Петербург, Добролюбова пр-кт., д.27"]
["2047","ДОГОВОР ЗАКРЫТ  - СПб ГБУЗ \"Поликлиника городская № 82 (гомеопатическая)\" г.Санкт-Петербург","191011, г. Санкт-Петербург, ул. Пражская, д.12"]
["2035","ЗАО \"Меди\" г. Санкт-Петербург","НЕТ ТЕРРИТОРИАЛЬНОГО ОТДЕЛЕНИЯ - , г. Санкт-Петербург, Московский пр-кт., д.72 "]
["2035","ЗАО \"Меди\" г. Санкт-Петербург","198320, г. Санкт-Петербург, Лиговский пр-кт., д.84/2"]
["20002","ЗАО \"Клиника доброго стоматолога\" г.Санкт-Петербург","197348, г. Санкт-Петербург, Коломяжское ш., д.20"]
["2052","ООО \"Стома\" г. Санкт-Петербург","196210, г. Санкт-Петербург, Коломяжское ш., д.26 - НЕТ ТЕРРИТОРИАЛЬНОГО ОТДЕЛЕНИЯ"]
["2030","СПб ГУЗ \"КДЦ № 85\" г. Санкт-Петербург","188511, г. Санкт-Петербург, ул. Лени Голикова, д.29, корп.4"]
["2082","ООО\"Ортодонтический центр \"Дент Идеал Плюс\" г. Санкт-Петербург","191014, г. Санкт-Петербург, Басков пер., д.18"]
["2030","СПб ГБУЗ \"КДЦ № 85\" г. Санкт-Петербург","198260, г. Санкт-Петербург, Ветеранов пр-кт., д.89, корп.3"]
["2096","ООО \"АБА-клиника\" г.Санкт-Петербург","195220, г. Санкт-Петербург, Гражданский пр-кт., д.36 лит.  А"]
["20004","ООО \"ПАНДЕНТ Плюс\" г. Санкт-Петербург","196066, г. Санкт-Петербург, ул. Типанова, д.4 лит. А, пом. 31-Н"]
["2006","СПб ГАУЗ \"Городская поликлиника № 81\" г. Санкт-Петербург","190000, г. Санкт-Петербург, Вознесенский пр-кт., д.19"]
["20025","ООО \"Аркадия\" (г.Санкт-Петербург)","191002, г. Санкт-Петербург, Загородный пр-кт., д.21-23, лит.А"]
["2089","Спб ГУЗ \"Детская городская клиническая больница №5 им. Н.Ф. Филатова\" г.Санкт-Петербург","192289, г. Санкт-Петербург, ул. Бухарестская, д.134"]
["2090","ООО \"Стоматологическая клиника \"Клуб Дентал\" г.Санкт-Петербург","190068, г. Санкт-Петербург, Бойцова пер., д.4"]
["20006","ООО \"33 Премиум\" г. Санкт-Петербург","194358, г. Санкт-Петербург, Просвещения пр-кт., д.30, корп.1 корп.А, пом. 14Н"]
["2057","ЛПУ \"Родильный дом №2\", Санкт-Петербург","191123, г. Санкт-Петербург, ул. Фурштатская, д.36а"]
["2069","В СТАДИИ ПЕРЕЗАКЛЮЧЕНИЕ - ГБОУ ВПО \"Первый Санкт-Петербургский государственный медицинский университет им академика И.П. Павлова\" Минздрава РФ г.Санкт-Петербург","197022, г. Санкт-Петербург, ул. Льва Толстого, д.7"]
["20019","ООО \"Доктор Дент\" г. Санкт-Петербург","191028, г. Санкт-Петербург, Литейный пр-кт., д.24, лит. А, пом. 3Н"]
["20016","ООО \"БалтМед гавань\" г. Санкт-Петербург","г. Санкт-Петербург, Галерный проезд., д.5"]
["20029","ООО \"МСЧ №157\" г. Санкт-Петербург","196066, г. Санкт-Петербург, ул. Варшавская, д.100, лит. А"]
["2052","ООО \"Стома\" г. Санкт-Петербург","188511, г. Санкт-Петербург, ул. Кораблестроителей, д.32/3 НЕТ ТЕРРИТОРИАЛЬНОГО ОТДЕЛЕНИЯ, корп.3"]
["20027","ООО \"Алев\" (Санкт-петербург)","194017, г. Санкт-Петербург, Энгельса пр-кт., д.58, лит. А, пом.50-Н"]
["20030","СПб ГУЗ \"ГКДЦ № 1\" г. Санкт-Петербург","194354, г. Санкт-Петербург, ул. Сикейроса, д.10"]
["20030","СПб ГУЗ \"ГКДЦ № 1\" г. Санкт-Петербург","194156, г. Санкт-Петербург, 2-ой Муринский пр-кт., д.9"]
["2071","ЗАО \"Поликлинический комплекс\" г. Санкт-Петербург","190013, г. Санкт-Петербург, Московский пр-кт., д.22"]
["2054","ГОУ  ВПО ГПМА, КДЦ г. Санкт-Петербург","194100, г. Санкт-Петербург, ул. Матросова, д.22"]
["2054","ГОУ  ВПО ГПМА, КДЦ г. Санкт-Петербург","194100, г. Санкт-Петербург, ул. Матросова, д.5"]
["20036","ООО \"ИНОДЕНТ\"  г. Санкт-Петербург","195257, г. Санкт-Петербург, Науки пр-кт., д.10, корп.1, лит.А, пом.11-Н"]
["20036","ООО \"ИНОДЕНТ\"  г. Санкт-Петербург","188512, г. Санкт-Петербург, Тореза пр-кт., д.72, лит.А, пом.21Н"]
["20037","ООО \"ИнВИТА\" г, Санкт-Петербург","191123, г. Санкт-Петербург, ул. Шпалерная, д.34"]
["2060","ООО\"ТАРИ\" г. Санкт-Петербург","191123, г. Санкт-Петербург, ул. Фурштатская, д.31"]
["2072","ФГУЗ ВЦЭРМ им. А.М. Никифорова МЧС России г. Санкт-Петербург","194044, г. Санкт-Петербург, ул. Академика Лебедева, д.4/2"]
["2077","ООО\"Стома-2\" г. Санкт-Петербург","198320, г. Санкт-Петербург, ул. Савушкина, д.135"]
["2083","ООО\"Стоматологическая фирма \"32\" г. Санкт-Петербург","194156, г. Санкт-Петербург, Энгельса пр-кт., д.34"]
["20007","ООО \"33 ЗУБ Люкс\" г. Санкт-Петербург","197227, г. Санкт-Петербург, Испытателей пр-кт., д.6, корп.1, лит.А, пом.19Н"]
["20008","ООО \"33 ЗУБ плюс\" г.Санкт-Петербург","197374, г. Санкт-Петербург, ул. Савушкина, д.125, корп.1, лит.А, кв.12"]
["20031","ООО \"ОксиСмайл\" г. Санкт-Петербург","197136, г. Санкт-Петербург, Большой ПС пр-кт., д.74"]
["2058","ООО \"Стома- 1\" г. Санкт-Петербург","197348, г. Санкт-Петербург, Коломяжский  пр-кт., д.26, корп.лит.А, кв.9"]
["2059","ООО\"Стома плюс\" г. Санкт-Петербург","196655, г. Санкт-Петербург, Богатырский пр-кт., д.25 - НЕТ ТЕРРИТОРИАЛЬНОГО ОТДЕЛЕНИЯ"]
["2059","ООО\"Стома плюс\" г. Санкт-Петербург","190000, г. Санкт-Петербург, Грибоедова Канала наб., д.107/6, лит. А"]
["2077","ООО\"Стома-2\" г. Санкт-Петербург","г. Санкт-Петербург, Невский пр-кт., д.163, НЕТ ТЕРРИТОРИАЛЬНОГО ОТДЕЛЕНИЯ"]
["2077","ООО\"Стома-2\" г. Санкт-Петербург","195009, г. Санкт-Петербург, Ленина пл., д.22, НЕТ ТЕРРИТОРИАЛЬНОГО ОТДЕЛЕНИЯ"]
["20014","ЗАО \"Дентал Палас\" (г. Санкт-Петербург)","197022, г. Санкт-Петербург, ул. Петропавловская, д.4, корп.9-Н"]
["20020","ЗАО \"Медицинский центр РАМИ\"","191014, г. Санкт-Петербург, ул. Кирочная, д.13"]
["2008","В СТАДИИ РАСТОРЖЕНИЯ 01.10.2011г.- СПКК ФГУ \"НХМЦ им. Н.И. Пирогова\" Минздравсоцразвития России г.Санкт-Петербург","199004, г. Санкт-Петербург, Кадетская линия., д.13, корп.15"]
["2097","ФГУ \"РНХИ им. проф. А.Л.Поленова\" Минздравсоцразвития России, Санкт-Петербург","191014, г. Санкт-Петербург, ул. Маяковского, д.12, лит.Р"]
["20048","ООО \"МЦ \"Олмед\", Санкт-Петербург","191036, г. Санкт-Петербург, ул. Советская 5-я, д.21-23"]
["2044","НУЗ \"Дорожная поликлиника ОАО\"РЖД\" г. Санкт-Петербург","173015, Новгородская обл., Новгородский р-н., г. Великий Новгород, Карла Маркса пр-кт., д.5а"]
["20023","ООО \"АВА-ПЕТЕР\" (г. Санкт-Петербург)","191104, г. Санкт-Петербург, Литейный пр-кт., д.55, лит А"]
["2022","CПБ ГУЗ \"Городская больница №31\" (Санкт-Петербург)","197110, г. Санкт-Петербург, Динамо пр-кт., д.3"]
["2030","СПб ГУЗ \"КДЦ № 85\" г. Санкт-Петербург","198260, г. Санкт-Петербург, Ветеранов пр-кт., д.89, корп.3"]
["2069","ГОУ ВПО  СПбГМУ им. И.П.Павлова Росздрава г. Санкт-Петербург","197022, г. Санкт-Петербург, ул. Льва Толстого, д.6/8"]
["2042","ООО \"МЦ\"  ЭХО\" г. Санкт-Петербург ","196070, г. Санкт-Петербург, ул. Бассейная, д.45, лит. А НЕТ ТЕРРИТ.ОТДЕЛЕНИЯ"]
["20030","СПб ГУЗ \"ГКДЦ № 1\" г. Санкт-Петербург","194354, г. Санкт-Петербург, ул. Сикейроса, д.10"]
["2079","ООО Медицинское объединение \"ОНА\" г. Санкт-Петербург","198013, г. Санкт-Петербург, Реки Фонтанки наб., д.110, лит.Б, корп.пом.8Н"]
["20049","ООО \"Медсанчасть №67\", Санкт-Петербург","198516, г. Санкт-Петербург, г. Петродворец, Санкт-Петербургский проезд., д.60"]
["20050","НУЗ \"Дорожная клиническая больница ОАО \"РЖД\", Санкт-Петербург","195271, г. Санкт-Петербург, Мечникова пр-кт., д.27"]
["20039","СПб ГУП \"Пассажиравтотранс\" Санкт-Петербург","195009, г. Санкт-Петербург, ул. Комсомола, д.12"]
["20066","ДОГОВОР ЗАКРЫТ ООО \"Корона-Люкс\" (СЦ \"Корона\"), Санкт-Петербург","198096, г. Санкт-Петербург, ул. Краснопутиловская, д.8"]
["20020","ЗАО \"Медицинский центр РАМИ\", Санкт-Петербург","193036, г. Санкт-Петербург, ул. Гончарная, д.20"]
["2035","ЗАО \"Меди\" г. Санкт-Петербург","196621, г. Санкт-Петербург, Московский пр-кт., д.79"]
{"$rows_left_out":409}