{"text_format":"1","workbook":"xlsx","n_sheets":3,"sheets":["Лист1","Лист2","свод"],"not_rendered":{"charts":0,"images":0,"macros":1,"external_links":0,"defined_names":0,"comments":0,"pivot_tables":0},"unopened":[],"bounds":{"document_bytes":16777216,"sheet_cells":100000,"rows_first":2000,"rows_last":500,"rows_between":2000,"halvings":0,"cell_chars":16384,"cell_head_chars":4096},"cells_cut":0,"cells_raw":0,"read":"whole","date_system":"1900"}

{"sheet":"Лист1","index":0,"n_rows":7,"n_cols":3,"rows_kept":7,"cut":false,"hidden":false,"merged":[]}
[]
["б",null,5]
["г",null,3]
["д",null,4]
["ж",null,5]
["и",null,7]
["к",null,5]

{"sheet":"Лист2","index":1,"n_rows":7,"n_cols":3,"rows_kept":7,"cut":false,"hidden":false,"merged":[]}
[]
["е",null,6]
["з",null,5]
["в ",null,4]
["м",null,7]
["а",null,5]
["н",null,2]

{"sheet":"свод","index":2,"n_rows":18,"n_cols":4,"rows_kept":18,"cut":false,"hidden":false,"merged":[]}
[null,null,"формула","макрос"]
[null,"а",{"$f":"IFERROR(VLOOKUP($B2,Лист1!$A:$C,3,0),VLOOKUP($B2,Лист2!$A:$C,3,0))","v":5},5]
[null,"б",{"$f":"IFERROR(VLOOKUP($B3,Лист1!$A:$C,3,0),VLOOKUP($B3,Лист2!$A:$C,3,0))","v":5},5]
[null,"в ",{"$f":"IFERROR(VLOOKUP($B4,Лист1!$A:$C,3,0),VLOOKUP($B4,Лист2!$A:$C,3,0))","v":4},4]
[null,"г",{"$f":"IFERROR(VLOOKUP($B5,Лист1!$A:$C,3,0),VLOOKUP($B5,Лист2!$A:$C,3,0))","v":3},3]
[null,"д",{"$f":"IFERROR(VLOOKUP($B6,Лист1!$A:$C,3,0),VLOOKUP($B6,Лист2!$A:$C,3,0))","v":4},4]
[null,"е",{"$f":"IFERROR(VLOOKUP($B7,Лист1!$A:$C,3,0),VLOOKUP($B7,Лист2!$A:$C,3,0))","v":6},6]
[null,"ж",{"$f":"IFERROR(VLOOKUP($B8,Лист1!$A:$C,3,0),VLOOKUP($B8,Лист2!$A:$C,3,0))","v":5},5]
[null,"з",{"$f":"IFERROR(VLOOKUP($B9,Лист1!$A:$C,3,0),VLOOKUP($B9,Лист2!$A:$C,3,0))","v":5},5]
[null,"и",{"$f":"IFERROR(VLOOKUP($B10,Лист1!$A:$C,3,0),VLOOKUP($B10,Лист2!$A:$C,3,0))","v":7},7]
[null,"к",{"$f":"IFERROR(VLOOKUP($B11,Лист1!$A:$C,3,0),VLOOKUP($B11,Лист2!$A:$C,3,0))","v":5},5]
[null,"д",{"$f":"IFERROR(VLOOKUP($B12,Лист1!$A:$C,3,0),VLOOKUP($B12,Лист2!$A:$C,3,0))","v":4},4]
[null,"и",{"$f":"IFERROR(VLOOKUP($B13,Лист1!$A:$C,3,0),VLOOKUP($B13,Лист2!$A:$C,3,0))","v":7},7]
[null,"а",{"$f":"IFERROR(VLOOKUP($B14,Лист1!$A:$C,3,0),VLOOKUP($B14,Лист2!$A:$C,3,0))","v":5},5]
[null,"б",{"$f":"IFERROR(VLOOKUP($B15,Лист1!$A:$C,3,0),VLOOKUP($B15,Лист2!$A:$C,3,0))","v":5},5]
[null,"а",{"$f":"IFERROR(VLOOKUP($B16,Лист1!$A:$C,3,0),VLOOKUP($B16,Лист2!$A:$C,3,0))","v":5},5]
[null,"м",{"$f":"IFERROR(VLOOKUP($B17,Лист1!$A:$C,3,0),VLOOKUP($B17,Лист2!$A:$C,3,0))","v":7},7]
[null,"н",{"$f":"IFERROR(VLOOKUP($B18,Лист1!$A:$C,3,0),VLOOKUP($B18,Лист2!$A:$C,3,0))","v":2},2]