{"text_format":"1","workbook":"xlsx","n_sheets":2,"sheets":["Поставщик","Наш прайс"],"not_rendered":{"charts":0,"images":0,"macros":1,"external_links":0,"defined_names":1,"comments":0,"pivot_tables":0},"unopened":[],"bounds":{"document_bytes":16777216,"sheet_cells":100000,"rows_first":2000,"rows_last":500,"rows_between":2000,"halvings":0,"cell_chars":16384,"cell_head_chars":4096},"cells_cut":0,"cells_raw":0,"read":"whole","date_system":"1900"}

{"sheet":"Поставщик","index":0,"n_rows":12,"n_cols":3,"rows_kept":12,"cut":false,"hidden":false,"merged":[]}
["Код","Наличие","РРЦ"]
[68646,"* *",890]
[68647,"Нет в наличии",890]
[68633,"* * *",590]
[68634,"0",590]
[68635,"* *",590]
[68679,"* *",1990]
[68648,"3",890]
[68636,"* * *",590]
[68649,"* * *",890]
[68650,"* * * *",890]
[68652,"2",890]

{"sheet":"Наш прайс","index":1,"n_rows":12,"n_cols":8,"rows_kept":12,"cut":false,"hidden":false,"merged":[]}
["Код","Остаток","Остаток у поставщика","Ост.у поставщика число","Сравнение","Цена","РРЦ поставщика","Сравнение"]
[68679,0,{"$f":"VLOOKUP($A2,Поставщик!$A$2:$B$12,2,0)","v":"* *"},{"$f":"cnt(C2)","v":2},{"$f":"D2=B2","v":false},1990.02,{"$f":"VLOOKUP(A2,Поставщик!$A$2:$C$12,3,0)","v":1990},{"$f":"F2=G2","v":false}]
[68652,1,{"$f":"VLOOKUP($A3,Поставщик!$A$2:$B$12,2,0)","v":"2"},{"$f":"cnt(C3)","v":2},{"$f":"D3=B3","v":false},890,{"$f":"VLOOKUP(A3,Поставщик!$A$2:$C$12,3,0)","v":890},{"$f":"F3=G3","v":true}]
[68650,1,{"$f":"VLOOKUP($A4,Поставщик!$A$2:$B$12,2,0)","v":"* * * *"},{"$f":"cnt(C4)","v":4},false,890,{"$f":"VLOOKUP(A4,Поставщик!$A$2:$C$12,3,0)","v":890},true]
[68649,0,{"$f":"VLOOKUP($A5,Поставщик!$A$2:$B$12,2,0)","v":"* * *"},3,{"$f":"D5=B5","v":false},891,{"$f":"VLOOKUP(A5,Поставщик!$A$2:$C$12,3,0)","v":890},false]
[68648,1,{"$f":"VLOOKUP($A6,Поставщик!$A$2:$B$12,2,0)","v":"3"},{"$f":"cnt(C6)","v":3},{"$f":"D6=B6","v":false},890,{"$f":"VLOOKUP(A6,Поставщик!$A$2:$C$12,3,0)","v":890},true]
[68647,0,{"$f":"VLOOKUP($A7,Поставщик!$A$2:$B$12,2,0)","v":"Нет в наличии"},{"$f":"cnt(C7)","v":0},{"$f":"D7=B7","v":true},890,{"$f":"VLOOKUP(A7,Поставщик!$A$2:$C$12,3,0)","v":890},true]
[68646,1,{"$f":"VLOOKUP($A8,Поставщик!$A$2:$B$12,2,0)","v":"* *"},{"$f":"cnt(C8)","v":2},{"$f":"D8=B8","v":false},890.1,{"$f":"VLOOKUP(A8,Поставщик!$A$2:$C$12,3,0)","v":890},false]
[68636,0,{"$f":"VLOOKUP($A9,Поставщик!$A$2:$B$12,2,0)","v":"* * *"},3,false,590,{"$f":"VLOOKUP(A9,Поставщик!$A$2:$C$12,3,0)","v":590},true]
[68635,1,{"$f":"VLOOKUP($A10,Поставщик!$A$2:$B$12,2,0)","v":"* *"},2,false,590,{"$f":"VLOOKUP(A10,Поставщик!$A$2:$C$12,3,0)","v":590},true]
[68634,1,{"$f":"VLOOKUP($A11,Поставщик!$A$2:$B$12,2,0)","v":"0"},0,false,590,{"$f":"VLOOKUP(A11,Поставщик!$A$2:$C$12,3,0)","v":590},true]
[68633,0,{"$f":"VLOOKUP($A12,Поставщик!$A$2:$B$12,2,0)","v":"* * *"},3,{"$f":"D12=B12","v":false},690,{"$f":"VLOOKUP(A12,Поставщик!$A$2:$C$12,3,0)","v":590},false]