{"text_format":"1","workbook":"xlsx","n_sheets":3,"sheets":["Входящая информация","База","Прошлый максимум пробега"],"not_rendered":{"charts":0,"images":1,"macros":1,"external_links":0,"defined_names":11,"comments":0,"pivot_tables":0},"unopened":[],"bounds":{"document_bytes":16777216,"sheet_cells":100000,"rows_first":2000,"rows_last":500,"rows_between":2000,"halvings":0,"cell_chars":16384,"cell_head_chars":4096},"cells_cut":0,"cells_raw":0,"read":"whole","date_system":"1900"}

{"sheet":"Входящая информация","index":0,"n_rows":46,"n_cols":28,"rows_kept":46,"cut":false,"hidden":false,"merged":[[42,9,42,10],[43,25,43,27],[44,8,44,16],[9,26,11,26],[9,27,11,27],[10,12,11,12],[10,13,11,13],[10,17,10,18],[10,19,10,21],[40,14,42,14],[40,15,42,15],[40,11,42,11],[40,12,42,12],[40,13,42,13],[40,8,40,10],[40,26,42,26],[40,27,42,27],[41,9,41,10],[8,14,8,17],[9,8,11,8],[9,9,9,11],[9,12,9,13],[9,14,11,14],[9,15,9,21],[10,9,11,9],[10,10,11,10],[10,11,11,11],[40,16,42,16],[40,17,42,17],[40,18,42,18],[40,19,42,19],[9,22,10,23],[7,14,7,16],[4,16,4,18],[4,22,4,23],[1,8,1,12],[1,26,1,27],[2,14,2,23],[2,26,2,27],[3,26,3,27],[5,14,5,19],[11,0,11,3],[45,8,45,27],[10,15,10,16],[4,26,4,27],[40,20,42,20],[40,21,42,21],[40,22,42,22],[40,23,42,23],[40,24,42,24],[40,25,42,25],[7,18,7,22],[7,23,7,24],[9,24,10,25],[5,20,5,23],[6,18,6,21]]}
[3,"Масловский",41821,27.33,null,null,null,null,{"$f":"MATCH(O8,B2:B25,0)","v":"1900-01-03"},null,null,null,null,null,null,null,null,null,null,null,null,null,null,null,null,null,"и коммуникаций Республики Беларусь"]
[1,"Барташевич","2014-07-01",27,null,null,null,null,"наименование перевозчика (штамп (печать)",null,null,null,null,null,null,null,null,null,null,null,null,null,null,null,null,null,"УТВЕРЖДАЮ"]
[2,"Волк","2014-07-01",27,null,null,null,null,null,null,null,null,null,null,"ПУТЕВОЙ ЛИСТ ЛЕГКОВОГО АВТОМОБИЛЯ №",null,null,null,null,null,null,null,null,null,{"$f":"VLOOKUP('Входящая информация'!B1,База!$J:$M,4,0)","v":87},null,"Постановление Министерства транспорта"]
[3,"Масловский","2014-07-01",27.33,null,null,null,null,{"$f":"MATCH(O8,B2:B25,0)","v":3},null,null,null,null,null,null,null,null,null,null,null,null,null,null,null,null,null,"и коммуникаций Республики Беларусь"]
[4,"Масловский","2014-07-02",28.33,null,null,null,null,null,null,null,null,null,"В период с    \"",1,"\"","Июля",null,null,"по\"",31,"\"","Июля",null,2014,"г.","29.03.2012 №25"]
[5,"Масловский","2014-07-03",29.33,null,null,null,null,null,null,null,null,null,"Автомобиль",{"$f":"VLOOKUP('Входящая информация'!B1,База!$H:$I,2,0)","v":"Опель Зафира"},null,null,null,null,null,{"$f":"VLOOKUP('Входящая информация'!B1,База!$J:$K,2,0)","v":"8097 ЕИ-1"}]
[6,"Масловский","2014-07-03",27,null,null,null,null,null,null,null,null,null,null,null,null,null,null,"марка, регистрационный знак"]
[7,"Сенько","2014-07-01",27,null,null,null,null,null,null,null,null,null,"Водитель",{"$f":"'Входящая информация'!B1","v":"Масловский"},null,null,{"$f":"VLOOKUP(O8,База!$B:$C,2,0)","v":"И.М."},"Водительское удостоверение",null,null,null,null,{"$f":"VLOOKUP('Входящая информация'!B1,База!$J:$L,3,0)","v":"7АС 013946"}]
[8,"Сенько","2014-07-02",27.36,null,null,null,null,null,null,null,null,null,null,"фамилия, инициалы"]
[9,"Федорцов","2014-07-02",25,null,null,null,null,"Число","Время (час, мин.)",null,null,"Показания спидометра",null,"Пробег, км","Движение топлива",null,null,null,null,null,null,"Автомобиль технически исправен",null,"При возвращении автомобиль",null,"Водитель по состоянию здоровья к управлению допущен (подпись(штамп) уполномоченного лица)","Подпись(штамп) ответственного лица за оформление путевого листа"]
[10,"Шалима","2014-07-01",37.5,null,null,null,null,null,"выезда","возвращения","в наряде","при выезде","при возвращении",null,"остаток топлива, л",null,"заправлено топлива",null,"расход топлива, л"]
["левая часть примера",null,null,null,null,null,null,null,null,null,null,null,null,null,null,"при выезде","при возвращении","количество,л","подпись (штамп) уполномоченного (дата и № чека АЗС)","по норме","фактически","экономия (+) перерасход (-)","выезд разрешен (подпись (штамп) уполномоченного лица)","принял (подпись водителя)","сдал (подпись водителя)","принял (подпись(штамп) уполномоченного лица)"]
[null,null,null,null,null,null,null,null,1,2,3,4,5,6,7,8,9,10,11,12,13,14,15,16,17,18,19,20]
[null,null,null,null,null,null,null,null,"2014-07-01","00:00:00",240.57142857142856,16.84,{"$f":"VLOOKUP('Входящая информация'!B1,'Прошлый максимум пробега'!$A:$B,2,0)","v":0},{"$f":"M14+O14","v":390.42857142857139},{"$f":"R14/7*100","v":390.42857142857139},null,null,27.33,null,null,null,null,null,{"$f":"O8&\" \"&R8","v":"Масловский И.М."},{"$f":"X14","v":"Масловский И.М."}]
[null,null,null,null,null,null,null,null,"2014-07-02","00:00:00",240.57142857142856,16.84,{"$f":"N14","v":390.42857142857139},{"$f":"M15+O15","v":390.42857142857139},0,null,null,28.33,null,null,null,null,null,{"$f":"Y14","v":"Масловский И.М."},{"$f":"X15","v":"Масловский И.М."}]
[null,null,null,null,null,null,null,null,"2014-07-03","00:00:00",143.71428571428572,10.06,{"$f":"N15","v":390.42857142857139},390.42857142857139,0,null,null,29.33,null,null,null,null,null,{"$f":"Y15","v":"Масловский И.М."},{"$f":"X16","v":"Масловский И.М."}]
[null,null,null,null,null,null,null,null,"2014-07-03","00:00:00",601.57142857142856,42.11,390.42857142857139,390.42857142857139,0,null,null,27,null,null,null,null,null,"Масловский И.М.","Масловский И.М."]
[]
[]
[]
[]
[]
[]
[]
[]
[]
[]
[]
[]
[]
[]
[]
[]
[]
[]
[]
[]
[]
[]
[]
[null,null,null,null,null,null,null,null,null,null,null,null,null,null,{"$f":"SUM(O13:O40)","v":397.42857142857139},null,null,{"$f":"SUM(R13:R40)","v":121.99}]
[]
[]
[null,null,null,null,null,null,null,null,"Для расчетов:",null,null,null,null,null,null,null,null,null,null,null,null,null,null,null,null,"ГОУПП \"Гродненская типография\" * 6569"]
[null,null,null,null,null,null,null,null,"РУП \"Издательство \"Белбланквыд\" об. 1812 х1-2012.2860*100"]
[null,null,null,null,null,null,null,null,"правая часть примера"]

{"sheet":"База","index":1,"n_rows":210,"n_cols":16,"rows_kept":210,"cut":false,"hidden":false,"merged":[]}
["№","Фамилия","Инициалы","Марка авто","Номера ","Номер водительского удостоверения","Расход на 100 км/литров","Фамилия","Марка авто","Фамилия","Марка авто","Номер водительского удостоверения","№"]
[1,"Абрамович","И.Ю.","Опель Астра","2349 ОР-7","7АВ046616",0,{"$f":"B2","v":"Абрамович"},{"$f":"D2","v":"Опель Астра"},{"$f":"B2","v":"Абрамович"},{"$f":"E2","v":"2349 ОР-7"},{"$f":"F2","v":"7АВ046616"},1,null,null,"Января"]
[2,"Аксючиц","Е.Н.","Форд Эскорт","5779 НЕ-7","7АВ068478",0,"Аксючиц","Форд Эскорт","Аксючиц","5779 НЕ-7","7АВ068478",2,null,null,"Февраля"]
[3,"Альфер","Д.В.","Рено Меган","2397 IA-5","5АС033161",0,"Альфер","Рено Меган","Альфер","2397 IA-5","5АС033161",3,null,null,"Марта"]
[4,"Аникович","П.С.","Опель Омега","2232 ОР-7","МАА 1443409",0,"Аникович","Опель Омега","Аникович","2232 ОР-7","МАА 1443409",4,null,null,"Апреля"]
[5,"Апанович","С.В.","Опель Омега","2448 IН-4","4АМ013309",0,"Апанович","Опель Омега","Апанович","2448 IН-4","4АМ013309",5,null,null,"Мая"]
[6,"Апарович","Н.И.","Ауди А4","5044 ОК-7","7АВ006204",0,"Апарович","Ауди А4","Апарович","5044 ОК-7","7АВ006204",6,null,null,"Июня"]
[7,"Афанасенко","В.А.","БМВ 330","8811ВТ - 7 ","МАА 370214",0,"Афанасенко","БМВ 330","Афанасенко","8811ВТ - 7 ","МАА 370214",7,null,null,"Июля"]
[8,"Бабич","С.В.","Пежо 605","7754 IP-5","7АВ037885",0,"Бабич","Пежо 605","Бабич","7754 IP-5","7АВ037885",8,null,null,"Августа"]
[9,"Багрицевич","И.С.","Сузуки Балено","1032 ОК-7","КА330329",0,"Багрицевич","Сузуки Балено","Багрицевич","1032 ОК-7","КА330329",9,null,null,"Сентября"]
[10,"Базаревич","М.Х.",0,0,0,0,"Базаревич",0,"Базаревич",0,0,10,null,null,"Октября"]
[11,"Балаболов","Г.У.","Субару Форестер","2987КС",0,0,"Балаболов","Субару Форестер","Балаболов","2987КС",0,11,null,null,"Ноября"]
[12,"Баранов","Ю.Н.","Додж Караван","4787 IO-7","КА337679",0,"Баранов","Додж Караван","Баранов","4787 IO-7","КА337679",12,null,null,"Декабря"]
[13,"Барташевич","П.В.","Рено Клио","7275 МА-7","КА296495",0,"Барташевич","Рено Клио","Барташевич","7275 МА-7","КА296495",13]
[14,"Барцевич","А.А.","Пежо 306","2712 ОР-7","КА381543",0,"Барцевич","Пежо 306","Барцевич","2712 ОР-7","КА381543",14]
[15,"Бацкалевич","В.В.","Ровер 618","6014 IМ-5","7АС 037035",0,"Бацкалевич","Ровер 618","Бацкалевич","6014 IМ-5","7АС 037035",15]
[16,"Богданова","И.Л.",0,0,0,0,"Богданова",0,"Богданова",0,0,16]
[17,"Борисов","Д.И.","Рено 19","3647 EH-7","7AВ017725",0,"Борисов","Рено 19","Борисов","3647 EH-7","7AВ017725",17]
[18,"Боровик","С.Н.",0,0,0,0,"Боровик",0,"Боровик",0,0,18]
[19,"Бруцкий","А.А.","Ситроен Ксара","6562 ОI-7",0,0,"Бруцкий","Ситроен Ксара","Бруцкий","6562 ОI-7",0,19]
[20,"Будкин","Л.Б.","Рено сценик","8538 OB-7","44КС029644",0,"Будкин","Рено сценик","Будкин","8538 OB-7","44КС029644",20]
[21,"Будник","В.В.","Ситроен С5","3300 АХ-7","КА420625",0,"Будник","Ситроен С5","Будник","3300 АХ-7","КА420625",21]
[22,"Булавко","Е.В.",0,0,0,0,"Булавко",0,"Булавко",0,0,22]
[23,"Бунас","Е.В.","СИТРОЕН ZX","5421IE-7","КА295190",0,"Бунас","СИТРОЕН ZX","Бунас","5421IE-7","КА295190",23]
[24,"Буров","Н.В.","Форд Сиерра","4621 ОС-7","7АВ050885",0,"Буров","Форд Сиерра","Буров","4621 ОС-7","7АВ050885",24]
[25,"Буткевич","Ш.А.",0,0,0,0,"Буткевич",0,"Буткевич",0,0,25]
[26,"Ваулин","М.М.",0,0,0,0,"Ваулин",0,"Ваулин",0,0,26]
[27,"Венцко","С.Г.","Мерседес бенц 410D","АА 2251-1","1АВ049039",0,"Венцко","Мерседес бенц 410D","Венцко","АА 2251-1","1АВ049039",27]
[28,"Волк","Е.А.","Форд Мондео","5029 ОА-7","7АА 010711",0,"Волк","Форд Мондео","Волк","5029 ОА-7","7АА 010711",28]
[29,"Волчанина","Е.В.",0,0,0,0,"Волчанина",0,"Волчанина",0,0,29]
[30,"Вязович","Д.А.","Шевроле Явео","6842НЕ-7","КА413847",0,"Вязович","Шевроле Явео","Вязович","6842НЕ-7","КА413847",30]
[31,"Гавриленко","Я.В.","Форд Транзит","1766 АН-1",0,0,"Гавриленко","Форд Транзит","Гавриленко","1766 АН-1",0,31]
[32,"Герасимчик","А.А.","Ниссан Премьера","2955 ОТ-7","7АВ049303",0,0,"Ниссан Премьера","Герасимчик","2955 ОТ-7","7АВ049303",32]
[33,"Головастый","В.И.",0,0,0,0,0,{"$f":"D34","v":0},{"$f":"B34","v":"Головастый"},{"$f":"E34","v":0},{"$f":"F34","v":0},33]
[34,"Гребень","В.З.","Опель Марива","0233 МР-7","КА301886",0,0,"Опель Марива","Гребень","0233 МР-7","КА301886",34]
[35,"Грибков","Ю.Ю.",0,0,0,0,0,0,"Грибков",0,0,35]
[36,"Гриндюк","Д.Ю.",0,0,0,0,0,0,"Гриндюк",0,0,36]
[37,"Гриневич","О.С.","Тойота Аурис","6379 КХ-7","МАА 942895",0,0,"Тойота Аурис","Гриневич","6379 КХ-7","МАА 942895",37]
[38,"Громов","С.Ю.","Хонда Цивик","7687 ОН-7","смс",0,{"$f":"B39","v":"Громов"},"Хонда Цивик","Громов","7687 ОН-7","смс",38]
[39,"Гужев","И.С.","Хонда Аккорд ","0023 ОН-7","МАА 1453279",0,{"$f":"B40","v":"Гужев"},"Хонда Аккорд ","Гужев","0023 ОН-7","МАА 1453279",39]
[40,"Гущин","А.Ю.","Ситроен Ксара Пикассо","4241 ЕС-5","ОВА 111112",0,{"$f":"B41","v":"Гущин"},"Ситроен Ксара Пикассо","Гущин","4241 ЕС-5","ОВА 111112",40]
[41,"Давыдик","О.Л.","Хендай Акцент","9357 ОЕ-7"," МАА 1440214",0,0,"Хендай Акцент","Давыдик","9357 ОЕ-7"," МАА 1440214",41]
[42,"Дакутько","О.М.","Опель Вектра","6430ВС-7","7АВ079907",0,{"$f":"B43","v":"Дакутько"},"Опель Вектра","Дакутько","6430ВС-7","7АВ079907",42]
[43,"Данильчик","А.И.","Ровер 25","5108 ОI-7","7АА 00308",0,{"$f":"B44","v":"Данильчик"},"Ровер 25","Данильчик","5108 ОI-7","7АА 00308",43]
[44,"Дашкевич","В.О.","Рено Меган ","7776 ВЕ-7","МАА 1105617",0,{"$f":"B45","v":"Дашкевич"},"Рено Меган ","Дашкевич","7776 ВЕ-7","МАА 1105617",44]
[45,"Дробыш","О.Д.","Форд  Гэлакси","9109 ЕХ-7","МАА 552491",0,0,"Форд  Гэлакси","Дробыш","9109 ЕХ-7","МАА 552491",45]
[46,"Думный","А.А.","Форд Галакси","8039 РМ-7","МАА 1101833",0,0,"Форд Галакси","Думный","8039 РМ-7","МАА 1101833",46]
[47,"Егоров","В.А.","Ровер 200","5122ВТ-5","ОАА104997",0,{"$f":"B48","v":"Егоров"},"Ровер 200","Егоров","5122ВТ-5","ОАА104997",47]
[48,"Ермолаев","А.В.","Опель Корса","8050 ОН-7",0,0,{"$f":"B49","v":"Ермолаев"},"Опель Корса","Ермолаев","8050 ОН-7",0,48]
[49,"Захаревич","Ю.А.","DODGE CALIBER","8800MH-7","КВ140163",0,{"$f":"B50","v":"Захаревич"},"DODGE CALIBER","Захаревич","8800MH-7","КВ140163",49]
[50,"Захаров","Е.Л.",0,0,0,0,0,0,"Захаров",0,0,50]
[51,"Зятьков","А.А.",0,0,0,0,0,0,"Зятьков",0,0,51]
[52,"Казловский","В.В.","Рено сценик","7897 IH-7","MAA 697751",0,{"$f":"B53","v":"Казловский"},"Рено сценик","Казловский","7897 IH-7","MAA 697751",52]
[53,"Каптунов","С.Н.","Рено Меган","0183 IB-5","OAA 270062",0,0,"Рено Меган","Каптунов","0183 IB-5","OAA 270062",53]
[54,"Капустин","А.С.",0,0,0,0,0,0,"Капустин",0,0,54]
[55,"Капцевич","Р.О.","КИА спортайдже","7338 ОК-7","КВ 142180",0,{"$f":"B56","v":"Капцевич"},"КИА спортайдже","Капцевич","7338 ОК-7","КВ 142180",55]
[56,"Качан","О.В.",0,0,0,0,{"$f":"B57","v":"Качан"},0,"Качан",0,0,56]
[57,"Кебало","А.Н.","БМВ 525","7998 АА-7"," МАА 1481764",0,0,"БМВ 525","Кебало","7998 АА-7"," МАА 1481764",57]
[58,"Ключеня","В.Н.","Опель Корса","6043 ОС-7","МАА 1461798",0,{"$f":"B59","v":"Ключеня"},"Опель Корса","Ключеня","6043 ОС-7","МАА 1461798",58]
[59,"Кобытев","Н.В.","Ситроен АХ","4512 OI-7","МАА 1228302",0,{"$f":"B60","v":"Кобытев"},"Ситроен АХ","Кобытев","4512 OI-7","МАА 1228302",59]
[60,"Колечиц","А.С.",0,0,0,0,0,0,"Колечиц",0,0,60]
[61,"Кондратьев","Д.В.",0,0,0,0,{"$f":"B62","v":"Кондратьев"},0,"Кондратьев",0,0,61]
[62,"Корик","М.Н.","Вольво V 70","0011 ОТ-7","7АА130632",0,{"$f":"B63","v":"Корик"},"Вольво V 70","Корик","0011 ОТ-7","7АА130632",62]
[63,"Королькевич","А.А.","Опель Астра","6718 МI-7","КА380163",0,0,"Опель Астра","Королькевич","6718 МI-7","КА380163",63]
[64,"Кот","В.В.","Мазда3","8359 ОХ-7","7АВ037391",0,{"$f":"B65","v":"Кот"},"Мазда3","Кот","8359 ОХ-7","7АВ037391",64]
[65,"Кравченко","О.М.",0,0,0,0,"Кравченко",0,{"$f":"B66","v":"Кравченко"},0,0,65]
[66,"Крупина","Н.И.","КИА СЕПХИЯ","5457BI-4","3АВ004604 ",0,"Крупина","КИА СЕПХИЯ","Крупина","5457BI-4","3АВ004604 ",66]
[67,"Крысов",0,"Форд Тразит","4391 AX-5","ОА 110476",0,"Крысов",0,"Крысов",0,0,67]
[68,"Кузнецов","В.В.","Фиат Деабло",0,0,0,"Кузнецов",{"$f":"D69","v":"Фиат Деабло"},"Кузнецов",{"$f":"E69","v":0},{"$f":"F69","v":0},68]
[69,"Куклик","Б.В.","Рено 19","2190 ВН-5","7АВ040760",0,"Куклик","Рено 19","Куклик","2190 ВН-5","7АВ040760",69]
[70,"Кулащик","В.В.","Шевроле Авео","2570 ВЕ-5","5АВ045334",0,"Кулащик","Шевроле Авео","Кулащик","2570 ВЕ-5","5АВ045334",70]
[71,"Куракевич","О.А.",0,0,0,0,0,0,"Куракевич",0,0,71]
[72,"Курганская","В.И.",0,0,0,0,{"$f":"B73","v":"Курганская"},0,"Курганская",0,0,72]
[73,"Курец","Д.Н.","Фольцваген Курец","6578 IT -7","OEA 151321",0,0,"Фольцваген Курец","Курец","6578 IT -7","OEA 151321",73]
[74,"Курило","А.С.","Опель Вектра","6723 ЕТ-5","7АА148146",0,{"$f":"B75","v":"Курило"},"Опель Вектра","Курило","6723 ЕТ-5","7АА148146",74]
[75,"Курлович","А.Н.","Фольцваген Гольф","9236 МХ-7","7АА093775",0,{"$f":"B76","v":"Курлович"},"Фольцваген Гольф","Курлович","9236 МХ-7","7АА093775",75]
[76,"Латушкин","А.С.",0,0,0,0,0,0,"Латушкин",0,0,76]
[77,"Леонов","А.Н.","OPEL ASTRA G","4037 KX-7",0,0,{"$f":"B78","v":"Леонов"},"OPEL ASTRA G","Леонов","4037 KX-7",0,77]
[78,"Лобах","А.А.",0,0,0,0,{"$f":"B79","v":"Лобах"},0,"Лобах",0,0,78]
[79,"Лобик","Н.А.","Пежо Эксперт","4087 МВ-7",0,0,{"$f":"B80","v":"Лобик"},"Пежо Эксперт","Лобик","4087 МВ-7",0,79]
[80,"Ломтева","А.В.",0,0,0,0,0,0,"Ломтева",0,0,80]
[81,"Мазаник","Д.Л.",0,0,0,0,0,0,"Мазаник",0,0,81]
[82,"Макдзюк","Б.Б.","АУДИ 80","7764ВИ",0,0,0,"АУДИ 80","Макдзюк","7764ВИ",0,82]
[83,"Мальчевский","Д.Н.","Ланция Каппа","4995 МН-7","МАА 1077972",0,0,"Ланция Каппа","Мальчевский","4995 МН-7","МАА 1077972",83]
[84,"Малюжич","В.В.","Фольксваген Каравэлла Т5","9970 ИЕ-5",0,0,{"$f":"B85","v":"Малюжич"},"Фольксваген Каравэлла Т5","Малюжич","9970 ИЕ-5",0,84]
[85,"Масалков","А.Н.","Сааб 9,5","1980 НЕ-7","КВ309992",0,{"$f":"B86","v":"Масалков"},"Сааб 9,5","Масалков","1980 НЕ-7","КВ309992",85]
[86,"Масло","Д.А.","Хонда Акорд","1549 ВВ-7","КА362066",0,0,"Хонда Акорд","Масло","1549 ВВ-7","КА362066",86]
[87,"Масловский","И.М.","Опель Зафира","8097 ЕИ-1","7АС 013946",0,{"$f":"B88","v":"Масловский"},"Опель Зафира","Масловский","8097 ЕИ-1","7АС 013946",87]
[88,"Мирошников","С.А.",0,0,0,0,"Мирошников",0,"Мирошников",0,0,88]
[89,"Митор","Е.Г.","Хендай Акцент","6810 ЕМ-3","КА415397",0,"Митор","Хендай Акцент","Митор","6810 ЕМ-3","КА415397",89]
[90,"Михайловский","М.С.",0,0,0,0,"Михайловский",0,"Михайловский",0,0,90]
[91,"Михин","В.А.",0,0,0,0,"Михин",0,"Михин",0,0,91]
[92,"Молахов","А.В.","Опель Вектра","6636 ЕВ-6","ТВ 051099",0,"Молахов","Опель Вектра","Молахов","6636 ЕВ-6","ТВ 051099",92]
[93,"Невмержицкий","Д.К.",0,0,0,0,"Невмержицкий",0,"Невмержицкий",0,0,93]
[94,"Нижник","Д.М.","Ниссан Альмера","3662 ОН-7","7АВ045104",0,0,"Ниссан Альмера","Нижник","3662 ОН-7","7АВ045104",94]
[95,"Павлов","А.И.","Хендай Сантамо","1419 IC-7"," МАА 1530346",0,{"$f":"B96","v":"Павлов"},"Хендай Сантамо","Павлов","1419 IC-7"," МАА 1530346",95]
[96,"Паклонский","В.А.","Пежо 406","5974 IM-5","5AA026372",0,0,"Пежо 406","Паклонский","5974 IM-5","5AA026372",96]
[97,"Петрище","А.Э.",0,0,0,0,{"$f":"B98","v":"Петрище"},0,{"$f":"B98","v":"Петрище"},0,0,97]
[98,"Петрович","А.В.","Фольцваген Пассат","9217 НВ-7","МАА 1574285",0,0,"Фольцваген Пассат","Петрович","9217 НВ-7","МАА 1574285",98]
[99,"Писаревич","В.В.",0,0,0,0,{"$f":"B100","v":"Писаревич"},0,"Писаревич",0,0,99]
[100,"Пищулин","А.Н.",0,0,0,0,{"$f":"B101","v":"Пищулин"},{"$f":"D101","v":0},"Пищулин",{"$f":"E101","v":0},{"$f":"F101","v":0},100]
[101,"Полянский","А.А.","Рено  Сценик","0198 НА","КВ 227396",0,{"$f":"B102","v":"Полянский"},"Рено  Сценик","Полянский","0198 НА","КВ 227396",101]
[102,"Потеряйко","П.К.","Мерседес 200 D","2448 HI-7","КВ 212840",0,{"$f":"B103","v":"Потеряйко"},"Мерседес 200 D","Потеряйко","2448 HI-7","КВ 212840",102]
[103,"Похияйнен","А.М.","Хонда Цивик","9546 IX-7","ОАА 262108",0,{"$f":"B104","v":"Похияйнен"},"Хонда Цивик","Похияйнен","9546 IX-7","ОАА 262108",103]
[104,"Похоменко","Ю.А.","Пежо 408","7578 НЕ-7","7АС021354",0,0,"Пежо 408","Похоменко","7578 НЕ-7","7АС021354",104]
[105,"Рабец","С.А.","Рено Меган Сценик","6108 НА-7","МАА 1536680",0,{"$f":"B106","v":"Рабец"},"Рено Меган Сценик","Рабец","6108 НА-7","МАА 1536680",105]
[106,"Радько","В.М.","Шкода Октавиа","9677 IT -7","ОЕА 151639",0,0,"Шкода Октавиа","Радько","9677 IT -7","ОЕА 151639",106]
[107,"Родобольская","И.В.","Пежо 207","3709 МК-7","7АС0600653",0,0,"Пежо 207","Родобольская","3709 МК-7","7АС0600653",107]
[108,"Романович","А.П.","Опель Асстра","4903 ММ-7",0,0,{"$f":"B109","v":"Романович"},"Опель Асстра","Романович","4903 ММ-7",0,108]
[109,"Руичев","А.С.",0,0,0,0,0,0,"Руичев",0,0,109]
[110,"Руколь","П.Д.","БМВ320","9186 МР-7","КА444448",0,0,"БМВ320","Руколь","9186 МР-7","КА444448",110]
[111,"Рыбак","О.Г.","Рено Софран","5076 ЕА-7","7АА143915",0,{"$f":"B112","v":"Рыбак"},"Рено Софран","Рыбак","5076 ЕА-7","7АА143915",111]
[112,"Савин","И.С.","Хендай Пони","6753МАК","7АВ043735",0,"Савин","Хендай Пони","Савин","6753МАК","7АВ043735",112]
[113,"Савостенок","О.Ю.",0,0,0,0,"Савостенок",0,"Савостенок",0,0,113]
[114,"Сазонова","Л.М.","Тойота Королла","8141 ВI-6","7АВ046680",0,"Сазонова","Тойота Королла","Сазонова","8141 ВI-6","7АВ046680",114]
[115,"Сайковский","Ж.Г.","Renault Espace","7235OC-7","7AA065553",0,"Сайковский","Renault Espace","Сайковский","7235OC-7","7AA065553",115]
[116,"Селюнин","В.В.","Ситроен Джампер","АН 1008-7","МАА 1487974",0,"Селюнин","Ситроен Джампер","Селюнин","АН 1008-7","МАА 1487974",116]
[117,"Семак","А.А.","Пежо 607","5285 ОМ-7","7 АС 030253",0,"Семак","Пежо 607","Семак","5285 ОМ-7","7 АС 030253",117]
[118,"Сенькин","В.С.",0,0,0,0,0,0,"Сенькин",0,0,118]
[119,"Сенько","С.А.","ПЕЖО 306","2687 ЕК ",0,0,{"$f":"B120","v":"Сенько"},"ПЕЖО 306","Сенько","2687 ЕК ",0,119]
{"$rows_left_out":91}
{"sheet":"Прошлый максимум пробега","index":2,"n_rows":25,"n_cols":2,"rows_kept":25,"cut":false,"hidden":false,"merged":[]}
["Барташевич",0]
["Волк",0]
["Дакутько",0]
["Дробыш",0]
["Егоров",0]
["Качан",0]
["Ключеня",0]
["Кобытев",0]
["Крупина",0]
["Курец",0]
["Малюжич",0]
["Масловский",0]
["Митор",0]
["Рыбак",0]
["Савин",0]
["Сазонова",0]
["Селюнин",0]
["Сенько",0]
["Федорцов",0]
["Шалима",0]
["Прочие",0]
["Прочие",0]
["Прочие",0]
["Прочие",0]
["Прочие",0]