{"text_format":"1","workbook":"xlsx","n_sheets":2,"sheets":["работа","справочник"],"not_rendered":{"charts":0,"images":0,"macros":1,"external_links":1,"defined_names":1,"comments":0,"pivot_tables":0},"unopened":[],"bounds":{"document_bytes":16777216,"sheet_cells":100000,"rows_first":2000,"rows_last":500,"rows_between":2000,"halvings":0,"cell_chars":16384,"cell_head_chars":4096},"cells_cut":0,"cells_raw":0,"read":"whole","date_system":"1900"}

{"sheet":"работа","index":0,"n_rows":20,"n_cols":14,"rows_kept":20,"cut":false,"hidden":false,"merged":[[7,1,11,1],[12,1,15,1],[16,1,19,1],[3,0,3,1],[3,2,3,11],[4,0,5,0],[4,1,5,1],[4,2,5,2],[4,3,4,4],[4,5,4,6],[4,7,5,8]]}
["ООО \"Вайскер\"",null,null,null,null,null,null,null,null,null,"http://www.excelworld.ru/forum/2-11762-1#101118"]
["Карточка счета 51"]
[]
["Выводимые данные:",null,"БУ (данные бухгалтерского учета)"]
["Дата","Документ","Операция","Дебет",null,"Кредит",null,"Текущее сальдо"]
[null,null,null,"Счет","Сумма","Счет","Сумма"]
[0,0,0,0,0,0,0,0,0,null,"Статья","Код","Сумма (+/-)","Сумма (+)"]
["05.05.2014","Платежное поручение исходящее 00000000467 от 05.05.2014 11:43:37","Оплата","60.01",null,51,500000,"Д",1622459.11,null,"2.1.1.1.1 - Шихтовые материалы",{"$f":"IF(ISNA(INDEX([1]спр!$B$3:$B$125,MATCH(K8,[1]спр!$D$3:$D$125,0),1))=TRUE,\"-\",INDEX([1]спр!$B$3:$B$125,MATCH(K8,[1]спр!$D$3:$D$125,0),1))","v":"2.1.1.1.1"},{"$f":"E8-G8","v":-500000},{"$f":"ABS(M8)","v":500000}]
[null,null,"Промсервис ООО г. Тверь"]
[null,null,"Письмо"]
[null,null,"Основной"]
[null,null,"Шихтовые "]
["05.05.2014","Платежное поручение исходящее 00000000468 от 05.05.2014 14:25:30","Прочее списание денежных средств","91.02.1",null,51,45,"Д",1622414.11,null,"4.3.2.1 - Банковские расходы",{"$f":"IF(ISNA(INDEX([1]спр!$B$3:$B$125,MATCH(K13,[1]спр!$D$3:$D$125,0),1))=TRUE,\"-\",INDEX([1]спр!$B$3:$B$125,MATCH(K13,[1]спр!$D$3:$D$125,0),1))","v":"4.3.2.1"},{"$f":"E13-G13","v":-45},{"$f":"ABS(M13)","v":45}]
[null,null,"Банковские услуги"]
[null,null,"Основной"]
[null,null,"Банковские расходы"]
["05.05.2014","Платежное поручение исходящее 00000000469 от 05.05.2014 14:25:31","Перечисление зарплаты в банк по ведомости №00000000027 от 06.05.2014 9:55:23",70,null,51,6000,"Д",1616414.11,null,"2.1.2.1.1 - ФОТ",{"$f":"IF(ISNA(INDEX([1]спр!$B$3:$B$125,MATCH(K17,[1]спр!$D$3:$D$125,0),1))=TRUE,\"-\",INDEX([1]спр!$B$3:$B$125,MATCH(K17,[1]спр!$D$3:$D$125,0),1))","v":"2.1.2.1.1"},{"$f":"E17-G17","v":-6000},{"$f":"ABS(M17)","v":6000}]
[null,null,"По всем сотрудникам"]
[null,null,"Основной"]
[null,null,"Зарплата"]

{"sheet":"справочник","index":1,"n_rows":28,"n_cols":4,"rows_kept":28,"cut":false,"hidden":false,"merged":[]}
[null,"статья","код","значение 1С"]
[null,"4.3.2.1 - Банковские расходы","4.3.2.1","Банковские расходы"]
[null,"2.1.2.1.1 - ФОТ","2.1.2.1.1","Зарплата"]
[null,"2.1.1.1.1 - Шихтовые материалы","2.1.1.1.1","Шихтовые "]
[null,"2.1.1.1.1 - Шихтовые материалы","2.1.1.1.1","Шихтовые "]
[null,"4.3.2.1 - Банковские расходы","4.3.2.1","Банковские расходы"]
[null,"2.1.2.3.4 - Материалы, средства КИП","2.1.2.3.4","Запасные части"]
[null,"2.1.1.1.4 - Упаковочные материалы","2.1.1.1.4","Упаковочные"]
[null,"2.1.1.1.1 - Шихтовые материалы","2.1.1.1.1","Транспортировка железнодорожная"]
[null,"4.3.2.1 - Банковские расходы","4.3.2.1","Банковские расходы"]
[null,"1.4.1 - Внутригрупповые поступления","1.4.1","Вайскер ООО"]
[null,"2.1.1.1.1 - Шихтовые материалы","2.1.1.1.1","Транспортировка железнодорожная"]
[null,"2.1.2.1.5 - Прочие расходы на персонал (обеды, личный транспорт)","2.1.2.1.5","Профпитание"]
[null,"2.1.2.4 - Затраты по ВЭД / таможня","2.1.2.4","Таможня"]
[null,"2.1.2.3.2 - Эксплуатационные расходы","2.1.2.3.2","Ремонт питателя"]
[null,"2.1.2.8 - Инвестиции - Производственные","2.1.2.8","Приобретение ОС"]
[null,"2.1.2.3.7 - Автомобили и погрузчики","2.1.2.3.7","Автомобильная транспортировка"]
[null,"2.1.2.3.4 - Материалы, средства КИП","2.1.2.3.4","Запасные части"]
[null,"4.2.7.3 - Бензин","4.2.7.3","Дизельное топливо"]
[null,"1.4.1 - Внутригрупповые поступления","1.4.1","Доходы (расходы), связанные с продажей (покупкой) валюты"]
[null,"2.1.2.3.7 - Автомобили и погрузчики","2.1.2.3.7","Автомобильная транспортировка"]
[null,"2.1.2.3.7 - Автомобили и погрузчики","2.1.2.3.7","Автомобильная транспортировка"]
[null,"2.1.2.1.1 - ФОТ","2.1.2.1.1","НДФЛ"]
[null,"2.1.2.1.5 - Прочие расходы на персонал (обеды, личный транспорт)","2.1.2.1.5","Профсоюзные взносы"]
[null,"2.1.2.1.3 - Налоги на ФОТ","2.1.2.1.3","Страховые взносы"]
[null,"2.1.2.3.5 - Расходные материалы, металл","2.1.2.3.5","Металл"]
[null,"1.4.2 - Внутригрупповые выплаты","1.4.2","Тепловая энергия"]
[null,"2.1.2.7 - Сертификация предприятия","2.1.2.7","Аттестация стандартизация метрология "]