{"text_format":"1","workbook":"xlsx","n_sheets":4,"sheets":["Лист1","Данные","Лист3","Лист2"],"not_rendered":{"charts":0,"images":0,"macros":1,"external_links":0,"defined_names":5,"comments":0,"pivot_tables":0},"unopened":[],"bounds":{"document_bytes":16777216,"sheet_cells":100000,"rows_first":2000,"rows_last":500,"rows_between":2000,"halvings":0,"cell_chars":16384,"cell_head_chars":4096},"cells_cut":0,"cells_raw":0,"read":"whole","date_system":"1900"}

{"sheet":"Лист1","index":0,"n_rows":366,"n_cols":11,"rows_kept":366,"cut":false,"hidden":false,"merged":[[307,1,338,1],[307,0,338,0],[340,1,365,1],[340,0,365,0],[91,1,124,1],[91,0,124,0],[126,1,141,1],[126,0,141,0],[143,1,163,1],[143,0,163,0],[197,0,217,0],[197,1,217,1],[219,0,231,0],[219,1,231,1],[233,0,266,0],[233,1,266,1],[21,1,28,1],[21,0,28,0],[2,1,19,1],[2,0,19,0],[73,1,89,1],[73,0,89,0],[30,0,37,0],[30,1,37,1],[39,0,71,0],[39,1,71,1],[268,1,288,1],[268,0,288,0],[290,0,305,0],[290,1,305,1],[165,0,173,0],[165,1,173,1],[175,1,195,1],[175,0,195,0]]}
["№","Наименование груза","Каталог сервисов","Себестоимость","Цена","Рентабельность руб.","Рентабельность %"]
[]
[1,"Металлы в чушках, плитках, карандашах (в пакетах), вес грузового места до 1000кг","Вагон"]
[null,null,"вагон - склад - судно"]
[null,null,"вагон - крытый склад - судно"]
[null,null,"вагон - склад - контейнер"]
[null,null,"вагон - крытый склад - контейнер"]
[null,null,"Авто"]
[null,null,"авто - склад - судно"]
[null,null,"авто - крытый склад - судно",null," "]
[null,null,"авто - склад - контейнер"]
[null,null,"авто - крытый склад - контейнер",null," "]
[null,null,"Доп. Услуги"," ",null," "]
[null,null,"Подработка"]
[null,null,"Выпуск - погруз - поручение"]
[null,null,"Переупаковка"]
[null,null,"Сортировка (по инструкциям клиента)"]
[null,null,"Внутрипортовое экспедирование"]
[null,null,"Маркировка"]
[null,null,"Крепление"]
[]
[2,"Слябы черных металлов, вес грузового места 15-25 тн","Вагон"]
[null,null,"вагон - склад - судно"]
[null,null,"вагон - склад - ролл трейлер"]
[null,null,"Доп. Услуги"]
[null,null,"Выпуск - погруз - поручение",null," "]
[null,null,"Сортировка (по инструкциям клиента)"]
[null,null,"Внутрипортовое экспедирование"]
[null,null,"Крепление"]
[]
[3,"Слябы черных металлов, вес грузового места свыше 25 до 35 тн","Вагон"]
[null,null,"вагон - склад - судно"]
[null,null,"вагон - склад - ролл трейлер"]
[null,null,"Доп. Услуги"," "]
[null,null,"Выпуск - погруз - поручение"]
[null,null,"Сортировка (по инструкциям клиента)"]
[null,null,"Внутрипортовое экспедирование"]
[null,null,"Крепление"]
[]
[4,"Оборудование, грузы в ящиках и без упаковки, вес грузового места 1001-3000кг","Вагон"]
[null,null,"вагон - склад - судно"]
[null,null,"вагон - крытый склад - судно"]
[null,null,"вагон - склад - контейнер"]
[null,null,"вагон - крытый склад - контейнер"]
[null,null,"вагон - склад - ролл трейлер"]
[null,null,"вагон - крытый склад - ролл трейлер"]
[null,null,"судно - склад - вагон"]
[null,null,"судно - крытый склад - вагон"]
[null,null,"контейнер - склад - вагон"]
[null,null,"контейнер - крытый склад - вагон"]
[null,null,"ролл трейлер - склад - вагон"]
[null,null,"ролл трейлер - крытый склад - вагон"]
[null,null,"Авто"]
[null,null,"авто - склад - судно"]
[null,null,"авто - крытый склад - судно"]
[null,null,"авто - склад - контейнер"," "]
[null,null,"авто - крытый склад - контейнер",null," "]
[null,null,"авто - склад - ролл трейлер",null," "]
[null,null,"авто - крытый склад - ролл трейлер"," ",null,null,null,null,null," "]
[null,null,"судно - склад - авто"]
[null,null,"судно - крытый склад - авто"]
[null,null,"контейнер - склад - авто"," ",null," "]
[null,null,"контейнер - крытый склад - авто",null," "]
[null,null,"ролл трейлер - склад - авто",null," "]
[null,null,"ролл трейлер - крытый склад - авто"," ",null,null,null,null,null," "]
[null,null,"Доп. Услуги",null,null,null,null,null,null,null," "]
[null,null,"Подработка",null,null,null,null,null,null," "]
[null,null,"Выпуск - погруз - поручение"]
[null,null,"Переупакова"]
[null,null,"Сортировка (по инструкциям клиента)"]
[null,null,"Внутрипортовое экспедирование"]
[null,null,"Крепление"]
[]
[5,"Металлы длиной 8,1-14 м (вкл. тмд)","Вагон"]
[null,null,"вагон - склад - судно"]
[null,null,"вагон - склад - ролл трейлер"]
[null,null,"судно - склад - вагон"]
[null,null,"ролл трейлер - склад - вагон"]
[null,null,"Авто"]
[null,null,"авто - склад - судно"]
[null,null,"авто - склад - ролл трейлер"]
[null,null,"судно - склад - авто"]
[null,null,"ролл трейлер - склад - авто"]
[null,null,"Доп. Услуги"]
[null,null,"Подработка",null," "]
[null,null,"Выпуск - погруз - поручение"," ",null," ",null,null,null," "]
[null,null,"Переупакова",null," "," "]
[null,null,"Сортировка (по инструкциям клиента)"]
[null,null,"Внутрипортовое экспедирование"]
[null,null,"Крепление"]
[]
[6,"Пакеты на разовых поддонах, вес грузового места 601-900кг","Вагон"]
[null,null,"вагон - склад - судно"]
[null,null,"вагон - крытый склад - судно"]
[null,null,"вагон - склад - контейнер"]
[null,null,"вагон - крытый склад - контейнер"]
[null,null,"вагон - склад - ролл трейлер"]
[null,null,"вагон - крытый склад - ролл трейлер"]
[null,null,"судно - склад - вагон"]
[null,null,"судно - крытый склад - вагон"]
[null,null,"контейнер - склад - вагон"]
[null,null,"контейнер - крытый склад - вагон"]
[null,null,"ролл трейлер - склад - вагон"]
[null,null,"ролл трейлер - крытый склад - вагон"]
[null,null,"Авто"]
[null,null,"авто - склад - судно"]
[null,null,"авто - крытый склад - судно"]
[null,null,"авто - склад - контейнер"]
[null,null,"авто - крытый склад - контейнер"," "]
[null,null,"авто - склад - ролл трейлер",null," "]
[null,null,"авто - крытый склад - ролл трейлер",null," "]
[null,null,"судно - склад - авто"]
[null,null,"судно - крытый склад - авто"]
[null,null,"контейнер - склад - авто"]
[null,null,"контейнер - крытый склад - авто"]
[null,null,"ролл трейлер - склад - авто"]
[null,null,"ролл трейлер - крытый склад - авто"]
[null,null,"Доп. Услуги",null,null,null,null,null,null," "]
[null,null,"Подработка",null,null,null,null,null,null,null," "]
[null,null,"Выпуск - погруз - поручение",null,null,null,null,null,null," "]
[null,null,"Переупакова"]
[null,null,"Сортировка (по инструкциям клиента)"]
[null,null,"Внутрипортовое экспедирование"]
[null,null,"Крепление"]
[null,null,"Паллетизация"]
[]
[7,"Трубы б/уп. диам.до 1420 см,\n длиной 8,1-14м\n","Вагон"]
[null,null,"вагон - склад - судно"]
[null,null,"вагон - склад - ролл трейлер"]
[null,null,"судно - склад - вагон"]
[null,null,"ролл трейлер - склад - вагон"]
[null,null,"Авто",null,null,null,null,null,null,null," "]
[null,null,"авто - склад - судно",null,null,null,null,null,null," "]
[null,null,"авто - склад - ролл трейлер"]
[null,null,"судно - склад - авто",null,null," "]
[null,null,"ролл трейлер - склад - авто",null,null," "]
[null,null,"Доп. Услуги",null," "]
[null,null,"Выпуск - погруз - поручение",null," "]
[null,null,"Сортировка (по инструкциям клиента)"]
[null,null,"Внутрипортовое экспедирование"]
[null,null,"Маркировка"]
[null,null,"Крепление"]
[null,null,null,null,null,null,null,null," "]
[8,"Оборудование, грузы в ящиках и без упаковки, вес грузового места 3001-5000кг","Вагон"]
[null,null,"вагон - склад - судно"]
[null,null,"вагон - крытый склад - судно",null," "]
[null,null,"вагон - склад - контейнер"]
[null,null,"вагон - крытый склад - контейнер"]
[null,null,"вагон - склад - ролл трейлер"]
[null,null,"вагон - крытый склад - ролл трейлер",null,null,null,null,null,null,null," "]
[null,null,"Авто"]
[null,null,"авто - склад - судно"]
[null,null,"авто - крытый склад - судно"]
[null,null,"авто - склад - контейнер"]
[null,null,"авто - крытый склад - контейнер"]
[null,null,"авто - склад - ролл трейлер",null,null," "]
[null,null,"авто - крытый склад - ролл трейлер",null," "]
[null,null,"Доп. Услуги",null," "]
[null,null,"Подработка"]
[null,null,"Выпуск - погруз - поручение"]
[null,null,"Переупакова"]
[null,null,"Сортировка (по инструкциям клиента)"]
[null,null,"Внутрипортовое экспедирование"]
[null,null,"Крепление"]
[]
[9,"20' контейнеры с насыпными и навалочными грузами","Вагон"]
[null,null,"вагон - склад - судно"]
[null,null,"судно - склад - вагон"]
[null,null,"Авто"]
[null,null,"авто - склад - судно"]
[null,null,"судно - склад - авто"]
[null,null,"Доп. Услуги",null,null," "]
[null,null,"Выпуск - погруз - поручение"," "]
[null,null,"Внутрипортовое экспедирование"]
[]
[10,"Оборудование, грузы в ящиках и без упаковки, вес грузового места 5001-10000кг","Вагон"]
[null,null,"вагон - склад - судно"]
[null,null,"вагон - крытый склад - судно"]
[null,null,"вагон - склад - контейнер",null," "]
[null,null,"вагон - крытый склад - контейнер"]
[null,null,"вагон - склад - ролл трейлер"]
[null,null,"вагон - крытый склад - ролл трейлер"]
[null,null,"Авто"]
[null,null,"авто - склад - судно"]
[null,null,"авто - крытый склад - судно"]
[null,null,"авто - склад - контейнер"]
[null,null,"авто - крытый склад - контейнер"," "]
[null,null,"авто - склад - ролл трейлер"]
[null,null,"авто - крытый склад - ролл трейлер"]
[null,null,"Доп. Услуги",null," "]
[null,null,"Подработка",null," "]
[null,null,"Выпуск - погруз - поручение",null,null,null,null,null,null," "]
[null,null,"Переупакова"]
[null,null,"Сортировка (по инструкциям клиента)"]
[null,null,"Внутрипортовое экспедирование"]
[null,null,"Крепление"]
[]
[11,"Грузы в ящиках и без упаковки с погр.объемом от 4 м³/тн; тяжеловесные грузы с любым погрузочным объемом класса Т - 0","Вагон"]
[null,null,"вагон - склад - судно"]
[null,null,"вагон - крытый склад - судно"]
{"$rows_left_out":167}
{"sheet":"Данные","index":1,"n_rows":22,"n_cols":10,"rows_kept":22,"cut":false,"hidden":false,"merged":[[3,6,4,6]]}
[null,null,null,null,null,null,"Список","Направление груза","Тип склада"]
[null,null,null,null,null,null,2,1,1]
[]
["Выпадающий список",null,"Выпадающий список",null,"Выпадающий список",null,"Выпадающий список"]
["Выберите тип груза",0,"Выберите направление груза",0,"Выберите тип склада",0,null,"Цена","формула"]
["1). Металлы в чушках, плитках, карандашах (в пакетах), вес грузового места до 1000кг",0,"import",1,"Открытый",2,false,1,{"$f":"IF(G6,H6)","v":false}]
["2). Слябы черных металлов, вес грузового места 15-25 тн",0,"export",2,"Крытый",3,false,2,{"$f":"IF(G7,H7)","v":false}]
["3). Слябы черных металлов, вес грузового места свыше 25 до 35 тн",0,null,null,null,null,false,3,{"$f":"IF(G8,H8)","v":false}]
["4). Оборудование, грузы в ящиках и без упаковки, вес грузового места 1001-3000кг",0,null,null,null,null,false,4,{"$f":"IF(Данные!G9,Данные!H9,\"\")","v":""}]
["5). Металлы длиной 8,1-14 м (вкл. тмд)",0,null,null,null,null,false,5,{"$f":"IF(Данные!G10,Данные!H10,\"\")","v":""}," "]
["6). Пакеты на разовых поддонах, вес грузового места 601-900кг",0,null,null,null,null,false,6,{"$f":"IF(Данные!G11,Данные!H11,\"\")","v":""}]
["7). Трубы б/уп. диаметром до 1420 см, длиной 8,1-14м",0,null,null,null,null,false,7,{"$f":"IF(Данные!G12,Данные!H12,\"\")","v":""}]
["8). Оборудование, грузы в ящиках и без упаковки, вес грузового места 3001-5000кг",0]
["9). 20' контейнеры с насыпными и навалочными грузами",0]
["10). Оборудование, грузы в ящиках и без упаковки, вес грузового места 5001-10000кг",0]
["11). Грузы в ящиках и без упаковки с погр.объемом от 4 м³/тн; тяжеловесные грузы с любым погрузочным объемом класса Т - 0",0]
["12). Контейнеры груженые (порожние),       20, 40' футовые (шт)",0]
["13). Строп-пакеты, строп-контейнеры, мягкие контейнеры с сыпучими грузами, вес места 901-1500кг",0]
["14). Лесные пакетированные грузы (фанера, ДВП, ДСП, пиломатериалы)",0]
["15). Листовая сталь",0]
["16). Сталь в рулонах",0]
["17). Грузы в мешках не паллетизированные весом до 50 кг",0]

{"sheet":"Лист3","index":2,"n_rows":20,"n_cols":4,"rows_kept":20,"cut":false,"hidden":false,"merged":[[9,1,15,6]]}
[]
[]
[]
[]
[]
[]
[]
[]
[]
[]
[]
[]
[]
[]
[]
[]
[]
[]
[]
[null,null,"Итог:",{"$f":"CHOOSE(Данные!G2,Данные!B5,Данные!B6,Данные!B7,Данные!B8,Данные!B9,Данные!B10,Данные!B11,Данные!B12,Данные!B13,Данные!B14,Данные!B15,Данные!B16,Данные!B17,Данные!B18,Данные!B19,Данные!B20,Данные!B21,Данные!B22)+CHOOSE(Данные!H2,Данные!D5,Данные!D6,Данные!D7)+CHOOSE(Данные!I2,Данные!F5,Данные!F6,Данные!F7)+SUM(Данные!I6,Данные!I7,Данные!I8,Данные!I9,Данные!I10,Данные!I11,Данные!I12)","v":0}]

{"sheet":"Лист2","index":3,"n_rows":366,"n_cols":12,"rows_kept":366,"cut":false,"hidden":false,"merged":[[307,0,338,0],[307,1,338,1],[340,0,365,0],[340,1,365,1],[233,0,266,0],[233,1,266,1],[268,0,288,0],[268,1,288,1],[290,0,305,0],[290,1,305,1],[175,0,195,0],[175,1,195,1],[197,0,217,0],[197,1,217,1],[219,0,231,0],[219,1,231,1],[126,0,141,0],[126,1,141,1],[143,0,163,0],[143,1,163,1],[165,0,173,0],[165,1,173,1],[39,0,71,0],[39,1,71,1],[73,0,89,0],[73,1,89,1],[91,0,124,0],[91,1,124,1],[2,0,19,0],[2,1,19,1],[21,0,28,0],[21,1,28,1],[30,0,37,0],[30,1,37,1]]}
["№","Наименование груза","Каталог сервисов","Импорт","Экспорт","Рентабельность руб.","Рентабельность %"]
[]
[1,"Металлы в чушках, плитках, карандашах (в пакетах), вес грузового места до 1000кг","Вагон"]
[null,null,"вагон - склад - судно",null,"вагон - склад - судно"]
[null,null,"вагон - крытый склад - судно",null,"вагон - крытый склад - судно"]
[null,null,"вагон - склад - контейнер",null,"вагон - склад - контейнер"]
[null,null,"вагон - крытый склад - контейнер",null,"вагон - крытый склад - контейнер"]
[null,null,"Авто"]
[null,null,"авто - склад - судно",null,"авто - склад - судно",null,null,null,null,null," "]
[null,null,"авто - крытый склад - судно",null,"авто - крытый склад - судно"]
[null,null,"авто - склад - контейнер",null,"авто - склад - контейнер"]
[null,null,"авто - крытый склад - контейнер",null,"авто - крытый склад - контейнер",null,null,null,null,null,null," "]
[null,null,"Доп. Услуги"," ",null," "]
[null,null,"Подработка",null,null,null,null,null,null," "]
[null,null,"Выпуск - погруз - поручение"]
[null,null,"Переупаковка"]
[null,null,"Сортировка (по инструкциям клиента)"]
[null,null,"Внутрипортовое экспедирование"]
[null,null,"Маркировка"]
[null,null,"Крепление"]
[]
[2,"Слябы черных металлов, вес грузового места 15-25 тн","Вагон"]
[null,null,"вагон - склад - судно",null,"вагон - склад - судно"]
[null,null,"вагон - склад - ролл трейлер",null,"вагон - склад - ролл трейлер"]
[null,null,"Доп. Услуги"]
[null,null,"Выпуск - погруз - поручение",null," "]
[null,null,"Сортировка (по инструкциям клиента)"]
[null,null,"Внутрипортовое экспедирование"]
[null,null,"Крепление"]
[]
[3,"Слябы черных металлов, вес грузового места свыше 25 до 35 тн","Вагон"]
[null,null,"вагон - склад - судно",null,"вагон - склад - судно"]
[null,null,"вагон - склад - ролл трейлер",null,"вагон - склад - ролл трейлер",null,null,null,null,null," "]
[null,null,"Доп. Услуги"," "]
[null,null,"Выпуск - погруз - поручение"]
[null,null,"Сортировка (по инструкциям клиента)"]
[null,null,"Внутрипортовое экспедирование"]
[null,null,"Крепление"]
[]
[4,"Оборудование, грузы в ящиках и без упаковки, вес грузового места 1001-3000кг","Вагон"]
[null,null,"вагон - склад - судно",null,"вагон - склад - судно"]
[null,null,"вагон - крытый склад - судно",null,"вагон - крытый склад - судно"]
[null,null,"вагон - склад - контейнер",null,"вагон - склад - контейнер"]
[null,null,"вагон - крытый склад - контейнер",null,"вагон - крытый склад - контейнер"]
[null,null,"вагон - склад - ролл трейлер",null,"вагон - склад - ролл трейлер"]
[null,null,"вагон - крытый склад - ролл трейлер",null,"вагон - крытый склад - ролл трейлер"]
[null,null,"судно - склад - вагон","судно - склад - вагон"]
[null,null,"судно - крытый склад - вагон","судно - крытый склад - вагон"]
[null,null,"контейнер - склад - вагон","контейнер - склад - вагон"]
[null,null,"контейнер - крытый склад - вагон","контейнер - крытый склад - вагон"]
[null,null,"ролл трейлер - склад - вагон","ролл трейлер - склад - вагон"]
[null,null,"ролл трейлер - крытый склад - вагон","ролл трейлер - крытый склад - вагон"]
[null,null,"Авто"]
[null,null,"авто - склад - судно",null,"авто - склад - судно"]
[null,null,"авто - крытый склад - судно",null,"авто - крытый склад - судно"]
[null,null,"авто - склад - контейнер"," ","авто - склад - контейнер"]
[null,null,"авто - крытый склад - контейнер",null,"авто - крытый склад - контейнер"]
[null,null,"авто - склад - ролл трейлер",null,"авто - склад - ролл трейлер"]
[null,null,"авто - крытый склад - ролл трейлер"," ","авто - крытый склад - ролл трейлер"]
[null,null,"судно - склад - авто","судно - склад - авто"]
[null,null,"судно - крытый склад - авто","судно - крытый склад - авто"]
[null,null,"контейнер - склад - авто","контейнер - склад - авто",null," "]
[null,null,"контейнер - крытый склад - авто","контейнер - крытый склад - авто"," "]
[null,null,"ролл трейлер - склад - авто","ролл трейлер - склад - авто"," "]
[null,null,"ролл трейлер - крытый склад - авто","ролл трейлер - крытый склад - авто"]
[null,null,"Доп. Услуги"]
[null,null,"Подработка"]
[null,null,"Выпуск - погруз - поручение"]
[null,null,"Переупакова"]
[null,null,"Сортировка (по инструкциям клиента)"]
[null,null,"Внутрипортовое экспедирование"]
[null,null,"Крепление"]
[]
[5,"Металлы длиной 8,1-14 м (вкл. тмд)","Вагон"]
[null,null,"вагон - склад - судно",null,"вагон - склад - судно"]
[null,null,"вагон - склад - ролл трейлер",null,"вагон - склад - ролл трейлер"]
[null,null,"судно - склад - вагон","судно - склад - вагон"]
[null,null,"ролл трейлер - склад - вагон","ролл трейлер - склад - вагон"]
[null,null,"Авто"]
[null,null,"авто - склад - судно",null,"авто - склад - судно"]
[null,null,"авто - склад - ролл трейлер",null,"авто - склад - ролл трейлер"]
[null,null,"судно - склад - авто","судно - склад - авто"]
[null,null,"ролл трейлер - склад - авто","ролл трейлер - склад - авто"]
[null,null,"Доп. Услуги"]
[null,null,"Подработка",null," "]
[null,null,"Выпуск - погруз - поручение"," ",null," "]
[null,null,"Переупакова",null," "," "]
[null,null,"Сортировка (по инструкциям клиента)"]
[null,null,"Внутрипортовое экспедирование"]
[null,null,"Крепление"]
[]
[6,"Пакеты на разовых поддонах, вес грузового места 601-900кг","Вагон"]
[null,null,"вагон - склад - судно",null,"вагон - склад - судно"]
[null,null,"вагон - крытый склад - судно",null,"вагон - крытый склад - судно"]
[null,null,"вагон - склад - контейнер",null,"вагон - склад - контейнер"]
[null,null,"вагон - крытый склад - контейнер",null,"вагон - крытый склад - контейнер"]
[null,null,"вагон - склад - ролл трейлер",null,"вагон - склад - ролл трейлер"]
[null,null,"вагон - крытый склад - ролл трейлер",null,"вагон - крытый склад - ролл трейлер"]
[null,null,"судно - склад - вагон","судно - склад - вагон"]
[null,null,"судно - крытый склад - вагон","судно - крытый склад - вагон"]
[null,null,"контейнер - склад - вагон","контейнер - склад - вагон"]
[null,null,"контейнер - крытый склад - вагон","контейнер - крытый склад - вагон"]
[null,null,"ролл трейлер - склад - вагон","ролл трейлер - склад - вагон"]
[null,null,"ролл трейлер - крытый склад - вагон","ролл трейлер - крытый склад - вагон"]
[null,null,"Авто"]
[null,null,"авто - склад - судно",null,"авто - склад - судно"]
[null,null,"авто - крытый склад - судно",null,"авто - крытый склад - судно"]
[null,null,"авто - склад - контейнер",null,"авто - склад - контейнер"]
[null,null,"авто - крытый склад - контейнер"," ","авто - крытый склад - контейнер"]
[null,null,"авто - склад - ролл трейлер",null,"авто - склад - ролл трейлер"]
[null,null,"авто - крытый склад - ролл трейлер",null,"авто - крытый склад - ролл трейлер"]
[null,null,"судно - склад - авто","судно - склад - авто"]
[null,null,"судно - крытый склад - авто","судно - крытый склад - авто"]
[null,null,"контейнер - склад - авто","контейнер - склад - авто"]
[null,null,"контейнер - крытый склад - авто","контейнер - крытый склад - авто"]
[null,null,"ролл трейлер - склад - авто","ролл трейлер - склад - авто"]
[null,null,"ролл трейлер - крытый склад - авто","ролл трейлер - крытый склад - авто"]
[null,null,"Доп. Услуги"]
[null,null,"Подработка"]
[null,null,"Выпуск - погруз - поручение"]
[null,null,"Переупакова"]
[null,null,"Сортировка (по инструкциям клиента)"]
[null,null,"Внутрипортовое экспедирование"]
[null,null,"Крепление"]
[null,null,"Паллетизация"]
[]
[7,"Трубы б/уп. диам.до 1420 см,\n длиной 8,1-14м\n","Вагон"]
[null,null,"вагон - склад - судно",null,"вагон - склад - судно"]
[null,null,"вагон - склад - ролл трейлер",null,"вагон - склад - ролл трейлер"]
[null,null,"судно - склад - вагон","судно - склад - вагон"]
[null,null,"ролл трейлер - склад - вагон","ролл трейлер - склад - вагон"]
[null,null,"Авто"]
[null,null,"авто - склад - судно",null,"авто - склад - судно"]
[null,null,"авто - склад - ролл трейлер",null,"авто - склад - ролл трейлер"]
[null,null,"судно - склад - авто","судно - склад - авто",null," "]
[null,null,"ролл трейлер - склад - авто","ролл трейлер - склад - авто",null," "]
[null,null,"Доп. Услуги",null," "]
[null,null,"Выпуск - погруз - поручение",null," "]
[null,null,"Сортировка (по инструкциям клиента)"]
[null,null,"Внутрипортовое экспедирование"]
[null,null,"Маркировка"]
[null,null,"Крепление"]
[]
[8,"Оборудование, грузы в ящиках и без упаковки, вес грузового места 3001-5000кг","Вагон"]
[null,null,"вагон - склад - судно",null,"вагон - склад - судно"]
[null,null,"вагон - крытый склад - судно",null,"вагон - крытый склад - судно"]
[null,null,"вагон - склад - контейнер",null,"вагон - склад - контейнер"]
[null,null,"вагон - крытый склад - контейнер",null,"вагон - крытый склад - контейнер"]
[null,null,"вагон - склад - ролл трейлер",null,"вагон - склад - ролл трейлер"]
[null,null,"вагон - крытый склад - ролл трейлер",null,"вагон - крытый склад - ролл трейлер"]
[null,null,"Авто"]
[null,null,"авто - склад - судно",null,"авто - склад - судно"]
[null,null,"авто - крытый склад - судно",null,"авто - крытый склад - судно"]
[null,null,"авто - склад - контейнер",null,"авто - склад - контейнер"]
[null,null,"авто - крытый склад - контейнер",null,"авто - крытый склад - контейнер"]
[null,null,"авто - склад - ролл трейлер",null,"авто - склад - ролл трейлер"," "]
[null,null,"авто - крытый склад - ролл трейлер",null,"авто - крытый склад - ролл трейлер"]
[null,null,"Доп. Услуги",null," "]
[null,null,"Подработка"]
[null,null,"Выпуск - погруз - поручение"]
[null,null,"Переупакова"]
[null,null,"Сортировка (по инструкциям клиента)"]
[null,null,"Внутрипортовое экспедирование"]
[null,null,"Крепление"]
[]
[9,"20' контейнеры с насыпными и навалочными грузами","Вагон"]
[null,null,"вагон - склад - судно",null,"вагон - склад - судно"]
[null,null,"судно - склад - вагон",null,"судно - склад - вагон"]
[null,null,"Авто"]
[null,null,"авто - склад - судно",null,"авто - склад - судно"]
[null,null,"судно - склад - авто",null,"судно - склад - авто"]
[null,null,"Доп. Услуги",null,null," "]
[null,null,"Выпуск - погруз - поручение"," "]
[null,null,"Внутрипортовое экспедирование"]
[]
[10,"Оборудование, грузы в ящиках и без упаковки, вес грузового места 5001-10000кг","Вагон"]
[null,null,"вагон - склад - судно",null,"вагон - склад - судно"]
[null,null,"вагон - крытый склад - судно",null,"вагон - крытый склад - судно"]
[null,null,"вагон - склад - контейнер",null,"вагон - склад - контейнер"]
[null,null,"вагон - крытый склад - контейнер",null,"вагон - крытый склад - контейнер"]
[null,null,"вагон - склад - ролл трейлер",null,"вагон - склад - ролл трейлер"]
[null,null,"вагон - крытый склад - ролл трейлер",null,"вагон - крытый склад - ролл трейлер"]
[null,null,"Авто"]
[null,null,"авто - склад - судно","авто - склад - судно"]
[null,null,"авто - крытый склад - судно","авто - крытый склад - судно"]
[null,null,"авто - склад - контейнер","авто - склад - контейнер"]
[null,null,"авто - крытый склад - контейнер","авто - крытый склад - контейнер"]
[null,null,"авто - склад - ролл трейлер","авто - склад - ролл трейлер"]
[null,null,"авто - крытый склад - ролл трейлер","авто - крытый склад - ролл трейлер"]
[null,null,"Доп. Услуги",null," "]
[null,null,"Подработка",null," "]
[null,null,"Выпуск - погруз - поручение"]
[null,null,"Переупакова"]
[null,null,"Сортировка (по инструкциям клиента)"]
[null,null,"Внутрипортовое экспедирование"]
[null,null,"Крепление"]
[]
[11,"Грузы в ящиках и без упаковки с погр.объемом от 4 м³/тн; тяжеловесные грузы с любым погрузочным объемом класса Т - 0","Вагон"]
[null,null,"вагон - склад - судно",null,"вагон - склад - судно"]
[null,null,"вагон - крытый склад - судно",null,"вагон - крытый склад - судно"]
{"$rows_left_out":166}