{"text_format":"1","workbook":"xlsx","n_sheets":3,"sheets":["Доверенность","Паспортные данные","Реестр доверенностей"],"not_rendered":{"charts":0,"images":0,"macros":1,"external_links":0,"defined_names":1,"comments":0,"pivot_tables":0},"unopened":[],"bounds":{"document_bytes":16777216,"sheet_cells":100000,"rows_first":2000,"rows_last":500,"rows_between":2000,"halvings":0,"cell_chars":16384,"cell_head_chars":4096},"cells_cut":0,"cells_raw":0,"read":"whole","date_system":"1900"}

{"sheet":"Доверенность","index":0,"n_rows":50,"n_cols":76,"rows_kept":50,"cut":false,"hidden":false,"merged":[[40,51,42,66],[47,51,48,66],[36,0,36,6],[36,7,36,59],[36,60,36,67],[36,68,36,76],[49,28,50,45],[43,22,44,45],[38,41,38,57],[38,2,38,39],[38,59,38,66],[42,2,45,3],[41,8,43,21],[48,8,49,27],[40,22,42,45],[47,28,48,45],[49,51,50,66],[43,51,44,66],[35,68,35,76],[1,0,1,2],[1,3,1,9],[1,10,1,18],[1,19,1,35],[2,0,3,2],[28,14,28,46],[34,0,34,76],[1,36,1,51],[1,73,1,76],[2,3,3,9],[2,10,3,18],[2,19,2,35],[0,36,0,51],[0,19,0,35],[35,0,35,6],[35,7,35,59],[35,60,35,67],[22,1,22,4],[10,72,10,73],[22,38,22,75],[0,73,0,76],[0,3,0,9],[4,0,4,76],[0,52,0,72],[1,52,1,72],[2,52,3,72],[2,73,3,76],[0,0,0,2],[0,10,0,18],[2,36,3,51],[15,25,15,42],[15,43,15,65],[10,1,10,11],[17,1,17,32],[6,70,7,75],[10,13,10,70],[21,1,21,75],[20,1,20,75],[13,56,13,63],[3,19,3,35],[11,72,11,73],[10,75,11,75],[13,31,13,53],[17,33,17,62],[31,1,31,16],[31,18,31,75],[22,6,22,33],[22,35,22,36],[28,47,28,48],[26,1,26,14],[26,16,26,25],[26,27,26,29],[26,32,26,46],[29,18,29,75],[29,1,29,16],[23,38,23,75],[19,1,19,75],[18,1,18,75],[24,1,24,22],[32,30,32,75],[25,52,25,75],[27,11,27,75],[27,1,27,8],[24,52,24,75],[24,24,24,48],[28,1,28,13],[30,18,30,75],[25,24,25,48]]}
["№ дове-\nрен.",null,null,"Дата\nвыдачи",null,null,null,null,null,null,"Срок\nдей-\nствия",null,null,null,null,null,null,null,null,"Должность и фамилия\nлица, которому выдана\nдоверенность",null,null,null,null,null,null,null,null,null,null,null,null,null,null,null,null,"Расписка в\nполучении\nдоверенности",null,null,null,null,null,null,null,null,null,null,null,null,null,null,null,"Поставщик",null,null,null,null,null,null,null,null,null,null,null,null,null,null,null,null,null,null,null,null,"Полученная сумма"]
[1,null,null,2,null,null,null,null,null,null,3,null,null,null,null,null,null,null,null,4,null,null,null,null,null,null,null,null,null,null,null,null,null,null,null,null,5,null,null,null,null,null,null,null,null,null,null,null,null,null,null,null,6,null,null,null,null,null,null,null,null,null,null,null,null,null,null,null,null,null,null,null,null,7]
[82,null,null,{"$f":"NOW()","v":"2014-08-12T15:42:43.830"},null,null,null,null,null,null,{"$f":"D3+10","v":"2014-08-22T15:42:43.830"},null,null,null,null,null,null,null,null,{"$f":"VLOOKUP(\"х\",'Паспортные данные'!A3:J22,10,FALSE)","v":"МПП"},null,null,null,null,null,null,null,null,null,null,null,null,null,null,null,null," ",null,null,null,null,null,null,null,null,null,null,null,null,null,null,null," ",null,null,null,null,null,null,null,null,null,null,null,null,null,null,null,null,null,null,null,null," "]
[null,null,null,null,null,null,null,null,null,null,null,null,null,null,null,null,null,null,null,{"$f":"VLOOKUP(\"х\",'Паспортные данные'!A3:J22,2,FALSE)","v":"Бендер Остап Ибрагимович"}]
["ЛИНИЯ ОТРЕЗА"]
[]
[null,null,null,null,null,null,null,null,null,null,null,null,null,null,null,null,null,null,null,null,null,null,null,null,null,null,null,null,null,null,null,null,null,null,null,null,null,null,null,null,null,null,null,null,null,null,null,null,null,null,null,null,null,null,null,null,null,null,null,null,null,null,null,null,null,null,null,null,null,null,"Типовая межотраслевая форма № М-2"]
[]
[]
[null,null,null,null,null,null,null,null,null,null,null,null,null,null,null,null,null,null,null,null,null,null,null,null,null,null,null,null,null,null,null,null,null,null,null,null,null,null,null,null,null,null,null,null,null,null,null,null,null,null,null,null,null,null,null,null,null,null,null,null,null,null,null,null,null,null,null,null,null,null,null,null,null,null,null,"Коды"]
[null,"Организация",null,null,null,null,null,null,null,null,null,null,null,"Общество с ограниченной ответственностью \"Рога и копыта\"",null,null,null,null,null,null,null,null,null,null,null,null,null,null,null,null,null,null,null,null,null,null,null,null,null,null,null,null,null,null,null,null,null,null,null,null,null,null,null,null,null,null,null,null,null,null,null,null,null,null,null,null,null,null,null,null,null,null,"Форма по ОКУД",null,null," "]
[null,null,null,null,null,null,null,null,null,null,null,null,null,null,null,null,null,null,null,null,null,null,null,null,null,null,null,null,null,null,null,null,null,null,null,null,null,null,null,null,null,null,null,null,null,null,null,null,null,null,null,null,null,null,null,null,null,null,null,null,null,null,null,null,null,null,null,null,null,null,null,null,"по ОКПО"]
[]
[null,null,null,null,null,null,null,null,null,null,null,null,null,null,null,null,null,null,null,null,null,null,null,null,null,null,null,null,null,null,null,"ДОВЕРЕННОСТЬ №",null,null,null,null,null,null,null,null,null,null,null,null,null,null,null,null,null,null,null,null,null,null,null,null,{"$f":"A3","v":82}]
[]
[null,null,null,null,null,null,null,null,null,null,null,null,null,null,null,null,null,null,null,null,null,null,null,null,null,"Дата выдачи ",null,null,null,null,null,null,null,null,null,null,null,null,null,null,null,null,null,{"$f":"D3","v":"2014-08-12T15:42:43.830"}]
[]
[null,"Доверенность действительна по \"",null,null,null,null,null,null,null,null,null,null,null,null,null,null,null,null,null,null,null,null,null,null,null,null,null,null,null,null,null,null,null,{"$f":"K3","v":"2014-08-22T15:42:43.830"}]
[null,{"$f":"N11","v":"Общество с ограниченной ответственностью \"Рога и копыта\""}]
[null,"наименование потребителя и его адрес"]
[null,{"$f":"N11","v":"Общество с ограниченной ответственностью \"Рога и копыта\""}]
[null,"наименование плательщика и его адрес"]
[null,"Счет №",null,null,null,null," 40702810738100000000 ",null,null,null,null,null,null,null,null,null,null,null,null,null,null,null,null,null,null,null,null,null,null,null,null,null,null,null,null,"в",null,null," ОАО АКБ “АВАНГАРД”  БИК 044525201"]
[null,null,null,null,null,null,null,null,null,null,null,null,null,null,null,null,null,null,null,null,null,null,null,null,null,null,null,null,null,null,null,null,null,null,null,null,null,null,"наименование банка"]
[null,"Доверенность выдана",null,null,null,null,null,null,null,null,null,null,null,null,null,null,null,null,null,null,null,null,null,null,{"$f":"T3","v":"МПП"},null,null,null,null,null,null,null,null,null,null,null,null,null,null,null,null,null,null,null,null,null,null,null,null,null,null,null,{"$f":"T4","v":"Бендер Остап Ибрагимович"}]
[null,null,null,null,null,null,null,null,null,null,null,null,null,null,null,null,null,null,null,null,null,null,null,null,"должность",null,null,null,null,null,null,null,null,null,null,null,null,null,null,null,null,null,null,null,null,null,null,null,null,null,null,null,"фамилия, имя, отчество"]
[null,"Паспорт: серия",null,null,null,null,null,null,null,null,null,null,null,null,null,null,{"$f":"VLOOKUP(\"х\",'Паспортные данные'!A3:J22,6,FALSE)","v":0},null,null,null,null,null,null,null,null,null,null,"№",null,null,null,null,{"$f":"VLOOKUP(\"х\",'Паспортные данные'!A3:J22,7,FALSE)","v":0}]
[null,"Кем выдан",null,null,null,null,null,null,null,null,null,{"$f":"VLOOKUP(\"х\",'Паспортные данные'!A3:J22,8,FALSE)","v":0}]
[null,"Дата выдачи \"",null,null,null,null,null,null,null,null,null,null,null,null,{"$f":"VLOOKUP(\"х\",'Паспортные данные'!A3:J22,9,FALSE)","v":"00:00:00"},null,null,null,null,null,null,null,null,null,null,null,null,null,null,null,null,null,null,null,null,null,null,null,null,null,null,null,null,null,null,null,null,"г."]
[null,"На получение от",null,null,null,null,null,null,null,null,null,null,null,null,null,null,null,null," "]
[null,null,null,null,null,null,null,null,null,null,null,null,null,null,null,null,null,null,"наименование поставщика"]
[null,"денежных средств ",null,null,null,null,null,null,null,null,null,null,null,null,null,null,null,null," "]
[null,null,null,null,null,null,null,null,null,null,null,null,null,null,null,null,null,null,null,null,null,null,null,null,null,null,null,null,null,null,"Сумма прописью"]
[]
["Перечень товарно-материальных ценностей, подлежащих получению"]
["Номер по\nпорядку",null,null,null,null,null,null,"Материальные\nценности",null,null,null,null,null,null,null,null,null,null,null,null,null,null,null,null,null,null,null,null,null,null,null,null,null,null,null,null,null,null,null,null,null,null,null,null,null,null,null,null,null,null,null,null,null,null,null,null,null,null,null,null,"Единица\nизмерения",null,null,null,null,null,null,null,"Количество\n(прописью)"]
[1,null,null,null,null,null,null,2,null,null,null,null,null,null,null,null,null,null,null,null,null,null,null,null,null,null,null,null,null,null,null,null,null,null,null,null,null,null,null,null,null,null,null,null,null,null,null,null,null,null,null,null,null,null,null,null,null,null,null,null,3,null,null,null,null,null,null,null,4]
[]
[null,null,"Подпись лица, получившего доверенность",null,null,null,null,null,null,null,null,null,null,null,null,null,null,null,null,null,null,null,null,null,null,null,null,null,null,null,null,null,null,null,null,null,null,null,null,null,null," ",null,null,null,null,null,null,null,null,null,null,null,null,null,null,null,null,null,"удостоверяем"]
[]
[null,null,null,null,null,null,null,null,null,null,null,null,null,null,null,null,null,null,null,null,null,null," ",null,null,null,null,null,null,null,null,null,null,null,null,null,null,null,null,null,null,null,null,null,null,null,null,null,null,null,null,"Бендер О. И."]
[null,null,null,null,null,null,null,null,"Руководитель"]
[null,null,"М. П."]
[null,null,null,null,null,null,null,null,null,null,null,null,null,null,null,null,null,null,null,null,null,null,"подпись",null,null,null,null,null,null,null,null,null,null,null,null,null,null,null,null,null,null,null,null,null,null,null,null,null,null,null,null,"расшифровка подписи"]
[]
[]
[]
[null,null,null,null,null,null,null,null,null,null,null,null,null,null,null,null,null,null,null,null,null,null,null,null,null,null,null,null," ",null,null,null,null,null,null,null,null,null,null,null,null,null,null,null,null,null,null,null,null,null,null,"Бендер О. И."]
[null,null,null,null,null,null,null,null,"Главный бухгалтер"]
[null,null,null,null,null,null,null,null,null,null,null,null,null,null,null,null,null,null,null,null,null,null,null,null,null,null,null,null,"подпись",null,null,null,null,null,null,null,null,null,null,null,null,null,null,null,null,null,null,null,null,null,null,"расшифровка подписи"]

{"sheet":"Паспортные данные","index":1,"n_rows":22,"n_cols":10,"rows_kept":22,"cut":false,"hidden":false,"merged":[[0,9,1,9],[0,0,1,0],[0,1,1,1],[0,5,0,8],[0,2,1,2],[0,3,1,3],[0,4,1,4]]}
["х","ФИО","Фамилия","Имя","Отчество","Паспортные данные",null,null,null,"Должность"]
[null,null,null,null,null,"Серия","№","Кем выдан","Дата выдачи"]
[null,{"$f":"CONCATENATE(C3,\" \",D3, \" \",E3)","v":"Пониковский Яков  Самуэльевич"},"Пониковский","Яков"," Самуэльевич",null,null,null,null,"РГ"]
[null,"Балаганов Шура Оттович","Балаганов","Шура","Оттович",null,null,null,null,"РГ"]
["х",{"$f":"CONCATENATE(C5,\" \",D5, \" \",E5)","v":"Бендер Остап Ибрагимович"},"Бендер","Остап","Ибрагимович",null,null,null,null,"МПП"]
[]
[]
[]
[]
[]
[]
[]
[]
[]
[null,"  "]
[null,"  "]
[null,"  "]
[null,"  "]
[null,"  "]
[null,"  "]
[null,"  "]
[null,"  "]

{"sheet":"Реестр доверенностей","index":2,"n_rows":254,"n_cols":7,"rows_kept":254,"cut":false,"hidden":false,"merged":[]}
["№","Дата выдачи","Действительна до","ФИО","Возврат корешка","Сроки",{"$f":"NOW()","v":"2014-08-12T15:42:43.830"}]
[1,"2014-06-16",{"$f":"B2+10","v":"2014-06-26"},null,"х",{"$f":"IF(E2=\"х\",0,C2-$G$1)","v":0}]
[2,"2014-06-16","2014-06-26",null,"х",0]
[3,"2014-06-16","2014-06-26",null,"х",0]
[4,"2014-06-16","2014-06-26",null,"х",0]
[5,"2014-06-16","2014-06-26",null,"х",0]
[6,"2014-06-17","2014-06-27",null,"х",0]
[7,"2014-06-17","2014-06-27",null,"х",0]
[8,"2014-06-17","2014-06-27",null,"х",0]
[9,"2014-06-17","2014-06-27",null,"х",0]
[10,"2014-06-17","2014-06-27",null,"х",0]
[11,"2014-06-17","2014-06-27",null,"х",0]
[12,"2014-06-18","2014-06-28",null,"х",0]
[13,"2014-06-18","2014-06-28",null,"х",0]
[14,"2014-06-19","2014-06-29",null,"х",0]
[15,"2014-06-19","2014-06-29",null,"х",0]
[16,"2014-06-19","2014-06-29",null,"х",0]
[17,"2014-06-20","2014-06-30",null,"х",0]
[18,"2014-06-23","2014-07-03",null,"х",0]
[19,"2014-06-25","2014-07-05",null,"х",0]
[20,"2014-06-26","2014-07-06",null,"х",0]
[21,"2014-06-26","2014-07-06",null,"х",0]
[22,"2014-06-26","2014-07-06",null,"х",0]
[23,"2014-06-27","2014-07-07",null,"х",0]
[24,"2014-06-30","2014-07-10",null,"х",0]
[25,"2014-06-30","2014-07-10",null,"х",0]
[26,"2014-06-30","2014-07-10",null,"х",0]
[27,"2014-07-01","2014-07-11",null,"х",0]
[28,"2014-07-01","2014-07-11",null,"х",0]
[29,"2014-07-08","2014-07-18",null,"х",0]
[30,"2014-07-08","2014-07-18",null,"х",0]
[31,"2014-07-08","2014-07-18",null,"х",0]
[32,"2014-07-08","2014-07-18",null,"х",0]
[33,"2014-07-08","2014-07-18",null,"х",0]
[34,"2014-07-14","2014-07-24",null,"х",0]
[35,"2014-07-14","2014-07-24",null,"х",0]
[36,"2014-07-14","2014-07-24",null,"х",0]
[37,"2014-07-14","2014-07-24",null,"х",0]
[38,"2014-07-14","2014-07-25",null,"х",0]
[39,"2014-07-14","2014-07-25",null,"х",0]
[40,"2014-07-16","2014-07-26",null,"х",0]
[41,"2014-07-16","2014-07-26",null,"х",0]
[42,"2014-07-17","2014-07-27",null,"х",0]
[43,"2014-07-17","2014-07-27",null,"х",0]
[44,"2014-07-17","2014-07-27",null,"х",0]
[45,"2014-07-18","2014-07-28",null,"х",0]
[46,"2014-07-18","2014-07-28",null,"х",0]
[47,"2014-07-18","2014-07-28",null,"х",0]
[48,"2014-07-21","2014-07-31",null,"х",0]
[49,"2014-07-21","2014-07-31",null,null,-12.654673958335479]
[50,"2014-07-21","2014-07-31",null,null,-12.654673958335479]
[51,"2014-07-21","2014-07-31",null,"х",0]
[52,"2014-07-21","2014-07-31",null,"х",0]
[53,"2014-07-21","2014-07-31",null,"х",0]
[54,"2014-07-21","2014-07-31",null,"х",0]
[55,"2014-07-21","2014-07-31",null,"х",0]
[56,"2014-07-21","2014-07-31",null,"х",0]
[57,"2014-07-22","2014-07-31",null,"х",0]
[58,"2014-07-23","2014-08-01",null,"х",0]
[59,"2014-07-23","2014-08-01",null,null,-11.654673958335479]
[60,"2014-07-25","2014-08-04",null,"х",0]
[61,"2014-07-28","2014-08-07",null,"х",0]
[62,"2014-07-28","2014-08-07",null,"х",0]
[63,"2014-07-28","2014-08-07",null,"х",0]
[64,"2014-07-28","2014-08-07",null,null,-5.6546739583354793]
[65,"2014-07-28","2014-08-07",null,"х",{"$f":"IF(E66=\"х\",0,C66-$G$1)","v":0}]
[66,"2014-07-28","2014-08-07",null,"х",0]
[67,"2014-07-29","2014-08-08",null,"х",0]
[68,"2014-07-29","2014-08-08",null,"х",0]
[69,"2014-07-30","2014-08-09",null,"х",0]
[70,"2014-07-30","2014-08-09",null,"х",0]
[71,"2014-07-30","2014-08-09",null,"х",0]
[72,"2014-07-30","2014-08-09",null,"х",0]
[73,"2014-07-30","2014-08-09",null,"х",0]
[74,"2014-07-30","2014-08-09",null,"х",0]
[75,"2014-07-30","2014-08-09",null,"х",0]
[76,"2014-07-31","2014-08-10",null,"х",0]
[77,"2014-07-31","2014-08-10",null,"х",0]
[78,"2014-08-04","2014-08-14",null,"х",0]
[79,"2014-08-08","2014-08-18",null,null,5.3453260416645207]
[80,"2014-08-08","2014-08-18",null,null,5.3453260416645207]
[81,"2014-08-12T15:41:22.540","2014-08-22T15:42:43.830",null,null,10]
[82,null,null,null,null,-41863.654673958335]
[83,null,null,null,null,-41863.654673958335]
[84,null,null,null,null,-41863.654673958335]
[85,null,null,null,null,-41863.654673958335]
[86,null,null,null,null,-41863.654673958335]
[87,null,null,null,null,-41863.654673958335]
[88,null,null,null,null,-41863.654673958335]
[89,null,null,null,null,-41863.654673958335]
[90,null,null,null,null,-41863.654673958335]
[91,null,null,null,null,-41863.654673958335]
[92,null,null,null,null,-41863.654673958335]
[93,null,null,null,null,-41863.654673958335]
[94,null,null,null,null,-41863.654673958335]
[95,null,null,null,null,-41863.654673958335]
[96,null,null,null,null,-41863.654673958335]
[97,null,null,null,null,-41863.654673958335]
[98,null,null,null,null,-41863.654673958335]
[99,null,null,null,null,-41863.654673958335]
[100,null,null,null,null,-41863.654673958335]
[101,null,null,null,null,-41863.654673958335]
[102,null,null,null,null,-41863.654673958335]
[103,null,null,null,null,-41863.654673958335]
[104,null,null,null,null,-41863.654673958335]
[105,null,null,null,null,-41863.654673958335]
[106,null,null,null,null,-41863.654673958335]
[107,null,null,null,null,-41863.654673958335]
[108,null,null,null,null,-41863.654673958335]
[109,null,null,null,null,-41863.654673958335]
[110,null,null,null,null,-41863.654673958335]
[111,null,null,null,null,-41863.654673958335]
[112,null,null,null,null,-41863.654673958335]
[113,null,null,null,null,-41863.654673958335]
[114,null,null,null,null,-41863.654673958335]
[115,null,null,null,null,-41863.654673958335]
[116,null,null,null,null,-41863.654673958335]
[117,null,null,null,null,-41863.654673958335]
[118,null,null,null,null,-41863.654673958335]
[119,null,null,null,null,-41863.654673958335]
[120,null,null,null,null,-41863.654673958335]
[121,null,null,null,null,-41863.654673958335]
[122,null,null,null,null,-41863.654673958335]
[123,null,null,null,null,-41863.654673958335]
[124,null,null,null,null,-41863.654673958335]
[125,null,null,null,null,-41863.654673958335]
[126,null,null,null,null,-41863.654673958335]
[127,null,null,null,null,-41863.654673958335]
[128,null,null,null,null,-41863.654673958335]
[129,null,null,null,null,{"$f":"IF(E130=\"х\",0,C130-$G$1)","v":-41863.654673958335}]
[130,null,null,null,null,-41863.654673958335]
[131,null,null,null,null,-41863.654673958335]
[132,null,null,null,null,-41863.654673958335]
[133,null,null,null,null,-41863.654673958335]
[134,null,null,null,null,-41863.654673958335]
[135,null,null,null,null,-41863.654673958335]
[136,null,null,null,null,-41863.654673958335]
[137,null,null,null,null,-41863.654673958335]
[138,null,null,null,null,-41863.654673958335]
[139,null,null,null,null,-41863.654673958335]
[140,null,null,null,null,-41863.654673958335]
[141,null,null,null,null,-41863.654673958335]
[142,null,null,null,null,-41863.654673958335]
[143,null,null,null,null,-41863.654673958335]
[144,null,null,null,null,-41863.654673958335]
[145,null,null,null,null,-41863.654673958335]
[146,null,null,null,null,-41863.654673958335]
[147,null,null,null,null,-41863.654673958335]
[148,null,null,null,null,-41863.654673958335]
[149,null,null,null,null,-41863.654673958335]
[150,null,null,null,null,-41863.654673958335]
[151,null,null,null,null,-41863.654673958335]
[152,null,null,null,null,-41863.654673958335]
[153,null,null,null,null,-41863.654673958335]
[154,null,null,null,null,-41863.654673958335]
[155,null,null,null,null,-41863.654673958335]
[156,null,null,null,null,-41863.654673958335]
[157,null,null,null,null,-41863.654673958335]
[158,null,null,null,null,-41863.654673958335]
[159,null,null,null,null,-41863.654673958335]
[160,null,null,null,null,-41863.654673958335]
[161,null,null,null,null,-41863.654673958335]
[162,null,null,null,null,-41863.654673958335]
[163,null,null,null,null,-41863.654673958335]
[164,null,null,null,null,-41863.654673958335]
[165,null,null,null,null,-41863.654673958335]
[166,null,null,null,null,-41863.654673958335]
[167,null,null,null,null,-41863.654673958335]
[168,null,null,null,null,-41863.654673958335]
[169,null,null,null,null,-41863.654673958335]
[170,null,null,null,null,-41863.654673958335]
[171,null,null,null,null,-41863.654673958335]
[172,null,null,null,null,-41863.654673958335]
[173,null,null,null,null,-41863.654673958335]
[174,null,null,null,null,-41863.654673958335]
[175,null,null,null,null,-41863.654673958335]
[176,null,null,null,null,-41863.654673958335]
[177,null,null,null,null,-41863.654673958335]
[178,null,null,null,null,-41863.654673958335]
[179,null,null,null,null,-41863.654673958335]
[180,null,null,null,null,-41863.654673958335]
[181,null,null,null,null,-41863.654673958335]
[182,null,null,null,null,-41863.654673958335]
[183,null,null,null,null,-41863.654673958335]
[184,null,null,null,null,-41863.654673958335]
[185,null,null,null,null,-41863.654673958335]
[186,null,null,null,null,-41863.654673958335]
[187,null,null,null,null,-41863.654673958335]
[188,null,null,null,null,-41863.654673958335]
[189,null,null,null,null,-41863.654673958335]
[190,null,null,null,null,-41863.654673958335]
[191,null,null,null,null,-41863.654673958335]
[192,null,null,null,null,-41863.654673958335]
[193,null,null,null,null,{"$f":"IF(E194=\"х\",0,C194-$G$1)","v":-41863.654673958335}]
[194,null,null,null,null,-41863.654673958335]
[195,null,null,null,null,-41863.654673958335]
[196,null,null,null,null,-41863.654673958335]
[197,null,null,null,null,-41863.654673958335]
[198,null,null,null,null,-41863.654673958335]
[199,null,null,null,null,-41863.654673958335]
[200,null,null,null,null,-41863.654673958335]
[201,null,null,null,null,-41863.654673958335]
[202,null,null,null,null,-41863.654673958335]
[203,null,null,null,null,-41863.654673958335]
[204,null,null,null,null,-41863.654673958335]
[205,null,null,null,null,-41863.654673958335]
[206,null,null,null,null,-41863.654673958335]
[207,null,null,null,null,-41863.654673958335]
[208,null,null,null,null,-41863.654673958335]
[209,null,null,null,null,-41863.654673958335]
[210,null,null,null,null,-41863.654673958335]
[211,null,null,null,null,-41863.654673958335]
[212,null,null,null,null,-41863.654673958335]
[213,null,null,null,null,-41863.654673958335]
[214,null,null,null,null,-41863.654673958335]
[215,null,null,null,null,-41863.654673958335]
[216,null,null,null,null,-41863.654673958335]
[217,null,null,null,null,-41863.654673958335]
[218,null,null,null,null,-41863.654673958335]
[219,null,null,null,null,-41863.654673958335]
[220,null,null,null,null,-41863.654673958335]
[221,null,null,null,null,-41863.654673958335]
[222,null,null,null,null,-41863.654673958335]
[223,null,null,null,null,-41863.654673958335]
[224,null,null,null,null,-41863.654673958335]
[225,null,null,null,null,-41863.654673958335]
[226,null,null,null,null,-41863.654673958335]
[227,null,null,null,null,-41863.654673958335]
[228,null,null,null,null,-41863.654673958335]
[229,null,null,null,null,-41863.654673958335]
[230,null,null,null,null,-41863.654673958335]
[231,null,null,null,null,-41863.654673958335]
[232,null,null,null,null,-41863.654673958335]
[233,null,null,null,null,-41863.654673958335]
[234,null,null,null,null,-41863.654673958335]
[235,null,null,null,null,-41863.654673958335]
[236,null,null,null,null,-41863.654673958335]
[237,null,null,null,null,-41863.654673958335]
[238,null,null,null,null,-41863.654673958335]
[239,null,null,null,null,-41863.654673958335]
[240,null,null,null,null,-41863.654673958335]
[241,null,null,null,null,-41863.654673958335]
[242,null,null,null,null,-41863.654673958335]
[243,null,null,null,null,-41863.654673958335]
[244,null,null,null,null,-41863.654673958335]
[245,null,null,null,null,-41863.654673958335]
[246,null,null,null,null,-41863.654673958335]
[247,null,null,null,null,-41863.654673958335]
[248,null,null,null,null,-41863.654673958335]
[249,null,null,null,null,-41863.654673958335]
[250,null,null,null,null,-41863.654673958335]
[251,null,null,null,null,-41863.654673958335]
[252,null,null,null,null,-41863.654673958335]
[253,null,null,null,null,-41863.654673958335]