{"text_format":"1","workbook":"xlsx","n_sheets":3,"sheets":["Август","Sheet1","Sheet2"],"not_rendered":{"charts":0,"images":0,"macros":1,"external_links":1,"defined_names":6,"comments":0,"pivot_tables":0},"unopened":[],"bounds":{"document_bytes":16777216,"sheet_cells":100000,"rows_first":2000,"rows_last":500,"rows_between":2000,"halvings":0,"cell_chars":16384,"cell_head_chars":4096},"cells_cut":0,"cells_raw":0,"read":"whole","date_system":"1900"}

{"sheet":"Август","index":0,"n_rows":142,"n_cols":16,"rows_kept":142,"cut":false,"hidden":false,"merged":[]}
["Segment","PG","PM","Item","Description1","Description2","Qty","TotalPriceRub","BatchNumber","DelDate","DaysOfStorage","Date of the notice","Photo","Comments","Move to ","Date of answer"]
["BIG","BR",{"$f":"VLOOKUP(B2,Sheet2!A:B,2,0)","v":"Ota E. & Goloshchapov A."},"1320B014                           ","MAINTENANCE C MC-10",{"$f":"VLOOKUP(E2,[1]Sheet1!G:H,2,0)","v":"картридж для сбора чернил"},1,601.67235891999997,"110000104631","2013-12-18",222.41914351852029,"2014-08-20",null,null,"Pack Dam","2014-08-20"]
["BIG","BR",{"$f":"VLOOKUP(B3,Sheet2!A:B,2,0)","v":"Ota E. & Goloshchapov A."},"3160B001                           ","ROLL UNIT/BASKET RB-01 IP",{"$f":"VLOOKUP(E3,[1]Sheet1!G:H,2,0)","v":"второй рулон и корзина"},1,17240.002942269999,"110000138548","2013-11-13",257.41914351852029,"2014-08-20",null,null,"Pack Dam","2014-08-20"]
["BIG","BR",{"$f":"VLOOKUP(B4,Sheet2!A:B,2,0)","v":"Ota E. & Goloshchapov A."},"QM3-5938-020000                    ","CARRIAGE UNIT",{"$f":"VLOOKUP(E4,[1]Sheet1!G:H,2,0)","v":"КАРЕТКА"},1,916.75582798000005,"110000142756","2013-12-28",212.41914351852029,"2014-08-20",null,null,"Pack Dam","2014-08-20"]
["BIG","CF",{"$f":"VLOOKUP(B5,Sheet2!A:B,2,0)","v":"Merkulov Y."},"2840B003                           ","DADF-AB1 (A)",{"$f":"VLOOKUP(E5,[1]Sheet1!G:H,2,0)","v":"автоподатчик документов"},2,3840.6462652800001,"110000156783","2014-07-19",9.4191435185202863,"2014-08-20",null,null,"Pack Dam","2014-08-20"]
["BIG","CX",{"$f":"VLOOKUP(B6,Sheet2!A:B,2,0)","v":"Merkulov Y."},"1068B002                           ","C-EXV 16 TONER C EUR",{"$f":"VLOOKUP(E6,[1]Sheet1!G:H,2,0)","v":"тонер синий"},1,10621.366816580001,"110000130903","2013-09-07",324.41914351852029,"2014-08-20",null,null,"Pack Dam","2014-08-20"]
["BIG","CX",{"$f":"VLOOKUP(B7,Sheet2!A:B,2,0)","v":"Merkulov Y."},"2772B003AA  000                    ","DRUM UNIT C-EXV32/33",{"$f":"VLOOKUP(E7,[1]Sheet1!G:H,2,0)","v":"БАРАБАН IR 2520/2525/2530"},2,4387.4730118500001,"110000153345","2014-06-04",54.419143518520286,"2014-08-20",null,null,"Pack Dam","2014-08-20"]
["BIG","CX",{"$f":"VLOOKUP(B8,Sheet2!A:B,2,0)","v":"Merkulov Y."},"2789B002                           ","C-EXV 28 TONER BK EUR",{"$f":"VLOOKUP(E8,[1]Sheet1!G:H,2,0)","v":"Тонер черный"},1,4387.4730118500001,"110000105052","2013-01-23",551.41914351852029,"2014-08-20",null,null,"Pack Dam","2014-08-20"]
["BIG","CX",{"$f":"VLOOKUP(B9,Sheet2!A:B,2,0)","v":"Merkulov Y."},"2793B002                           ","C-EXV 28 TONER C EUR",{"$f":"VLOOKUP(E9,[1]Sheet1!G:H,2,0)","v":"Тонер голубой"},1,8774.9460237000003,"110000105053","2013-01-23",551.41914351852029,"2014-08-20",null,null,"Pack Dam","2014-08-20"]
["BIG","CX",{"$f":"VLOOKUP(B10,Sheet2!A:B,2,0)","v":"Merkulov Y."},"2797B002                           ","C-EXV 28 TONER M EUR",{"$f":"VLOOKUP(E10,[1]Sheet1!G:H,2,0)","v":"Тонер пурпурный"},1,125.26218434,"110000105003","2013-01-23",551.41914351852029,"2014-08-20",null,null,"Pack Dam","2014-08-20"]
["BIG","CX",{"$f":"VLOOKUP(B11,Sheet2!A:B,2,0)","v":"Merkulov Y."},"2801B002                           ","C-EXV 28 TONER Y EUR",{"$f":"VLOOKUP(E11,[1]Sheet1!G:H,2,0)","v":"Тонер желтый"},1,3840.6462652800001,"110000105055","2013-01-23",551.41914351852029,"2014-08-20",null,null,"Pack Dam","2014-08-20"]
["BIG","CX",{"$f":"VLOOKUP(B12,Sheet2!A:B,2,0)","v":"Merkulov Y."},"3787B003AA  000                    ","DRUM UNIT C-EXV-34 C",{"$f":"VLOOKUP(E12,[1]Sheet1!G:H,2,0)","v":"ФОТОБАРАБАН"},1,1651.8870801400001,"110000146047","2014-02-21",157.41914351852029,"2014-08-20",null,null,"Pack Dam","2014-08-20"]
["BIG","CX",{"$f":"VLOOKUP(B13,Sheet2!A:B,2,0)","v":"Merkulov Y."},"6837A003AA  000                    ","DRUM UNIT C-EXV5   <C>",{"$f":"VLOOKUP(E13,[1]Sheet1!G:H,2,0)","v":"барабан"},1,3770.7800770000003,"110000133660","2013-10-04",297.41914351852029,"2014-08-20",null,null,"Pack Dam","2014-08-26"]
["BIG","CX",{"$f":"VLOOKUP(B14,Sheet2!A:B,2,0)","v":"Merkulov Y."},"FC0-1881-000000                    ","PLATE, PAPER SIZE",{"$f":"VLOOKUP(E14,[1]Sheet1!G:H,2,0)","v":"ШКАЛА РАЗМЕРА БУМАГИ"},1,0,"110000121357","2013-06-03",420.41914351852029,"2014-08-20",null,null,"Damage","2014-08-26"]
["BIG","CX",{"$f":"VLOOKUP(B15,Sheet2!A:B,2,0)","v":"Merkulov Y."},"FM1-C081-010000                    ","BUSHING",{"$f":"VLOOKUP(E15,[1]Sheet1!G:H,2,0)","v":"ВТУЛКА"},1,5904.1733332200001,"110000143851","2014-01-30",179.41914351852029,"2014-08-20",null,null,"Damage","2014-08-26"]
["BIG","CX",{"$f":"VLOOKUP(B16,Sheet2!A:B,2,0)","v":"Merkulov Y."},"1069B002                           ","C-EXV 16 TONER BK EUR","тонер черный",1,2094.19982239,"110000150892","2014-07-15",{"$f":"TODAY()-J16","v":56},null,null,null,"Damage","2014-09-05T14:47:07"]
["BIG","GJ",{"$f":"VLOOKUP(B17,Sheet2!A:B,2,0)","v":"Ota E. & Goloshchapov A."},"0172B001                           ","BCI-1441 Y FOR W8400",{"$f":"VLOOKUP(E17,[1]Sheet1!G:H,2,0)","v":"чернила желтые"},2,8426.9628099600013,"110000079495","2012-04-25",824.41914351852029,"2014-08-20",null,null,"Damage","2014-08-20"]
["BIG","GJ",{"$f":"VLOOKUP(B18,Sheet2!A:B,2,0)","v":"Ota E. & Goloshchapov A."},"0886B001                           ","PFI-101 Y",{"$f":"VLOOKUP(E18,[1]Sheet1!G:H,2,0)","v":"чернила желтые"},1,17806.203529580001,"110000133739","2014-07-05",23.419143518520286,"2014-08-20",null,null,"Pack Dam","2014-08-20"]
["BIG","GJ",{"$f":"VLOOKUP(B19,Sheet2!A:B,2,0)","v":"Ota E. & Goloshchapov A."},"0901B005                           ","PFI-701 C",{"$f":"VLOOKUP(E19,[1]Sheet1!G:H,2,0)","v":"чернила голубые"},1,1313.2111935099999,"110000143942","2014-01-31",178.41914351852029,"2014-08-20",null,null,"Damage","2014-08-20"]
["BIG","GJ",{"$f":"VLOOKUP(B20,Sheet2!A:B,2,0)","v":"Ota E. & Goloshchapov A."},"0903B005                           ","PFI-701 Y",{"$f":"VLOOKUP(E20,[1]Sheet1!G:H,2,0)","v":"чернила желтые"},2,4608.2544551199999,"110000143944","2014-01-31",178.41914351852029,"2014-08-20",null,null,"Pack Dam","2014-08-20"]
["BIG","GJ",{"$f":"VLOOKUP(B21,Sheet2!A:B,2,0)","v":"Ota E. & Goloshchapov A."},"0904B005                           ","PFI-701 PC",{"$f":"VLOOKUP(E21,[1]Sheet1!G:H,2,0)","v":"чернила голубые"},1,278998.51659953,"110000143945","2014-01-31",178.41914351852029,"2014-08-20",null,null,"Damage","2014-08-20"]
["BIG","GJ",{"$f":"VLOOKUP(B22,Sheet2!A:B,2,0)","v":"Ota E. & Goloshchapov A."},"2964B001                           ","PFI-703 C",{"$f":"VLOOKUP(E22,[1]Sheet1!G:H,2,0)","v":"чернила голубые"},1,5135.7787335899993,"110000143175","2014-01-22",187.41914351852029,"2014-08-20",null,null,"Damage","2014-08-20"]
["BIG","GJ",{"$f":"VLOOKUP(B23,Sheet2!A:B,2,0)","v":"Ota E. & Goloshchapov A."},"2965B001                           ","PFI-703 M",{"$f":"VLOOKUP(E23,[1]Sheet1!G:H,2,0)","v":"чернила малиновые"},1,1000.8415529599999,"110000143190","2014-01-22",187.41914351852029,"2014-08-20",null,null,"Damage","2014-08-20"]
["BIG","GJ",{"$f":"VLOOKUP(B24,Sheet2!A:B,2,0)","v":"Ota E. & Goloshchapov A."},"6687B001                           ","Red Ink Tank PFI-706 R (E",{"$f":"VLOOKUP(E24,[1]Sheet1!G:H,2,0)","v":"чернильница"},1,3770.7800770000003,"110000154624","2014-06-20",38.419143518520286,"2014-08-20",null,null,"Pack Dam","2014-08-26"]
["BIG","GJ",{"$f":"VLOOKUP(B25,Sheet2!A:B,2,0)","v":"Ota E. & Goloshchapov A."},"7569A001                           ","BCI-1401 C FOR W7250/64D",{"$f":"VLOOKUP(E25,[1]Sheet1!G:H,2,0)","v":"чернила синие"},4,916.75582798000005,"110000068605","2013-09-05",326.41914351852029,"2014-08-20",null,null,"Damage","2014-08-26"]
["BIG","GJ",{"$f":"VLOOKUP(B26,Sheet2!A:B,2,0)","v":"Ota E. & Goloshchapov A."},"7569A001                           ","BCI-1401 C FOR W7250/64D",{"$f":"VLOOKUP(E26,[1]Sheet1!G:H,2,0)","v":"чернила синие"},1,942.69501925000009,"110000068831","2013-08-08",354.41914351852029,"2014-08-20",null,null,"Damage","2014-08-26"]
["BIG","GJ",{"$f":"VLOOKUP(B27,Sheet2!A:B,2,0)","v":"Ota E. & Goloshchapov A."},"7569A001                           ","BCI-1401 C FOR W7250/64D",{"$f":"VLOOKUP(E27,[1]Sheet1!G:H,2,0)","v":"чернила синие"},1,3770.7800770000003,"110000068831","2013-06-10",413.41914351852029,"2014-08-20",null,null,"Pack Dam","2014-08-26"]
["BIG","GJ",{"$f":"VLOOKUP(B28,Sheet2!A:B,2,0)","v":"Ota E. & Goloshchapov A."},"7569A001                           ","BCI-1401 C FOR W7250/64D",{"$f":"VLOOKUP(E28,[1]Sheet1!G:H,2,0)","v":"чернила синие"},1,1885.3900385000002,"110000068831","2013-04-11",473.41914351852029,"2014-08-20",null,null,"Pack Dam","2014-08-26"]
["BIG","GJ",{"$f":"VLOOKUP(B29,Sheet2!A:B,2,0)","v":"Ota E. & Goloshchapov A."},"7572A001                           ","BCI-1401 PC FOR W7250/64D",{"$f":"VLOOKUP(E29,[1]Sheet1!G:H,2,0)","v":"чернила синие (фото)"},4,942.69501925000009,"110000068607","2013-09-05",326.41914351852029,"2014-08-20",null,null,"Damage","2014-08-26"]
["BIG","GJ",{"$f":"VLOOKUP(B30,Sheet2!A:B,2,0)","v":"Ota E. & Goloshchapov A."},"7572A001                           ","BCI-1401 PC FOR W7250/64D",{"$f":"VLOOKUP(E30,[1]Sheet1!G:H,2,0)","v":"чернила синие (фото)"},1,957.56065392000005,"110000068607","2013-09-05",326.41914351852029,"2014-08-20",null,null,"Damage","2014-08-26"]
["BIG","GJ",{"$f":"VLOOKUP(B31,Sheet2!A:B,2,0)","v":"Ota E. & Goloshchapov A."},"7572A001                           ","BCI-1401 PC FOR W7250/64D",{"$f":"VLOOKUP(E31,[1]Sheet1!G:H,2,0)","v":"чернила синие (фото)"},2,916.75582798000005,"110000068607","2013-08-08",354.41914351852029,"2014-08-20",null,null,"A-stock","2014-08-26"]
["BIG","GJ",{"$f":"VLOOKUP(B32,Sheet2!A:B,2,0)","v":"Ota E. & Goloshchapov A."},"7572A001                           ","BCI-1401 PC FOR W7250/64D",{"$f":"VLOOKUP(E32,[1]Sheet1!G:H,2,0)","v":"чернила синие (фото)"},1,916.75582798000005,"110000068607","2013-07-19",374.41914351852029,"2014-08-20",null,null,"A-stock","2014-08-26"]
["BIG","GJ",{"$f":"VLOOKUP(B33,Sheet2!A:B,2,0)","v":"Ota E. & Goloshchapov A."},"7573A001                           ","BCI-1401 PM FOR W7250/64D",{"$f":"VLOOKUP(E33,[1]Sheet1!G:H,2,0)","v":"чернила красные (фото)"},1,29,"110000076196","2013-09-05",326.41914351852029,"2014-08-20",null,null,"Pack Dam","2014-08-26"]
["BIG","GJ",{"$f":"VLOOKUP(B34,Sheet2!A:B,2,0)","v":"Ota E. & Goloshchapov A."},"7573A001                           ","BCI-1401 PM FOR W7250/64D",{"$f":"VLOOKUP(E34,[1]Sheet1!G:H,2,0)","v":"чернила красные (фото)"},4,957.56065392000005,"110000068608","2013-09-05",326.41914351852029,"2014-08-20",null,null,"Pack Dam","2014-08-26"]
["BIG","GJ",{"$f":"VLOOKUP(B35,Sheet2!A:B,2,0)","v":"Ota E. & Goloshchapov A."},"7573A001                           ","BCI-1401 PM FOR W7250/64D",{"$f":"VLOOKUP(E35,[1]Sheet1!G:H,2,0)","v":"чернила красные (фото)"},1,957.56065392000005,"110000076196","2013-07-19",374.41914351852029,"2014-08-20",null,null,"Damage","2014-08-26"]
["BIG","GJ",{"$f":"VLOOKUP(B36,Sheet2!A:B,2,0)","v":"Ota E. & Goloshchapov A."},"7573A001                           ","BCI-1401 PM FOR W7250/64D",{"$f":"VLOOKUP(E36,[1]Sheet1!G:H,2,0)","v":"чернила красные (фото)"},1,1442.3319804999999,"110000076196","2013-07-03",390.41914351852029,"2014-08-20",null,null,"Damage","2014-08-26"]
["BIG","GJ",{"$f":"VLOOKUP(B37,Sheet2!A:B,2,0)","v":"Ota E. & Goloshchapov A."},"7573A001                           ","BCI-1401 PM FOR W7250/64D",{"$f":"VLOOKUP(E37,[1]Sheet1!G:H,2,0)","v":"чернила красные (фото)"},1,3668.3860302000003,"110000076196","2012-03-22",858.41914351852029,"2014-08-20",null,null,"Pack Dam","2014-08-26"]
["BIG","GJ",{"$f":"VLOOKUP(B38,Sheet2!A:B,2,0)","v":"Ota E. & Goloshchapov A."},"5313B001                           ","Photo Grey Ink Tank PFI-2","чернильница",2,5289.8371213800001,"110000118276","2014-07-18",{"$f":"TODAY()-J38","v":53},"2014-08-26",null,"Pictures were sent"]
["BIG","SD",{"$f":"VLOOKUP(B39,Sheet2!A:B,2,0)","v":"Lebedev A."},"8116B015                           ","varioPRINT 135 Series Mai",{"$f":"VLOOKUP(E39,[1]Sheet1!G:H,2,0)","v":"Печатный модуль"},1,3668.3860302000003,"110000150991","2014-06-09",49.419143518520286,"2014-08-20",null,null,"Pack Dam","2014-08-26"]
["BIG","SH",{"$f":"VLOOKUP(B40,Sheet2!A:B,2,0)","v":"Ota E. & Goloshchapov A."},"6362B001                           ","TONER 500 G, 2 BOTTLES, B","Тонер",2,3893.5358206900005,"110000156931","2014-07-23",{"$f":"TODAY()-J40","v":48}]
["BIG","SR",{"$f":"VLOOKUP(B41,Sheet2!A:B,2,0)","v":"Ota E. & Goloshchapov A."},"7673B020                           ","IJM009 DRAFT75 50X0,914 3",{"$f":"VLOOKUP(E41,[1]Sheet1!G:H,2,0)","v":"Бумага IJM009"},1,3668.3860302000003,"110000153026","2014-05-28",61.419143518520286,"2014-08-20",null,null,"Pack Dam","2014-08-26"]
["LASER","BF",{"$f":"VLOOKUP(B42,Sheet2!A:B,2,0)","v":"Suzuki T."},"8461A014                           ","PCFC FC108 RUSSIA DG.M",{"$f":"VLOOKUP(E42,[1]Sheet1!G:H,2,0)","v":"копировальный аппарат"},1,4213.4830070899998,"110000063511","2011-10-28",1004.4191435185203,"2014-08-20",null,null,"Damage","2014-08-20"]
["LASER","CH",{"$f":"VLOOKUP(B43,Sheet2!A:B,2,0)","v":"Bondarenko M. & Suzuki T."},"4509B043                           ","LASER MFP I-SENSYS MF4410",{"$f":"VLOOKUP(E43,[1]Sheet1!G:H,2,0)","v":"Лазерное МФУ MF4410"},1,4639.9223863500001,"110000150949","2014-04-24",95.419143518520286,"2014-08-20",null,null,"Damage","2014-08-20"]
["LASER","CH",{"$f":"VLOOKUP(B44,Sheet2!A:B,2,0)","v":"Bondarenko M. & Suzuki T."},"4509B043                           ","LASER MFP I-SENSYS MF4410",{"$f":"VLOOKUP(E44,[1]Sheet1!G:H,2,0)","v":"Лазерное МФУ MF4410"},1,4158.2814318000001,"110000147328","2014-03-04",146.41914351852029,"2014-08-20",null,null,"Damage","2014-08-20"]
["LASER","CH",{"$f":"VLOOKUP(B45,Sheet2!A:B,2,0)","v":"Bondarenko M. & Suzuki T."},"4509B043                           ","LASER MFP I-SENSYS MF4410",{"$f":"VLOOKUP(E45,[1]Sheet1!G:H,2,0)","v":"Лазерное МФУ MF4410"},1,4195.30138635,"110000144311","2014-02-10",168.41914351852029,"2014-08-20",null,null,"Damage","2014-08-20"]
["LASER","CH",{"$f":"VLOOKUP(B46,Sheet2!A:B,2,0)","v":"Bondarenko M. & Suzuki T."},"4509B043                           ","LASER MFP I-SENSYS MF4410",{"$f":"VLOOKUP(E46,[1]Sheet1!G:H,2,0)","v":"Лазерное МФУ MF4410"},1,4228.0888257399993,"110000140605","2013-12-12",228.41914351852029,"2014-08-20",null,null,"Damage","2014-08-20"]
["LASER","CH",{"$f":"VLOOKUP(B47,Sheet2!A:B,2,0)","v":"Bondarenko M. & Suzuki T."},"4509B043                           ","LASER MFP I-SENSYS MF4410",{"$f":"VLOOKUP(E47,[1]Sheet1!G:H,2,0)","v":"Лазерное МФУ MF4410"},3,12627.380113559999,"110000135987","2013-10-21",280.41914351852029,"2014-08-20",null,null,"Damage","2014-08-20"]
["LASER","CH",{"$f":"VLOOKUP(B48,Sheet2!A:B,2,0)","v":"Bondarenko M. & Suzuki T."},"4509B043                           ","LASER MFP I-SENSYS MF4410",{"$f":"VLOOKUP(E48,[1]Sheet1!G:H,2,0)","v":"Лазерное МФУ MF4410"},1,4091.8226893699998,"110000120113","2013-10-07",294.41914351852029,"2014-08-20",null,null,"Damage","2014-08-20"]
["LASER","CH",{"$f":"VLOOKUP(B49,Sheet2!A:B,2,0)","v":"Bondarenko M. & Suzuki T."},"4509B043                           ","LASER MFP I-SENSYS MF4410",{"$f":"VLOOKUP(E49,[1]Sheet1!G:H,2,0)","v":"Лазерное МФУ MF4410"},1,4091.8226893699998,"110000120113","2013-05-22",432.41914351852029,"2014-08-20",null,null,"Damage","2014-08-20"]
["LASER","CH",{"$f":"VLOOKUP(B50,Sheet2!A:B,2,0)","v":"Bondarenko M. & Suzuki T."},"4509B043                           ","LASER MFP I-SENSYS MF4410",{"$f":"VLOOKUP(E50,[1]Sheet1!G:H,2,0)","v":"Лазерное МФУ MF4410"},1,4091.8226893699998,"110000119961","2013-05-20",434.41914351852029,"2014-08-20",null,null,"Pack Dam","2014-08-20"]
["LASER","CH",{"$f":"VLOOKUP(B51,Sheet2!A:B,2,0)","v":"Bondarenko M. & Suzuki T."},"4509B140                           ","LASER I-SENSYS MF4550D MO",{"$f":"VLOOKUP(E51,[1]Sheet1!G:H,2,0)","v":"лазерное МФУ"},1,4401.00909452,"110000081614","2014-02-28",150.41914351852029,"2014-08-20",null,null,"Damage","2014-08-20"]
["LASER","CH",{"$f":"VLOOKUP(B52,Sheet2!A:B,2,0)","v":"Bondarenko M. & Suzuki T."},"4838B026                           ","LASER MFP I-SENSYS MF5940",{"$f":"VLOOKUP(E52,[1]Sheet1!G:H,2,0)","v":"Лазерное МФУ MF5940dn"},2,14021.49547118,"110000138269","2013-12-31",209.41914351852029,"2014-08-20",null,null,"Damage","2014-08-20"]
["LASER","CH",{"$f":"VLOOKUP(B53,Sheet2!A:B,2,0)","v":"Bondarenko M. & Suzuki T."},"5119B026                           ","LASER MFP I-SENSYS MF8080",{"$f":"VLOOKUP(E53,[1]Sheet1!G:H,2,0)","v":"многофункц. устр-во"},1,7156.4151415400001,"110000094113","2012-09-19",677.41914351852029,"2014-08-20",null,null,"Damage","2014-08-20"]
["LASER","CH",{"$f":"VLOOKUP(B54,Sheet2!A:B,2,0)","v":"Bondarenko M. & Suzuki T."},"5120B029                           ","LASER MFP I-SENSYS MF8360",{"$f":"VLOOKUP(E54,[1]Sheet1!G:H,2,0)","v":"многофункц. устр-во"},1,10040.559846550001,"110000088347","2012-07-24",734.41914351852029,"2014-08-20",null,null,"Damage","2014-08-20"]
["LASER","CH",{"$f":"VLOOKUP(B55,Sheet2!A:B,2,0)","v":"Bondarenko M. & Suzuki T."},"5120B029                           ","LASER MFP I-SENSYS MF8360",{"$f":"VLOOKUP(E55,[1]Sheet1!G:H,2,0)","v":"многофункц. устр-во"},1,10373.47872417,"110000077081","2012-03-31",849.41914351852029,"2014-08-20",null,null,"Pack Dam","2014-08-20"]
["LASER","CH",{"$f":"VLOOKUP(B56,Sheet2!A:B,2,0)","v":"Bondarenko M. & Suzuki T."},"5120B038                           ","LASER MFP I-SENSYS MF8380",{"$f":"VLOOKUP(E56,[1]Sheet1!G:H,2,0)","v":"многофункц. устр-во"},1,10977.545230959999,"110000101455","2012-11-15",620.41914351852029,"2014-08-20",null,null,"Pack Dam","2014-08-20"]
["LASER","CH",{"$f":"VLOOKUP(B57,Sheet2!A:B,2,0)","v":"Bondarenko M. & Suzuki T."},"5252B004                           ","LASER MFP I-SENSYS MF3010","Лазерное МФУ",1,3704.9644642600001,"110000148362","2014-07-05",23.419143518520286,"2014-08-20",null,null,"Pack Dam","2014-08-20"]
["LASER","CH",{"$f":"VLOOKUP(B58,Sheet2!A:B,2,0)","v":"Bondarenko M. & Suzuki T."},"5252B004                           ","LASER MFP I-SENSYS MF3010","Лазерное МФУ",1,4110.3131164799997,"110000149982","2014-04-10",109.41914351852029,"2014-08-20",null,null,"Pack Dam","2014-08-20"]
["LASER","CH",{"$f":"VLOOKUP(B59,Sheet2!A:B,2,0)","v":"Bondarenko M. & Suzuki T."},"5252B004                           ","LASER MFP I-SENSYS MF3010","Лазерное МФУ",4,14819.85785708,"110000148381","2014-03-18",132.41914351852029,"2014-08-20",null,null,"Pack Dam","2014-08-20"]
["LASER","CH",{"$f":"VLOOKUP(B60,Sheet2!A:B,2,0)","v":"Bondarenko M. & Suzuki T."},"5252B004                           ","LASER MFP I-SENSYS MF3010","Лазерное МФУ",2,7381.6823596800004,"110000135946","2013-10-29",272.41914351852029,"2014-08-20",null,null,"Pack Dam","2014-08-20"]
{"$rows_left_out":83}
{"sheet":"Sheet1","index":1,"n_rows":3,"n_cols":1,"rows_kept":3,"cut":false,"hidden":false,"merged":[]}
["Damage"]
["Pack Dam"]
["A-stock"]

{"sheet":"Sheet2","index":2,"n_rows":36,"n_cols":2,"rows_kept":36,"cut":false,"hidden":false,"merged":[]}
["Product Code","PM"]
["CF","Merkulov Y."]
["CG","Merkulov Y."]
["CX","Merkulov Y."]
["PF","Lebedev A."]
["PG","Lebedev A."]
["PX","Lebedev A."]
["SD","Lebedev A."]
["SJ","Lebedev A."]
["CR","Bondarenko M. & Suzuki T."]
["CH","Bondarenko M. & Suzuki T."]
["BF","Suzuki T."]
["GR","Bondarenko M."]
["GH","Bondarenko M."]
["GF","Bondarenko M."]
["EM","Bakulina E."]
["FX","Merkulov Y."]
["BR","Ota E. & Goloshchapov A."]
["GJ","Ota E. & Goloshchapov A."]
["SF","Ota E. & Goloshchapov A."]
["SH","Ota E. & Goloshchapov A."]
["SP","Ota E. & Goloshchapov A."]
["SQ","Ota E. & Goloshchapov A."]
["SR","Ota E. & Goloshchapov A."]
["AC","Bamburova A."]
["AD","Aleshina E."]
["BQ","Aleshina E."]
["VC","Tomomi T."]
["PJ","Tomomi T."]
["AN","Tomomi T."]
["CQ","Ivashkin A. & Yakhira M."]
["CD","Ivashkin A. & Yakhira M."]
["GQ","Kurakin A."]
["AJ","Ivashkin A. & Yakhira M."]
["BE","Kurakin A."]
["DU","Alekseev I."]