{"text_format":"1","workbook":"xlsx","n_sheets":3,"sheets":["Август","Sheet1","Sheet2"],"not_rendered":{"charts":0,"images":0,"macros":1,"external_links":1,"defined_names":6,"comments":0,"pivot_tables":0},"unopened":[],"bounds":{"document_bytes":16777216,"sheet_cells":100000,"rows_first":2000,"rows_last":500,"rows_between":2000,"halvings":0,"cell_chars":16384,"cell_head_chars":4096},"cells_cut":0,"cells_raw":0,"read":"whole","date_system":"1900"}

{"sheet":"Август","index":0,"n_rows":142,"n_cols":16,"rows_kept":142,"cut":false,"hidden":false,"merged":[]}
["Segment","PG","PM","Item","Description1","Description2","Qty","TotalPriceRub","BatchNumber","DelDate","DaysOfStorage","Date of the notice","Photo","Comments","Move to ","Date of answer"]
["BIG","BR",{"$f":"VLOOKUP(B2,Sheet2!A:B,2,0)","v":"Ota E. & Goloshchapov A."},"1320B014                           ","MAINTENANCE C MC-10",{"$f":"VLOOKUP(E2,[1]Sheet1!G:H,2,0)","v":"картридж для сбора чернил"},1,601.67235891999997,"110000104631","2013-12-18",222.41914351852029,"2014-08-20",null,null,"Pack Dam","2014-08-20"]
["BIG","BR",{"$f":"VLOOKUP(B3,Sheet2!A:B,2,0)","v":"Ota E. & Goloshchapov A."},"3160B001                           ","ROLL UNIT/BASKET RB-01 IP",{"$f":"VLOOKUP(E3,[1]Sheet1!G:H,2,0)","v":"второй рулон и корзина"},1,17240.002942269999,"110000138548","2013-11-13",257.41914351852029,"2014-08-20",null,null,"Pack Dam","2014-08-20"]
["BIG","BR",{"$f":"VLOOKUP(B4,Sheet2!A:B,2,0)","v":"Ota E. & Goloshchapov A."},"QM3-5938-020000                    ","CARRIAGE UNIT",{"$f":"VLOOKUP(E4,[1]Sheet1!G:H,2,0)","v":"КАРЕТКА"},1,916.75582798000005,"110000142756","2013-12-28",212.41914351852029,"2014-08-20",null,null,"Pack Dam","2014-08-20"]
["BIG","CF",{"$f":"VLOOKUP(B5,Sheet2!A:B,2,0)","v":"Merkulov Y."},"2840B003                           ","DADF-AB1 (A)",{"$f":"VLOOKUP(E5,[1]Sheet1!G:H,2,0)","v":"автоподатчик документов"},2,3840.6462652800001,"110000156783","2014-07-19",9.4191435185202863,"2014-08-20",null,null,"Pack Dam","2014-08-20"]
["BIG","CX",{"$f":"VLOOKUP(B6,Sheet2!A:B,2,0)","v":"Merkulov Y."},"1068B002                           ","C-EXV 16 TONER C EUR",{"$f":"VLOOKUP(E6,[1]Sheet1!G:H,2,0)","v":"тонер синий"},1,10621.366816580001,"110000130903","2013-09-07",324.41914351852029,"2014-08-20",null,null,"Pack Dam","2014-08-20"]
["BIG","CX",{"$f":"VLOOKUP(B7,Sheet2!A:B,2,0)","v":"Merkulov Y."},"2772B003AA  000                    ","DRUM UNIT C-EXV32/33",{"$f":"VLOOKUP(E7,[1]Sheet1!G:H,2,0)","v":"БАРАБАН IR 2520/2525/2530"},2,4387.4730118500001,"110000153345","2014-06-04",54.419143518520286,"2014-08-20",null,null,"Pack Dam","2014-08-20"]
["BIG","CX",{"$f":"VLOOKUP(B8,Sheet2!A:B,2,0)","v":"Merkulov Y."},"2789B002                           ","C-EXV 28 TONER BK EUR",{"$f":"VLOOKUP(E8,[1]Sheet1!G:H,2,0)","v":"Тонер черный"},1,4387.4730118500001,"110000105052","2013-01-23",551.41914351852029,"2014-08-20",null,null,"Pack Dam","2014-08-20"]
["BIG","CX",{"$f":"VLOOKUP(B9,Sheet2!A:B,2,0)","v":"Merkulov Y."},"2793B002                           ","C-EXV 28 TONER C EUR",{"$f":"VLOOKUP(E9,[1]Sheet1!G:H,2,0)","v":"Тонер голубой"},1,8774.9460237000003,"110000105053","2013-01-23",551.41914351852029,"2014-08-20",null,null,"Pack Dam","2014-08-20"]
["BIG","CX",{"$f":"VLOOKUP(B10,Sheet2!A:B,2,0)","v":"Merkulov Y."},"2797B002                           ","C-EXV 28 TONER M EUR",{"$f":"VLOOKUP(E10,[1]Sheet1!G:H,2,0)","v":"Тонер пурпурный"},1,125.26218434,"110000105003","2013-01-23",551.41914351852029,"2014-08-20",null,null,"Pack Dam","2014-08-20"]
["BIG","CX",{"$f":"VLOOKUP(B11,Sheet2!A:B,2,0)","v":"Merkulov Y."},"2801B002                           ","C-EXV 28 TONER Y EUR",{"$f":"VLOOKUP(E11,[1]Sheet1!G:H,2,0)","v":"Тонер желтый"},1,3840.6462652800001,"110000105055","2013-01-23",551.41914351852029,"2014-08-20",null,null,"Pack Dam","2014-08-20"]
["BIG","CX",{"$f":"VLOOKUP(B12,Sheet2!A:B,2,0)","v":"Merkulov Y."},"3787B003AA  000                    ","DRUM UNIT C-EXV-34 C",{"$f":"VLOOKUP(E12,[1]Sheet1!G:H,2,0)","v":"ФОТОБАРАБАН"},1,1651.8870801400001,"110000146047","2014-02-21",157.41914351852029,"2014-08-20",null,null,"Pack Dam","2014-08-20"]
["BIG","CX",{"$f":"VLOOKUP(B13,Sheet2!A:B,2,0)","v":"Merkulov Y."},"6837A003AA  000                    ","DRUM UNIT C-EXV5   <C>",{"$f":"VLOOKUP(E13,[1]Sheet1!G:H,2,0)","v":"барабан"},1,3770.7800770000003,"110000133660","2013-10-04",297.41914351852029,"2014-08-20",null,null,"Pack Dam","2014-08-26"]
["BIG","CX",{"$f":"VLOOKUP(B14,Sheet2!A:B,2,0)","v":"Merkulov Y."},"FC0-1881-000000                    ","PLATE, PAPER SIZE",{"$f":"VLOOKUP(E14,[1]Sheet1!G:H,2,0)","v":"ШКАЛА РАЗМЕРА БУМАГИ"},1,0,"110000121357","2013-06-03",420.41914351852029,"2014-08-20",null,null,"Damage","2014-08-26"]
["BIG","CX",{"$f":"VLOOKUP(B15,Sheet2!A:B,2,0)","v":"Merkulov Y."},"FM1-C081-010000                    ","BUSHING",{"$f":"VLOOKUP(E15,[1]Sheet1!G:H,2,0)","v":"ВТУЛКА"},1,5904.1733332200001,"110000143851","2014-01-30",179.41914351852029,"2014-08-20",null,null,"Damage","2014-08-26"]
["BIG","CX",{"$f":"VLOOKUP(B16,Sheet2!A:B,2,0)","v":"Merkulov Y."},"1069B002                           ","C-EXV 16 TONER BK EUR","тонер черный",1,2094.19982239,"110000150892","2014-07-15",{"$f":"TODAY()-J16","v":56},null,null,null,"Damage","2014-09-05T14:47:07"]
["BIG","GJ",{"$f":"VLOOKUP(B17,Sheet2!A:B,2,0)","v":"Ota E. & Goloshchapov A."},"0172B001                           ","BCI-1441 Y FOR W8400",{"$f":"VLOOKUP(E17,[1]Sheet1!G:H,2,0)","v":"чернила желтые"},2,8426.9628099600013,"110000079495","2012-04-25",824.41914351852029,"2014-08-20",null,null,"Damage","2014-08-20"]
["BIG","GJ",{"$f":"VLOOKUP(B18,Sheet2!A:B,2,0)","v":"Ota E. & Goloshchapov A."},"0886B001                           ","PFI-101 Y",{"$f":"VLOOKUP(E18,[1]Sheet1!G:H,2,0)","v":"чернила желтые"},1,17806.203529580001,"110000133739","2014-07-05",23.419143518520286,"2014-08-20",null,null,"Pack Dam","2014-08-20"]
["BIG","GJ",{"$f":"VLOOKUP(B19,Sheet2!A:B,2,0)","v":"Ota E. & Goloshchapov A."},"0901B005                           ","PFI-701 C",{"$f":"VLOOKUP(E19,[1]Sheet1!G:H,2,0)","v":"чернила голубые"},1,1313.2111935099999,"110000143942","2014-01-31",178.41914351852029,"2014-08-20",null,null,"Damage","2014-08-20"]
["BIG","GJ",{"$f":"VLOOKUP(B20,Sheet2!A:B,2,0)","v":"Ota E. & Goloshchapov A."},"0903B005                           ","PFI-701 Y",{"$f":"VLOOKUP(E20,[1]Sheet1!G:H,2,0)","v":"чернила желтые"},2,4608.2544551199999,"110000143944","2014-01-31",178.41914351852029,"2014-08-20",null,null,"Pack Dam","2014-08-20"]
["BIG","GJ",{"$f":"VLOOKUP(B21,Sheet2!A:B,2,0)","v":"Ota E. & Goloshchapov A."},"0904B005                           ","PFI-701 PC",{"$f":"VLOOKUP(E21,[1]Sheet1!G:H,2,0)","v":"чернила голубые"},1,278998.51659953,"110000143945","2014-01-31",178.41914351852029,"2014-08-20",null,null,"Damage","2014-08-20"]
["BIG","GJ",{"$f":"VLOOKUP(B22,Sheet2!A:B,2,0)","v":"Ota E. & Goloshchapov A."},"2964B001                           ","PFI-703 C",{"$f":"VLOOKUP(E22,[1]Sheet1!G:H,2,0)","v":"чернила голубые"},1,5135.7787335899993,"110000143175","2014-01-22",187.41914351852029,"2014-08-20",null,null,"Damage","2014-08-20"]
["BIG","GJ",{"$f":"VLOOKUP(B23,Sheet2!A:B,2,0)","v":"Ota E. & Goloshchapov A."},"2965B001                           ","PFI-703 M",{"$f":"VLOOKUP(E23,[1]Sheet1!G:H,2,0)","v":"чернила малиновые"},1,1000.8415529599999,"110000143190","2014-01-22",187.41914351852029,"2014-08-20",null,null,"Damage","2014-08-20"]
["BIG","GJ",{"$f":"VLOOKUP(B24,Sheet2!A:B,2,0)","v":"Ota E. & Goloshchapov A."},"6687B001                           ","Red Ink Tank PFI-706 R (E",{"$f":"VLOOKUP(E24,[1]Sheet1!G:H,2,0)","v":"чернильница"},1,3770.7800770000003,"110000154624","2014-06-20",38.419143518520286,"2014-08-20",null,null,"Pack Dam","2014-08-26"]
["BIG","GJ",{"$f":"VLOOKUP(B25,Sheet2!A:B,2,0)","v":"Ota E. & Goloshchapov A."},"7569A001                           ","BCI-1401 C FOR W7250/64D",{"$f":"VLOOKUP(E25,[1]Sheet1!G:H,2,0)","v":"чернила синие"},4,916.75582798000005,"110000068605","2013-09-05",326.41914351852029,"2014-08-20",null,null,"Damage","2014-08-26"]
["BIG","GJ",{"$f":"VLOOKUP(B26,Sheet2!A:B,2,0)","v":"Ota E. & Goloshchapov A."},"7569A001                           ","BCI-1401 C FOR W7250/64D",{"$f":"VLOOKUP(E26,[1]Sheet1!G:H,2,0)","v":"чернила синие"},1,942.69501925000009,"110000068831","2013-08-08",354.41914351852029,"2014-08-20",null,null,"Damage","2014-08-26"]
["BIG","GJ",{"$f":"VLOOKUP(B27,Sheet2!A:B,2,0)","v":"Ota E. & Goloshchapov A."},"7569A001                           ","BCI-1401 C FOR W7250/64D",{"$f":"VLOOKUP(E27,[1]Sheet1!G:H,2,0)","v":"чернила синие"},1,3770.7800770000003,"110000068831","2013-06-10",413.41914351852029,"2014-08-20",null,null,"Pack Dam","2014-08-26"]
["BIG","GJ",{"$f":"VLOOKUP(B28,Sheet2!A:B,2,0)","v":"Ota E. & Goloshchapov A."},"7569A001                           ","BCI-1401 C FOR W7250/64D",{"$f":"VLOOKUP(E28,[1]Sheet1!G:H,2,0)","v":"чернила синие"},1,1885.3900385000002,"110000068831","2013-04-11",473.41914351852029,"2014-08-20",null,null,"Pack Dam","2014-08-26"]
["BIG","GJ",{"$f":"VLOOKUP(B29,Sheet2!A:B,2,0)","v":"Ota E. & Goloshchapov A."},"7572A001                           ","BCI-1401 PC FOR W7250/64D",{"$f":"VLOOKUP(E29,[1]Sheet1!G:H,2,0)","v":"чернила синие (фото)"},4,942.69501925000009,"110000068607","2013-09-05",326.41914351852029,"2014-08-20",null,null,"Damage","2014-08-26"]
["BIG","GJ",{"$f":"VLOOKUP(B30,Sheet2!A:B,2,0)","v":"Ota E. & Goloshchapov A."},"7572A001                           ","BCI-1401 PC FOR W7250/64D",{"$f":"VLOOKUP(E30,[1]Sheet1!G:H,2,0)","v":"чернила синие (фото)"},1,957.56065392000005,"110000068607","2013-09-05",326.41914351852029,"2014-08-20",null,null,"Damage","2014-08-26"]
["BIG","GJ",{"$f":"VLOOKUP(B31,Sheet2!A:B,2,0)","v":"Ota E. & Goloshchapov A."},"7572A001                           ","BCI-1401 PC FOR W7250/64D",{"$f":"VLOOKUP(E31,[1]Sheet1!G:H,2,0)","v":"чернила синие (фото)"},2,916.75582798000005,"110000068607","2013-08-08",354.41914351852029,"2014-08-20",null,null,"A-stock","2014-08-26"]
["BIG","GJ",{"$f":"VLOOKUP(B32,Sheet2!A:B,2,0)","v":"Ota E. & Goloshchapov A."},"7572A001                           ","BCI-1401 PC FOR W7250/64D",{"$f":"VLOOKUP(E32,[1]Sheet1!G:H,2,0)","v":"чернила синие (фото)"},1,916.75582798000005,"110000068607","2013-07-19",374.41914351852029,"2014-08-20",null,null,"A-stock","2014-08-26"]
["BIG","GJ",{"$f":"VLOOKUP(B33,Sheet2!A:B,2,0)","v":"Ota E. & Goloshchapov A."},"7573A001                           ","BCI-1401 PM FOR W7250/64D",{"$f":"VLOOKUP(E33,[1]Sheet1!G:H,2,0)","v":"чернила красные (фото)"},1,29,"110000076196","2013-09-05",326.41914351852029,"2014-08-20",null,null,"Pack Dam","2014-08-26"]
["BIG","GJ",{"$f":"VLOOKUP(B34,Sheet2!A:B,2,0)","v":"Ota E. & Goloshchapov A."},"7573A001                           ","BCI-1401 PM FOR W7250/64D",{"$f":"VLOOKUP(E34,[1]Sheet1!G:H,2,0)","v":"чернила красные (фото)"},4,957.56065392000005,"110000068608","2013-09-05",326.41914351852029,"2014-08-20",null,null,"Pack Dam","2014-08-26"]
["BIG","GJ",{"$f":"VLOOKUP(B35,Sheet2!A:B,2,0)","v":"Ota E. & Goloshchapov A."},"7573A001                           ","BCI-1401 PM FOR W7250/64D",{"$f":"VLOOKUP(E35,[1]Sheet1!G:H,2,0)","v":"чернила красные (фото)"},1,957.56065392000005,"110000076196","2013-07-19",374.41914351852029,"2014-08-20",null,null,"Damage","2014-08-26"]
["BIG","GJ",{"$f":"VLOOKUP(B36,Sheet2!A:B,2,0)","v":"Ota E. & Goloshchapov A."},"7573A001                           ","BCI-1401 PM FOR W7250/64D",{"$f":"VLOOKUP(E36,[1]Sheet1!G:H,2,0)","v":"чернила красные (фото)"},1,1442.3319804999999,"110000076196","2013-07-03",390.41914351852029,"2014-08-20",null,null,"Damage","2014-08-26"]
["BIG","GJ",{"$f":"VLOOKUP(B37,Sheet2!A:B,2,0)","v":"Ota E. & Goloshchapov A."},"7573A001                           ","BCI-1401 PM FOR W7250/64D",{"$f":"VLOOKUP(E37,[1]Sheet1!G:H,2,0)","v":"чернила красные (фото)"},1,3668.3860302000003,"110000076196","2012-03-22",858.41914351852029,"2014-08-20",null,null,"Pack Dam","2014-08-26"]
["BIG","GJ",{"$f":"VLOOKUP(B38,Sheet2!A:B,2,0)","v":"Ota E. & Goloshchapov A."},"5313B001                           ","Photo Grey Ink Tank PFI-2","чернильница",2,5289.8371213800001,"110000118276","2014-07-18",{"$f":"TODAY()-J38","v":53},"2014-08-26",null,"Pictures were sent"]
["BIG","SD",{"$f":"VLOOKUP(B39,Sheet2!A:B,2,0)","v":"Lebedev A."},"8116B015                           ","varioPRINT 135 Series Mai",{"$f":"VLOOKUP(E39,[1]Sheet1!G:H,2,0)","v":"Печатный модуль"},1,3668.3860302000003,"110000150991","2014-06-09",49.419143518520286,"2014-08-20",null,null,"Pack Dam","2014-08-26"]
["BIG","SH",{"$f":"VLOOKUP(B40,Sheet2!A:B,2,0)","v":"Ota E. & Goloshchapov A."},"6362B001                           ","TONER 500 G, 2 BOTTLES, B","Тонер",2,3893.5358206900005,"110000156931","2014-07-23",{"$f":"TODAY()-J40","v":48}]
["BIG","SR",{"$f":"VLOOKUP(B41,Sheet2!A:B,2,0)","v":"Ota E. & Goloshchapov A."},"7673B020                           ","IJM009 DRAFT75 50X0,914 3",{"$f":"VLOOKUP(E41,[1]Sheet1!G:H,2,0)","v":"Бумага IJM009"},1,3668.3860302000003,"110000153026","2014-05-28",61.419143518520286,"2014-08-20",null,null,"Pack Dam","2014-08-26"]
["LASER","BF",{"$f":"VLOOKUP(B42,Sheet2!A:B,2,0)","v":"Suzuki T."},"8461A014                           ","PCFC FC108 RUSSIA DG.M",{"$f":"VLOOKUP(E42,[1]Sheet1!G:H,2,0)","v":"копировальный аппарат"},1,4213.4830070899998,"110000063511","2011-10-28",1004.4191435185203,"2014-08-20",null,null,"Damage","2014-08-20"]
["LASER","CH",{"$f":"VLOOKUP(B43,Sheet2!A:B,2,0)","v":"Bondarenko M. & Suzuki T."},"4509B043                           ","LASER MFP I-SENSYS MF4410",{"$f":"VLOOKUP(E43,[1]Sheet1!G:H,2,0)","v":"Лазерное МФУ MF4410"},1,4639.9223863500001,"110000150949","2014-04-24",95.419143518520286,"2014-08-20",null,null,"Damage","2014-08-20"]
["LASER","CH",{"$f":"VLOOKUP(B44,Sheet2!A:B,2,0)","v":"Bondarenko M. & Suzuki T."},"4509B043                           ","LASER MFP I-SENSYS MF4410",{"$f":"VLOOKUP(E44,[1]Sheet1!G:H,2,0)","v":"Лазерное МФУ MF4410"},1,4158.2814318000001,"110000147328","2014-03-04",146.41914351852029,"2014-08-20",null,null,"Damage","2014-08-20"]
["LASER","CH",{"$f":"VLOOKUP(B45,Sheet2!A:B,2,0)","v":"Bondarenko M. & Suzuki T."},"4509B043                           ","LASER MFP I-SENSYS MF4410",{"$f":"VLOOKUP(E45,[1]Sheet1!G:H,2,0)","v":"Лазерное МФУ MF4410"},1,4195.30138635,"110000144311","2014-02-10",168.41914351852029,"2014-08-20",null,null,"Damage","2014-08-20"]
["LASER","CH",{"$f":"VLOOKUP(B46,Sheet2!A:B,2,0)","v":"Bondarenko M. & Suzuki T."},"4509B043                           ","LASER MFP I-SENSYS MF4410",{"$f":"VLOOKUP(E46,[1]Sheet1!G:H,2,0)","v":"Лазерное МФУ MF4410"},1,4228.0888257399993,"110000140605","2013-12-12",228.41914351852029,"2014-08-20",null,null,"Damage","2014-08-20"]
["LASER","CH",{"$f":"VLOOKUP(B47,Sheet2!A:B,2,0)","v":"Bondarenko M. & Suzuki T."},"4509B043                           ","LASER MFP I-SENSYS MF4410",{"$f":"VLOOKUP(E47,[1]Sheet1!G:H,2,0)","v":"Лазерное МФУ MF4410"},3,12627.380113559999,"110000135987","2013-10-21",280.41914351852029,"2014-08-20",null,null,"Damage","2014-08-20"]
["LASER","CH",{"$f":"VLOOKUP(B48,Sheet2!A:B,2,0)","v":"Bondarenko M. & Suzuki T."},"4509B043                           ","LASER MFP I-SENSYS MF4410",{"$f":"VLOOKUP(E48,[1]Sheet1!G:H,2,0)","v":"Лазерное МФУ MF4410"},1,4091.8226893699998,"110000120113","2013-10-07",294.41914351852029,"2014-08-20",null,null,"Damage","2014-08-20"]
["LASER","CH",{"$f":"VLOOKUP(B49,Sheet2!A:B,2,0)","v":"Bondarenko M. & Suzuki T."},"4509B043                           ","LASER MFP I-SENSYS MF4410",{"$f":"VLOOKUP(E49,[1]Sheet1!G:H,2,0)","v":"Лазерное МФУ MF4410"},1,4091.8226893699998,"110000120113","2013-05-22",432.41914351852029,"2014-08-20",null,null,"Damage","2014-08-20"]
["LASER","CH",{"$f":"VLOOKUP(B50,Sheet2!A:B,2,0)","v":"Bondarenko M. & Suzuki T."},"4509B043                           ","LASER MFP I-SENSYS MF4410",{"$f":"VLOOKUP(E50,[1]Sheet1!G:H,2,0)","v":"Лазерное МФУ MF4410"},1,4091.8226893699998,"110000119961","2013-05-20",434.41914351852029,"2014-08-20",null,null,"Pack Dam","2014-08-20"]
["LASER","CH",{"$f":"VLOOKUP(B51,Sheet2!A:B,2,0)","v":"Bondarenko M. & Suzuki T."},"4509B140                           ","LASER I-SENSYS MF4550D MO",{"$f":"VLOOKUP(E51,[1]Sheet1!G:H,2,0)","v":"лазерное МФУ"},1,4401.00909452,"110000081614","2014-02-28",150.41914351852029,"2014-08-20",null,null,"Damage","2014-08-20"]
["LASER","CH",{"$f":"VLOOKUP(B52,Sheet2!A:B,2,0)","v":"Bondarenko M. & Suzuki T."},"4838B026                           ","LASER MFP I-SENSYS MF5940",{"$f":"VLOOKUP(E52,[1]Sheet1!G:H,2,0)","v":"Лазерное МФУ MF5940dn"},2,14021.49547118,"110000138269","2013-12-31",209.41914351852029,"2014-08-20",null,null,"Damage","2014-08-20"]
["LASER","CH",{"$f":"VLOOKUP(B53,Sheet2!A:B,2,0)","v":"Bondarenko M. & Suzuki T."},"5119B026                           ","LASER MFP I-SENSYS MF8080",{"$f":"VLOOKUP(E53,[1]Sheet1!G:H,2,0)","v":"многофункц. устр-во"},1,7156.4151415400001,"110000094113","2012-09-19",677.41914351852029,"2014-08-20",null,null,"Damage","2014-08-20"]
["LASER","CH",{"$f":"VLOOKUP(B54,Sheet2!A:B,2,0)","v":"Bondarenko M. & Suzuki T."},"5120B029                           ","LASER MFP I-SENSYS MF8360",{"$f":"VLOOKUP(E54,[1]Sheet1!G:H,2,0)","v":"многофункц. устр-во"},1,10040.559846550001,"110000088347","2012-07-24",734.41914351852029,"2014-08-20",null,null,"Damage","2014-08-20"]
["LASER","CH",{"$f":"VLOOKUP(B55,Sheet2!A:B,2,0)","v":"Bondarenko M. & Suzuki T."},"5120B029                           ","LASER MFP I-SENSYS MF8360",{"$f":"VLOOKUP(E55,[1]Sheet1!G:H,2,0)","v":"многофункц. устр-во"},1,10373.47872417,"110000077081","2012-03-31",849.41914351852029,"2014-08-20",null,null,"Pack Dam","2014-08-20"]
["LASER","CH",{"$f":"VLOOKUP(B56,Sheet2!A:B,2,0)","v":"Bondarenko M. & Suzuki T."},"5120B038                           ","LASER MFP I-SENSYS MF8380",{"$f":"VLOOKUP(E56,[1]Sheet1!G:H,2,0)","v":"многофункц. устр-во"},1,10977.545230959999,"110000101455","2012-11-15",620.41914351852029,"2014-08-20",null,null,"Pack Dam","2014-08-20"]
["LASER","CH",{"$f":"VLOOKUP(B57,Sheet2!A:B,2,0)","v":"Bondarenko M. & Suzuki T."},"5252B004                           ","LASER MFP I-SENSYS MF3010","Лазерное МФУ",1,3704.9644642600001,"110000148362","2014-07-05",23.419143518520286,"2014-08-20",null,null,"Pack Dam","2014-08-20"]
["LASER","CH",{"$f":"VLOOKUP(B58,Sheet2!A:B,2,0)","v":"Bondarenko M. & Suzuki T."},"5252B004                           ","LASER MFP I-SENSYS MF3010","Лазерное МФУ",1,4110.3131164799997,"110000149982","2014-04-10",109.41914351852029,"2014-08-20",null,null,"Pack Dam","2014-08-20"]
["LASER","CH",{"$f":"VLOOKUP(B59,Sheet2!A:B,2,0)","v":"Bondarenko M. & Suzuki T."},"5252B004                           ","LASER MFP I-SENSYS MF3010","Лазерное МФУ",4,14819.85785708,"110000148381","2014-03-18",132.41914351852029,"2014-08-20",null,null,"Pack Dam","2014-08-20"]
["LASER","CH",{"$f":"VLOOKUP(B60,Sheet2!A:B,2,0)","v":"Bondarenko M. & Suzuki T."},"5252B004                           ","LASER MFP I-SENSYS MF3010","Лазерное МФУ",2,7381.6823596800004,"110000135946","2013-10-29",272.41914351852029,"2014-08-20",null,null,"Pack Dam","2014-08-20"]
["LASER","CH",{"$f":"VLOOKUP(B61,Sheet2!A:B,2,0)","v":"Bondarenko M. & Suzuki T."},"5252B004                           ","LASER MFP I-SENSYS MF3010","Лазерное МФУ",3,10858.592308650001,"110000119983","2013-05-21",433.41914351852029,"2014-08-20",null,null,"Pack Dam","2014-08-20"]
["LASER","CH",{"$f":"VLOOKUP(B62,Sheet2!A:B,2,0)","v":"Bondarenko M. & Suzuki T."},"6371B082                           ","LASER MFP i-SENSYS MF4780",{"$f":"VLOOKUP(E62,[1]Sheet1!G:H,2,0)","v":"Лазерное МФУ MF4780w"},3,17788.790099099999,"110000135907","2013-10-21",280.41914351852029,"2014-08-20",null,null,"Pack Dam","2014-08-20"]
["LASER","CH",{"$f":"VLOOKUP(B63,Sheet2!A:B,2,0)","v":"Bondarenko M. & Suzuki T."},"6371B090                           ","LASER MFP i-SENSYS MF4750",{"$f":"VLOOKUP(E63,[1]Sheet1!G:H,2,0)","v":"Лазерное МФУ MF4750"},1,5085.08608766,"110000103541","2013-05-22",432.41914351852029,"2014-08-20",null,null,"Pack Dam","2014-08-20"]
["LASER","CH",{"$f":"VLOOKUP(B64,Sheet2!A:B,2,0)","v":"Bondarenko M. & Suzuki T."},"6848B021                           ","LASER MFP I-SENSYS MF8280",{"$f":"VLOOKUP(E64,[1]Sheet1!G:H,2,0)","v":"Лазерное МФУ MF8280Cw"},1,6984.9453269599999,"110000122521","2013-07-25",368.41914351852029,"2014-08-20",null,null,"Pack Dam","2014-08-20"]
["LASER","CH",{"$f":"VLOOKUP(B65,Sheet2!A:B,2,0)","v":"Bondarenko M. & Suzuki T."},"6849B011                           ","LASER MFP I-SENSYS MF8540",{"$f":"VLOOKUP(E65,[1]Sheet1!G:H,2,0)","v":"Лазерное МФУ MF8540Cdn"},3,29785.745365139999,"110000149568","2014-04-05",114.41914351852029,"2014-08-20",null,null,"Pack Dam","2014-08-20"]
["LASER","CH",{"$f":"VLOOKUP(B66,Sheet2!A:B,2,0)","v":"Bondarenko M. & Suzuki T."},"6849B029                           ","LASER MFP I-SENSYS MF8580",{"$f":"VLOOKUP(E66,[1]Sheet1!G:H,2,0)","v":"лазерное МФУ MF8580Cdw"},2,24286.46038316,"110000157077","2014-07-24",4.4191435185202863,"2014-08-20",null,null,"Pack Dam","2014-08-20"]
["LASER","CH",{"$f":"VLOOKUP(B67,Sheet2!A:B,2,0)","v":"Bondarenko M. & Suzuki T."},"6849B029                           ","LASER MFP I-SENSYS MF8580",{"$f":"VLOOKUP(E67,[1]Sheet1!G:H,2,0)","v":"лазерное МФУ MF8580Cdw"},1,11160.355410239999,"110000135904","2013-12-31",209.41914351852029,"2014-08-20",null,null,"Pack Dam","2014-08-20"]
["LASER","CH",{"$f":"VLOOKUP(B68,Sheet2!A:B,2,0)","v":"Bondarenko M. & Suzuki T."},"6371B140                           ","LASER MFP MF4780W RU","чер-белый лазерный MF4780",1,5279.5239911799999,"110000160297","2014-08-29",{"$f":"TODAY()-J68","v":11},"2014-08-26",null,"Pictures were sent"]
["LASER","CH",{"$f":"VLOOKUP(B69,Sheet2!A:B,2,0)","v":"Bondarenko M. & Suzuki T."},"6371B141                           ","LASER MFP MF4870DN RU","чер-белый лазерный MF4870",2,13254.27125098,"110000160298","2014-08-29",{"$f":"TODAY()-J69","v":11},"2014-08-26",null,"Pictures were sent"]
["LASER","CR",{"$f":"VLOOKUP(B70,Sheet2!A:B,2,0)","v":"Bondarenko M. & Suzuki T."},"2611B004                           ","LBP I-SENSYS LBP3010B EMB",{"$f":"VLOOKUP(E70,[1]Sheet1!G:H,2,0)","v":"принтер лазерный"},1,2315.6799999999998,"000000133772","2011-01-26",1279.4191435185203,"2014-08-20",null,null,"Pack Dam","2014-08-20"]
["LASER","CR",{"$f":"VLOOKUP(B71,Sheet2!A:B,2,0)","v":"Bondarenko M. & Suzuki T."},"4286B002                           ","LASER SFP I-SENSYS LBP600",{"$f":"VLOOKUP(E71,[1]Sheet1!G:H,2,0)","v":"лазерный принтер"},4,7558.3014569599991,"110000076300","2012-03-23",857.41914351852029,"2014-08-20",null,null,"Damage","2014-08-20"]
["LASER","CR",{"$f":"VLOOKUP(B72,Sheet2!A:B,2,0)","v":"Bondarenko M. & Suzuki T."},"4896B003                           ","LASER SFP I-SENSYS LBP701","Лазерное МФУ",2,7767.3782050999989,"110000132968","2013-10-09",292.41914351852029,"2014-08-20",null,null,"Damage","2014-08-20"]
["LASER","CR",{"$f":"VLOOKUP(B73,Sheet2!A:B,2,0)","v":"Bondarenko M. & Suzuki T."},"6374B001                           ","LASER SFP i-SENSYS LBP602",{"$f":"VLOOKUP(E73,[1]Sheet1!G:H,2,0)","v":"Лазерный принтер LBP6020"},6,13369.98966078,"110000132980","2013-12-31",209.41914351852029,"2014-08-20",null,null,"Pack Dam","2014-08-20"]
["LASER","CR",{"$f":"VLOOKUP(B74,Sheet2!A:B,2,0)","v":"Bondarenko M. & Suzuki T."},"6374B002                           ","LASER SFP i-SENSYS LBP602",{"$f":"VLOOKUP(E74,[1]Sheet1!G:H,2,0)","v":"Лазерный принтер LBP6020"},5,10886.35545255,"110000138257","2013-11-13",257.41914351852029,"2014-08-20",null,null,"Damage","2014-08-20"]
["LASER","CR",{"$f":"VLOOKUP(B75,Sheet2!A:B,2,0)","v":"Bondarenko M. & Suzuki T."},"6374B002                           ","LASER SFP i-SENSYS LBP602",{"$f":"VLOOKUP(E75,[1]Sheet1!G:H,2,0)","v":"Лазерный принтер LBP6020"},39,87049.572364559994,"110000132096","2013-09-16",315.41914351852029,"2014-08-20",null,null,"Damage","2014-08-20"]
["LASER","CR",{"$f":"VLOOKUP(B76,Sheet2!A:B,2,0)","v":"Bondarenko M. & Suzuki T."},"FM2-6704-000000                    ","FILM GUIDE ASS'Y",{"$f":"VLOOKUP(E76,[1]Sheet1!G:H,2,0)","v":"направляющая пленки в при"},4,4295.5626063999998,"110000103742","2013-07-25",368.41914351852029,"2014-08-26",null,null,"Pack Dam","2014-08-20"]
["LASER","CR",{"$f":"VLOOKUP(B77,Sheet2!A:B,2,0)","v":"Bondarenko M. & Suzuki T."},"6372B001                           ","LASER SFP I-SENSYS LBP631","Лазерный принтер LBP6310d",1,4773.5057781400001,"110000158901","2014-08-18",{"$f":"TODAY()-J77","v":22},"2014-08-26",null,"Pictures were sent"]
["LASER","CR",{"$f":"VLOOKUP(B78,Sheet2!A:B,2,0)","v":"Bondarenko M. & Suzuki T."},"6374B001                           ","LASER SFP i-SENSYS LBP602","Лазерный принтер LBP6020",5,8852.9505098499994,"110000161163","2014-09-03",6,"2014-08-26",null,"Pictures were sent"]
["LASER","GF",{"$f":"VLOOKUP(B79,Sheet2!A:B,2,0)","v":"Bondarenko M."},"1491A003                           ","PFC CRG E30 BK EUR","картридж Е30 черный",1,2472.50844766,"110000139073","2013-11-19",294,"2014-08-26",null,"Pictures were sent"]
["LASER","GF",{"$f":"VLOOKUP(B80,Sheet2!A:B,2,0)","v":"Bondarenko M."},"1492A003                           ","PFC CRG E16 BLK EUR","картридж Е16 черный",1,1590.4027578599998,"110000136016","2013-12-10",273,"2014-08-26",null,"Pictures were sent"]
["LASER","GF",{"$f":"VLOOKUP(B81,Sheet2!A:B,2,0)","v":"Bondarenko M."},"1492A003                           ","PFC CRG E16 BLK EUR","картридж Е16 черный",1,1589.9731917399999,"110000145939","2014-02-20",201,"2014-08-26",null,"Pictures were sent"]
["LASER","GH",{"$f":"VLOOKUP(B82,Sheet2!A:B,2,0)","v":"Bondarenko M."},"0263B002                           ","FAX CARTRIDGE FX10 CRG EU","картридж факсовый",1,1253.3750013899999,"110000132921","2013-10-31",313,"2014-08-26",null,"Pictures were sent"]
["LASER","GH",{"$f":"VLOOKUP(B83,Sheet2!A:B,2,0)","v":"Bondarenko M."},"2617B002                           ","FAX CRG 720 EUR","картридж черный 720",1,3401.3164683499999,"110000154675","2014-06-20",81,"2014-08-26",null,"Pictures were sent"]
["LASER","GH",{"$f":"VLOOKUP(B84,Sheet2!A:B,2,0)","v":"Bondarenko M."},"3500B010                           ","CANON CRG 728 RU","картридж факсовый 728 RU",8,10664.974092160001,"110000138258","2013-11-10",303,"2014-08-26",null,"Pictures were sent"]
["LASER","GR",{"$f":"VLOOKUP(B85,Sheet2!A:B,2,0)","v":"Bondarenko M."},"5773A004                           ","LBP CARTRIDGE EP-25",{"$f":"VLOOKUP(E85,[1]Sheet1!G:H,2,0)","v":"картридж"},1,1498.0530396400002,"110000157092","2014-07-24",4.4191435185202863,"2014-08-20",null,null,"Damage","2014-08-26"]
["LASER","GR",{"$f":"VLOOKUP(B86,Sheet2!A:B,2,0)","v":"Bondarenko M."},"1550A003                           ","LBP CARTRIDGE EP-22","картридж черный EP-22",3,3861.8634933900003,"110000159958","2014-08-21",{"$f":"TODAY()-J86","v":19},"2014-08-26",null,"Pictures were sent"]
["LASER","GR",{"$f":"VLOOKUP(B87,Sheet2!A:B,2,0)","v":"Bondarenko M."},"1657B002                           ","CLBP CRG 711 YELLOW FOR L","картридж лаз. принтера",5,16538.483943900002,"110000117780","2013-10-01",343,"2014-08-26",null,"Pictures were sent"]
["LASER","GR",{"$f":"VLOOKUP(B88,Sheet2!A:B,2,0)","v":"Bondarenko M."},"1660B002                           ","CLBP CRG 711 BLACK FOR LB","картридж лаз. принтера",1,2579.6438915599997,"110000121712","2013-10-01",343,"2014-08-26",null,"Pictures were sent"]
["LASER","GR",{"$f":"VLOOKUP(B89,Sheet2!A:B,2,0)","v":"Bondarenko M."},"1870B002                           ","LBP CARTRIDGE 712 EUR","картридж для принтера",3,3338.8694704199997,"110000137469","2013-11-06",307,"2014-08-26",null,"Pictures were sent"]
["LASER","GR",{"$f":"VLOOKUP(B90,Sheet2!A:B,2,0)","v":"Bondarenko M."},"2662B002                           ","CLBP CARTRIDGE 718 BK EUR","черный картридж 718 BK",1,2575.6799999999998,"110000143209","2014-04-16",146,"2014-08-26",null,"Pictures were sent"]
["LASER","GR",{"$f":"VLOOKUP(B91,Sheet2!A:B,2,0)","v":"Bondarenko M."},"2662B005                           ","CLBP CRG718 BK 2P EUR","картридж черный двойной",1,3828.4117407700001,"110000101250","2012-11-12",666,"2014-08-26",null,"Pictures were sent"]
["LASER","GR",{"$f":"VLOOKUP(B92,Sheet2!A:B,2,0)","v":"Bondarenko M."},"3479B002                           ","LBP CRG 719 EUR","картридж 719",1,1617.6334003900001,"110000134125","2013-12-10",273,"2014-08-26",null,"Pictures were sent"]
["LASER","GR",{"$f":"VLOOKUP(B93,Sheet2!A:B,2,0)","v":"Bondarenko M."},"3480B002                           ","LBP CRG 719H EUR","картридж 719 6.4K",1,2896.8408566100002,"110000138364","2013-11-11",302,"2014-08-26",null,"Pictures were sent"]
["LASER","GR",{"$f":"VLOOKUP(B94,Sheet2!A:B,2,0)","v":"Bondarenko M."},"3484B005                           ","CANON CRG 725 RU","картридж черный 725 RU",3,3500.6107104900002,"110000145810","2014-02-17",204,"2014-08-26",null,"Pictures were sent"]
["LASER","GR",{"$f":"VLOOKUP(B95,Sheet2!A:B,2,0)","v":"Bondarenko M."},"4368B002                           ","CLBP CARTRIDGE CRG 729 M","пурпурный тонер-картридж",1,1111.7796591600002,"110000138420","2013-11-12",301,"2014-08-26",null,"Pictures were sent"]
["LASER","GR",{"$f":"VLOOKUP(B96,Sheet2!A:B,2,0)","v":"Bondarenko M."},"7616A005                           ","LBP CARTRIDGE CRG703","картридж для принтера",3,3783.4648414199996,"110000133544","2013-12-24",259,"2014-08-26",null,"Pictures were sent"]
["LASER","GR",{"$f":"VLOOKUP(B97,Sheet2!A:B,2,0)","v":"Bondarenko M."},"7616A005                           ","LBP CARTRIDGE CRG703","картридж для принтера",1,1405.8881893,"110000148398","2014-03-18",175,"2014-08-26",null,"Pictures were sent"]
["LASER","GR",{"$f":"VLOOKUP(B98,Sheet2!A:B,2,0)","v":"Bondarenko M."},"8489A002                           ","LBP CRG EP-27 CRG EUR DL","картидж черный EP-27",1,1203.9790261000001,"110000146669","2014-02-28",193,"2014-08-26",null,"Pictures were sent"]
["LASER","GR",{"$f":"VLOOKUP(B99,Sheet2!A:B,2,0)","v":"Bondarenko M."},"8489A002                           ","LBP CRG EP-27 CRG EUR DL","картидж черный EP-27",1,1342.29055483,"110000159298","2014-08-16",24,"2014-08-26",null,"Pictures were sent"]
["OPP","AJ",{"$f":"VLOOKUP(B100,Sheet2!A:B,2,0)","v":"Ivashkin A. & Yakhira M."},"3297B010                           ","SCANNER CANOSCAN LIDE700F",{"$f":"VLOOKUP(E100,[1]Sheet1!G:H,2,0)","v":"сканер"},1,2251.0754224799998,"110000117680","2013-06-30",393.41914351852029,"2014-08-20",null,null,"Damage","2014-08-20"]
["OPP","AJ",{"$f":"VLOOKUP(B101,Sheet2!A:B,2,0)","v":"Ivashkin A. & Yakhira M."},"3297B010                           ","SCANNER CANOSCAN LIDE700F",{"$f":"VLOOKUP(E101,[1]Sheet1!G:H,2,0)","v":"сканер"},2,4501.0007679,"110000121818","2013-06-10",413.41914351852029,"2014-08-20",null,null,"Damage","2014-08-20"]
["OPP","AJ",{"$f":"VLOOKUP(B102,Sheet2!A:B,2,0)","v":"Ivashkin A. & Yakhira M."},"4507B010                           ","SCANNER CANOSCAN LIDE110",{"$f":"VLOOKUP(E102,[1]Sheet1!G:H,2,0)","v":"сканер"},1,1340.2545611,"110000126709","2013-07-29",364.41914351852029,"2014-08-20",null,null,"Pack Dam","2014-08-20"]
["OPP","AJ",{"$f":"VLOOKUP(B103,Sheet2!A:B,2,0)","v":"Ivashkin A. & Yakhira M."},"4508B010                           ","SCANNER CANOSCAN LIDE210","Сканер",2,3498.4648529199999,"110000078431","2012-04-15",834.41914351852029,"2014-08-20",null,null,"Damage","2014-08-20"]
["OPP","BE",{"$f":"VLOOKUP(B104,Sheet2!A:B,2,0)","v":"Kurakin A."},"4584B001                           ","CALC AS-2200 EMEA HB",{"$f":"VLOOKUP(E104,[1]Sheet1!G:H,2,0)","v":"калькулятор AS-2200"},1,132.64265282,"110000120996","2013-06-26",397.41914351852029,"2014-08-20",null,null,"Damage","2014-08-20"]
["OPP","BE",{"$f":"VLOOKUP(B105,Sheet2!A:B,2,0)","v":"Kurakin A."},"4629B003                           ","LS-120HI III-GR ASA HB",{"$f":"VLOOKUP(E105,[1]Sheet1!G:H,2,0)","v":"настольный калькулятор"},3,415.06583327999999,"110000067348","2011-12-11",960.41914351852029,"2014-08-20",null,null,"Pack Dam","2014-08-20"]
["OPP","CD",{"$f":"VLOOKUP(B106,Sheet2!A:B,2,0)","v":"Ivashkin A. & Yakhira M."},"4502B007                           ","IJ AIO PRINTER PIXMA MG52",{"$f":"VLOOKUP(E106,[1]Sheet1!G:H,2,0)","v":"струйное МФУ"},8,16827.1978408,"110000081227","2012-05-13",806.41914351852029,"2014-08-20",null,null,"Pack Dam","2014-08-20"]
["OPP","CD",{"$f":"VLOOKUP(B107,Sheet2!A:B,2,0)","v":"Ivashkin A. & Yakhira M."},"4502B007                           ","IJ AIO PRINTER PIXMA MG52",{"$f":"VLOOKUP(E107,[1]Sheet1!G:H,2,0)","v":"струйное МФУ"},8,16827.1978408,"110000081227","2012-05-13",806.41914351852029,"2014-08-20",null,null,"Pack Dam","2014-08-20"]
["OPP","CD",{"$f":"VLOOKUP(B108,Sheet2!A:B,2,0)","v":"Ivashkin A. & Yakhira M."},"4502B007                           ","IJ AIO PRINTER PIXMA MG52",{"$f":"VLOOKUP(E108,[1]Sheet1!G:H,2,0)","v":"струйное МФУ"},24,50481.593522399999,"110000081227","2012-05-13",806.41914351852029,"2014-08-20",null,null,"Pack Dam","2014-08-20"]
["OPP","CD",{"$f":"VLOOKUP(B109,Sheet2!A:B,2,0)","v":"Ivashkin A. & Yakhira M."},"5291B007                           ","IJ AIO PRINTER PIXMA MG53",{"$f":"VLOOKUP(E109,[1]Sheet1!G:H,2,0)","v":"МФУ Canon PIXMA MG5340"},1,2193.5222281900001,"110000120759","2013-06-22",401.41914351852029,"2014-08-20",null,null,"Pack Dam","2014-08-20"]
["OPP","CD",{"$f":"VLOOKUP(B110,Sheet2!A:B,2,0)","v":"Ivashkin A. & Yakhira M."},"5291B007                           ","IJ AIO PRINTER PIXMA MG53",{"$f":"VLOOKUP(E110,[1]Sheet1!G:H,2,0)","v":"МФУ Canon PIXMA MG5340"},1,2045.5232475400001,"110000093705","2012-12-14",591.41914351852029,"2014-08-20",null,null,"Damage","2014-08-20"]
["OPP","CD",{"$f":"VLOOKUP(B111,Sheet2!A:B,2,0)","v":"Ivashkin A. & Yakhira M."},"5292B007                           ","IJ AIO PRINTER PIXMA MG62",{"$f":"VLOOKUP(E111,[1]Sheet1!G:H,2,0)","v":"Струйное МФУ"},3,11887.516532940001,"110000087956","2012-12-12",593.41914351852029,"2014-08-20",null,null,"Pack Dam","2014-08-20"]
["OPP","CD",{"$f":"VLOOKUP(B112,Sheet2!A:B,2,0)","v":"Ivashkin A. & Yakhira M."},"6220B009                           ","IJ AIO PRINTER PIXMA MP23",{"$f":"VLOOKUP(E112,[1]Sheet1!G:H,2,0)","v":"Струйное МФУ"},1,856.57089421000001,"110000122581","2013-06-17",406.41914351852029,"2014-08-20",null,null,"Pack Dam","2014-08-20"]
["OPP","CD",{"$f":"VLOOKUP(B113,Sheet2!A:B,2,0)","v":"Ivashkin A. & Yakhira M."},"6220B024                           ","IJ AIO PRINTER PIXMA MP23",{"$f":"VLOOKUP(E113,[1]Sheet1!G:H,2,0)","v":"Струйное МФУ"},1,848.70214283999996,"110000125878","2013-07-21",372.41914351852029,"2014-08-20",null,null,"Pack Dam","2014-08-20"]
["OPP","CD",{"$f":"VLOOKUP(B114,Sheet2!A:B,2,0)","v":"Ivashkin A. & Yakhira M."},"6221B007                           ","IJ AIO PRINTER PIXMA MG22",{"$f":"VLOOKUP(E114,[1]Sheet1!G:H,2,0)","v":"Струйное МФУ"},1,1255.2751800000001,"110000121442","2013-06-03",420.41914351852029,"2014-08-20",null,null,"Damage","2014-08-20"]
["OPP","CD",{"$f":"VLOOKUP(B115,Sheet2!A:B,2,0)","v":"Ivashkin A. & Yakhira M."},"6221B007                           ","IJ AIO PRINTER PIXMA MG22",{"$f":"VLOOKUP(E115,[1]Sheet1!G:H,2,0)","v":"Струйное МФУ"},2,0,110000101207,"2012-12-14",591.41914351852029,"2014-08-20",null,null,"Damage","2014-08-20"]
["OPP","CD",{"$f":"VLOOKUP(B116,Sheet2!A:B,2,0)","v":"Ivashkin A. & Yakhira M."},"6221B025                           ","IJ AIO PRINTER PIXMA MG22",{"$f":"VLOOKUP(E116,[1]Sheet1!G:H,2,0)","v":"Струйное МФУ"},1,1120.12534637,"110000103434","2012-11-30",605.41914351852029,"2014-08-20",null,null,"Damage","2014-08-20"]
["OPP","CD",{"$f":"VLOOKUP(B117,Sheet2!A:B,2,0)","v":"Ivashkin A. & Yakhira M."},"6224B007                           ","IJ AIO PRINTER PIXMA MG42",{"$f":"VLOOKUP(E117,[1]Sheet1!G:H,2,0)","v":"Струйное МФУ"},1,1763.0129924999999,"110000140567","2013-12-11",229.41914351852029,"2014-08-20",null,null,"Damage","2014-08-20"]
["OPP","CD",{"$f":"VLOOKUP(B118,Sheet2!A:B,2,0)","v":"Ivashkin A. & Yakhira M."},"6224B007                           ","IJ AIO PRINTER PIXMA MG42",{"$f":"VLOOKUP(E118,[1]Sheet1!G:H,2,0)","v":"Струйное МФУ"},1,1788.6734856999999,"110000121124","2013-06-30",393.41914351852029,"2014-08-20",null,null,"Damage","2014-08-20"]
["OPP","CD",{"$f":"VLOOKUP(B119,Sheet2!A:B,2,0)","v":"Ivashkin A. & Yakhira M."},"6225B007                           ","IJ AIO PRINTER PIXMA MG54",{"$f":"VLOOKUP(E119,[1]Sheet1!G:H,2,0)","v":"МФУ Canon MG5440"},3,8532.523831890001,"110000123133","2013-06-26",397.41914351852029,"2014-08-20",null,null,"Damage","2014-08-20"]
["OPP","CD",{"$f":"VLOOKUP(B120,Sheet2!A:B,2,0)","v":"Ivashkin A. & Yakhira M."},"8328B007                           ","IJ AIO PRINTER PIXMA MG24","Струйное МФУ",5,4231.9315045500007,"110000154189","2014-07-03",25.419143518520286,"2014-08-20",null,null,"Pack Dam","2014-08-20"]
["OPP","CD",{"$f":"VLOOKUP(B121,Sheet2!A:B,2,0)","v":"Ivashkin A. & Yakhira M."},"8328B007                           ","IJ AIO PRINTER PIXMA MG24","Струйное МФУ",2,1691.3133626800002,"110000153154","2014-05-31",58.419143518520286,"2014-08-20",null,null,"Pack Dam","2014-08-20"]
["OPP","CD",{"$f":"VLOOKUP(B122,Sheet2!A:B,2,0)","v":"Ivashkin A. & Yakhira M."},"8328B007                           ","IJ AIO PRINTER PIXMA MG24","Струйное МФУ",1,865.14008302000002,"110000150944","2014-05-26",63.419143518520286,"2014-08-20",null,null,"Pack Dam","2014-08-20"]
["OPP","CD",{"$f":"VLOOKUP(B123,Sheet2!A:B,2,0)","v":"Ivashkin A. & Yakhira M."},"8328B007                           ","IJ AIO PRINTER PIXMA MG24","Струйное МФУ",1,831.58505664999996,"110000143342","2014-01-24",185.41914351852029,"2014-08-20",null,null,"Pack Dam","2014-08-20"]
["OPP","CD",{"$f":"VLOOKUP(B124,Sheet2!A:B,2,0)","v":"Ivashkin A. & Yakhira M."},"8328B007                           ","IJ AIO PRINTER PIXMA MG24","Струйное МФУ",1,832.89665823000007,"110000141150","2013-12-20",220.41914351852029,"2014-08-20",null,null,"Pack Dam","2014-08-20"]
["OPP","CD",{"$f":"VLOOKUP(B125,Sheet2!A:B,2,0)","v":"Ivashkin A. & Yakhira M."},"8328B007                           ","IJ AIO PRINTER PIXMA MG24","Струйное МФУ",26,21262.331704119999,"110000137457","2013-11-06",264.41914351852029,"2014-08-20",null,null,"Damage","2014-08-20"]
["OPP","CD",{"$f":"VLOOKUP(B126,Sheet2!A:B,2,0)","v":"Ivashkin A. & Yakhira M."},"8328B007                           ","IJ AIO PRINTER PIXMA MG24","Струйное МФУ",2,1656.59018298,"110000132982","2013-09-22",309.41914351852029,"2014-08-20",null,null,"Damage","2014-08-20"]
["OPP","CD",{"$f":"VLOOKUP(B127,Sheet2!A:B,2,0)","v":"Ivashkin A. & Yakhira M."},"8328B007                           ","IJ AIO PRINTER PIXMA MG24","Струйное МФУ",2,1757.4191343800001,"110000131063","2013-09-11",320.41914351852029,"2014-08-20",null,null,"Damage","2014-08-20"]
["OPP","CD",{"$f":"VLOOKUP(B128,Sheet2!A:B,2,0)","v":"Ivashkin A. & Yakhira M."},"8328B007                           ","IJ AIO PRINTER PIXMA MG24","Струйное МФУ",11,9665.8052390900011,"110000131055","2013-09-11",320.41914351852029,"2014-08-20",null,null,"Damage","2014-08-20"]
["OPP","CD",{"$f":"VLOOKUP(B129,Sheet2!A:B,2,0)","v":"Ivashkin A. & Yakhira M."},"8328B007                           ","IJ AIO PRINTER PIXMA MG24","Струйное МФУ",2,1733.3661805199999,"110000131054","2013-09-10",321.41914351852029,"2014-08-20",null,null,"Damage","2014-08-20"]
["OPP","CD",{"$f":"VLOOKUP(B130,Sheet2!A:B,2,0)","v":"Ivashkin A. & Yakhira M."},"8328B007                           ","IJ AIO PRINTER PIXMA MG24","Струйное МФУ",2,1744.8971169599999,"110000131053","2013-09-10",321.41914351852029,"2014-08-20",null,null,"Damage","2014-08-20"]
["OPP","CD",{"$f":"VLOOKUP(B131,Sheet2!A:B,2,0)","v":"Ivashkin A. & Yakhira M."},"8580B007                           ","PIXMA MG5540Black","Струйное МФУ",1,2228.8502840000001,"110000138922","2013-11-17",253.41914351852029,"2014-08-20",null,null,"Pack Dam","2014-08-20"]
["OPP","CD",{"$f":"VLOOKUP(B132,Sheet2!A:B,2,0)","v":"Ivashkin A. & Yakhira M."},"8580B026                           ","PIXMA MG5540White","Струйное МФУ",1,35335.020000000004,"110000130728","2013-09-03",328.41914351852029,"2014-08-20",null,null,"Pack Dam","2014-08-20"]
["OPP","CD",{"$f":"VLOOKUP(B133,Sheet2!A:B,2,0)","v":"Ivashkin A. & Yakhira M."},"9500B007                           ","IJ MFP LILLE MEA","образец",2,35706.97,"110000156668","2014-07-15",13.419143518520286,"2014-08-20",null,null,"Damage","2014-08-20"]
["OPP","CQ",{"$f":"VLOOKUP(B134,Sheet2!A:B,2,0)","v":"Ivashkin A. & Yakhira M."},"4103B009                           ","IJ PRINTER PIXMA IP2700 E",{"$f":"VLOOKUP(E134,[1]Sheet1!G:H,2,0)","v":"Принтер Canon PIXMAIP2700"},1,3011.5246785600002,"110000143339","2014-03-26",124.41914351852029,"2014-08-20",null,null,"Damage","2014-08-20"]
["OPP","CQ",{"$f":"VLOOKUP(B135,Sheet2!A:B,2,0)","v":"Ivashkin A. & Yakhira M."},"4103B009                           ","IJ PRINTER PIXMA IP2700 E",{"$f":"VLOOKUP(E135,[1]Sheet1!G:H,2,0)","v":"Принтер Canon PIXMAIP2700"},3,760.51,"110000143339","2014-03-26",124.41914351852029,"2014-08-20",null,null,"Pack Dam","2014-08-20"]
["OPP","CQ",{"$f":"VLOOKUP(B136,Sheet2!A:B,2,0)","v":"Ivashkin A. & Yakhira M."},"4103B009                           ","IJ PRINTER PIXMA IP2700 E",{"$f":"VLOOKUP(E136,[1]Sheet1!G:H,2,0)","v":"Принтер Canon PIXMAIP2700"},44,33126.771464159996,"110000143339","2014-01-24",185.41914351852029,"2014-08-20",null,null,"Pack Dam","2014-08-20"]
["OPP","CQ",{"$f":"VLOOKUP(B137,Sheet2!A:B,2,0)","v":"Ivashkin A. & Yakhira M."},"4103B009                           ","IJ PRINTER PIXMA IP2700 E",{"$f":"VLOOKUP(E137,[1]Sheet1!G:H,2,0)","v":"Принтер Canon PIXMAIP2700"},1,752.30811604999997,"110000126897","2013-08-19",343.41914351852029,"2014-08-20",null,null,"Pack Dam","2014-08-20"]
["OPP","CQ",{"$f":"VLOOKUP(B138,Sheet2!A:B,2,0)","v":"Ivashkin A. & Yakhira M."},"4786B009                           ","IJ PRINTER PIXMA PRO-1 EU",{"$f":"VLOOKUP(E138,[1]Sheet1!G:H,2,0)","v":"Струйный принтер"},1,18317.50460231,"110000110431","2013-06-10",413.41914351852029,"2014-08-20",null,null,"Pack Dam","2014-08-20"]
["OPP","CQ",{"$f":"VLOOKUP(B139,Sheet2!A:B,2,0)","v":"Ivashkin A. & Yakhira M."},"6228B009                           ","IJ PRINTER PIXMA PRO-100","Струйный фото принтер",1,11446.93830786,"110000160184","2014-08-25",{"$f":"TODAY()-J139","v":15},"2014-08-26"]
["OPP","CQ",{"$f":"VLOOKUP(B140,Sheet2!A:B,2,0)","v":"Ivashkin A. & Yakhira M."},"8747B007                           ","IJ PRINTER PIXMA IX6840 M","Принтер PIXMA IX6840",1,4801.7557433600005,"110000160185","2014-08-25",{"$f":"TODAY()-J140","v":15},"2014-08-26"]
["OPP","GQ",{"$f":"VLOOKUP(B141,Sheet2!A:B,2,0)","v":"Kurakin A."},"6499B001                           ","PGI-450 PGBK EMB",{"$f":"VLOOKUP(E141,[1]Sheet1!G:H,2,0)","v":"картридж струйный"},52,16353.57774492,"110000146439","2014-02-23",155.41914351852029,"2014-08-26",null,null,"Pack Dam","2014-08-26"]
["PV","BQ",{"$f":"VLOOKUP(B142,Sheet2!A:B,2,0)","v":"Aleshina E."},"6352B002                           ","DSC POWERSHOT SX50 HS",{"$f":"VLOOKUP(E142,[1]Sheet1!G:H,2,0)","v":"Цифровой фотоаппарат"},3,21488.272604130001,"110000157069","24.07.2014",4.4191435185202863,"2014-08-20",null,null,"Pack Dam","2014-08-20"]

{"sheet":"Sheet1","index":1,"n_rows":3,"n_cols":1,"rows_kept":3,"cut":false,"hidden":false,"merged":[]}
["Damage"]
["Pack Dam"]
["A-stock"]

{"sheet":"Sheet2","index":2,"n_rows":36,"n_cols":2,"rows_kept":36,"cut":false,"hidden":false,"merged":[]}
["Product Code","PM"]
["CF","Merkulov Y."]
["CG","Merkulov Y."]
["CX","Merkulov Y."]
["PF","Lebedev A."]
["PG","Lebedev A."]
["PX","Lebedev A."]
["SD","Lebedev A."]
["SJ","Lebedev A."]
["CR","Bondarenko M. & Suzuki T."]
["CH","Bondarenko M. & Suzuki T."]
["BF","Suzuki T."]
["GR","Bondarenko M."]
["GH","Bondarenko M."]
["GF","Bondarenko M."]
["EM","Bakulina E."]
["FX","Merkulov Y."]
["BR","Ota E. & Goloshchapov A."]
["GJ","Ota E. & Goloshchapov A."]
["SF","Ota E. & Goloshchapov A."]
["SH","Ota E. & Goloshchapov A."]
["SP","Ota E. & Goloshchapov A."]
["SQ","Ota E. & Goloshchapov A."]
["SR","Ota E. & Goloshchapov A."]
["AC","Bamburova A."]
["AD","Aleshina E."]
["BQ","Aleshina E."]
["VC","Tomomi T."]
["PJ","Tomomi T."]
["AN","Tomomi T."]
["CQ","Ivashkin A. & Yakhira M."]
["CD","Ivashkin A. & Yakhira M."]
["GQ","Kurakin A."]
["AJ","Ivashkin A. & Yakhira M."]
["BE","Kurakin A."]
["DU","Alekseev I."]