{"text_format":"1","workbook":"xlsx","n_sheets":11,"sheets":["Лист1","Лист2","Лист3","Лист4","Лист5","Лист6","Лист7","Лист8","Лист9","Лист10","Скрытый лист"],"not_rendered":{"charts":0,"images":0,"macros":1,"external_links":0,"defined_names":0,"comments":0,"pivot_tables":0},"unopened":[],"bounds":{"document_bytes":16777216,"sheet_cells":100000,"rows_first":2000,"rows_last":500,"rows_between":2000,"halvings":0,"cell_chars":16384,"cell_head_chars":4096},"cells_cut":0,"cells_raw":0,"read":"whole","date_system":"1900"}

{"sheet":"Лист1","index":0,"n_rows":17,"n_cols":2,"rows_kept":17,"cut":false,"hidden":false,"merged":[]}
["1.1",{"$f":"VLOOKUP(A1,'Скрытый лист'!A$2:B$97,2,0)","v":"даша"}]
["1.2",{"$f":"VLOOKUP(A2,'Скрытый лист'!A$2:B$97,2,0)","v":"даша"}]
["1.3",{"$f":"VLOOKUP(A3,'Скрытый лист'!A$2:B$97,2,0)","v":"даша"}]
["1.4",{"$f":"VLOOKUP(A4,'Скрытый лист'!A$2:B$97,2,0)","v":"даша"}]
["1.5",{"$f":"VLOOKUP(A5,'Скрытый лист'!A$2:B$97,2,0)","v":"даша"}]
["1.6",{"$f":"VLOOKUP(A6,'Скрытый лист'!A$2:B$97,2,0)","v":"даша"}]
["1.7",{"$f":"VLOOKUP(A7,'Скрытый лист'!A$2:B$97,2,0)","v":"даша"}]
["1.8",{"$f":"VLOOKUP(A8,'Скрытый лист'!A$2:B$97,2,0)","v":"даша"}]
["1.9",{"$f":"VLOOKUP(A9,'Скрытый лист'!A$2:B$97,2,0)","v":"даша"}]
["3.20",{"$f":"VLOOKUP(A10,'Скрытый лист'!A$2:B$97,2,0)","v":"саша"}]
["3.21",{"$f":"VLOOKUP(A11,'Скрытый лист'!A$2:B$97,2,0)","v":"саша"}]
["3.22",{"$f":"VLOOKUP(A12,'Скрытый лист'!A$2:B$97,2,0)","v":"саша"}]
["3.23",{"$f":"VLOOKUP(A13,'Скрытый лист'!A$2:B$97,2,0)","v":"саша"}]
["3.24",{"$f":"VLOOKUP(A14,'Скрытый лист'!A$2:B$97,2,0)","v":"саша"}]
["3.25",{"$f":"VLOOKUP(A15,'Скрытый лист'!A$2:B$97,2,0)","v":"саша"}]
["3.26",{"$f":"VLOOKUP(A16,'Скрытый лист'!A$2:B$97,2,0)","v":"саша"}]
["3.27",{"$f":"VLOOKUP(A17,'Скрытый лист'!A$2:B$97,2,0)","v":"саша"}]

{"sheet":"Лист2","index":1,"n_rows":57,"n_cols":4,"rows_kept":57,"cut":false,"hidden":false,"merged":[]}
["1.1","даша","кваша ","федя"]
["1.2","даша","кваша ","федя"]
["1.3","даша","кваша ","федя"]
["1.4","даша","кваша ","федя"]
["1.5","даша","кваша ","федя"]
["1.6","даша","кваша ","федя"]
["1.7","даша","кваша ","федя"]
["1.8","даша","кваша ","федя"]
["1.9","даша","кваша ","федя"]
["1.10","даша","кваша ","федя"]
["1.11","даша","кваша ","федя"]
["1.12","даша","кваша ","федя"]
["1.13","даша","кваша ","федя"]
["1.14","даша","кваша ","федя"]
["1.15","даша","кваша ","федя"]
["1.16","даша","кваша ","федя"]
["1.17","даша","кваша ","федя"]
["1.18","даша","кваша ","федя"]
["1.19","даша","кваша ","федя"]
["1.20","даша","кваша ","федя"]
["1.21","даша","кваша ","федя"]
["1.22","даша","кваша ","федя"]
["1.23","даша","кваша ","федя"]
["1.24","даша","кваша ","федя"]
["1.25","даша","кваша ","федя"]
["1.26","даша","кваша ","федя"]
["1.27","даша","кваша ","федя"]
["1.28","даша","кваша ","федя"]
["1.29","даша","кваша ","федя"]
["1.30","даша","кваша ","федя"]
["1.31","даша","кваша ","федя"]
["1.32","даша","кваша ","федя"]
["1.33","даша","кваша ","федя"]
["1.34","даша","кваша ","федя"]
["1.35","даша","кваша ","федя"]
["1.36","даша","кваша ","федя"]
["1.37","даша","кваша ","федя"]
["1.38","даша","кваша ","федя"]
["1.39","даша","кваша ","федя"]
["1.40","даша","кваша ","федя"]
["1.41","даша","кваша ","федя"]
["1.42","даша","кваша ","федя"]
["1.43","даша","кваша ","федя"]
["1.44","даша","кваша ","федя"]
["1.45","даша","кваша ","федя"]
["1.46","даша","кваша ","федя"]
["1.47","даша","кваша ","федя"]
["1.48","даша","кваша ","федя"]
["1.49","даша","кваша ","федя"]
["1.50","даша","кваша ","федя"]
["1.51","даша","кваша ","федя"]
["1.52","даша","кваша ","федя"]
["1.53","даша","кваша ","федя"]
["1.54","даша","кваша ","федя"]
["1.55","даша","кваша ","федя"]
["1.56","даша","кваша ","федя"]
["1.57","даша","кваша ","федя"]

{"sheet":"Лист3","index":2,"n_rows":37,"n_cols":4,"rows_kept":37,"cut":false,"hidden":false,"merged":[]}
["3.1","саша","маша","петя"]
["3.2","саша","маша","петя"]
["3.3","саша","маша","петя"]
["3.4","саша","маша","петя"]
["3.5","саша","маша","петя"]
["3.6","саша","маша","петя"]
["3.7","саша","маша","петя"]
["3.8","саша","маша","петя"]
["3.9","саша","маша","петя"]
["3.10","саша","маша","петя"]
["3.11","саша","маша","петя"]
["3.12","саша","маша","петя"]
["3.13","саша","маша","петя"]
["3.14","саша","маша","петя"]
["3.15","саша","маша","петя"]
["3.16","саша","маша","петя"]
["3.17","саша","маша","петя"]
["3.18","саша","маша","петя"]
["3.19","саша","маша","петя"]
["3.20","саша","маша","петя"]
["3.21","саша","маша","петя"]
["3.22","саша","маша","петя"]
["3.23","саша","маша","петя"]
["3.24","саша","маша","петя"]
["3.25","саша","маша","петя"]
["3.26","саша","маша","петя"]
["3.27","саша","маша","петя"]
["3.28","саша","маша","петя"]
["3.29","саша","маша","петя"]
["3.30","саша","маша","петя"]
["3.31","саша","маша","петя"]
["3.32","саша","маша","петя"]
["3.33","саша","маша","петя"]
["3.34","саша","маша","петя"]
["3.35","саша","маша","петя"]
["3.36","саша","маша","петя"]
["3.37","саша","маша","петя"]

{"sheet":"Лист4","index":3,"n_rows":1,"n_cols":2,"rows_kept":1,"cut":false,"hidden":false,"merged":[]}
["катя","орех"]

{"sheet":"Лист5","index":4,"n_rows":0,"n_cols":0,"rows_kept":0,"cut":false,"hidden":false,"merged":[]}

{"sheet":"Лист6","index":5,"n_rows":0,"n_cols":0,"rows_kept":0,"cut":false,"hidden":false,"merged":[]}

{"sheet":"Лист7","index":6,"n_rows":0,"n_cols":0,"rows_kept":0,"cut":false,"hidden":false,"merged":[]}

{"sheet":"Лист8","index":7,"n_rows":0,"n_cols":0,"rows_kept":0,"cut":false,"hidden":false,"merged":[]}

{"sheet":"Лист9","index":8,"n_rows":0,"n_cols":0,"rows_kept":0,"cut":false,"hidden":false,"merged":[]}

{"sheet":"Лист10","index":9,"n_rows":0,"n_cols":0,"rows_kept":0,"cut":false,"hidden":false,"merged":[]}

{"sheet":"Скрытый лист","index":10,"n_rows":97,"n_cols":2,"rows_kept":97,"cut":false,"hidden":true,"merged":[]}
[]
["1.1","даша"]
["1.2","даша"]
["1.3","даша"]
["1.4","даша"]
["1.5","даша"]
["1.6","даша"]
["1.7","даша"]
["1.8","даша"]
["1.9","даша"]
["1.10","даша"]
["1.11","даша"]
["1.12","даша"]
["1.13","даша"]
["1.14","даша"]
["1.15","даша"]
["1.16","даша"]
["1.17","даша"]
["1.18","даша"]
["1.19","даша"]
["1.20","даша"]
["1.21","даша"]
["1.22","даша"]
["1.23","даша"]
["1.24","даша"]
["1.25","даша"]
["1.26","даша"]
["1.27","даша"]
["1.28","даша"]
["1.29","даша"]
["1.30","даша"]
["1.31","даша"]
["1.32","даша"]
["1.33","даша"]
["1.34","даша"]
["1.35","даша"]
["1.36","даша"]
["1.37","даша"]
["1.38","даша"]
["1.39","даша"]
["1.40","даша"]
["1.41","даша"]
["1.42","даша"]
["1.43","даша"]
["1.44","даша"]
["1.45","даша"]
["1.46","даша"]
["1.47","даша"]
["1.48","даша"]
["1.49","даша"]
["1.50","даша"]
["1.51","даша"]
["1.52","даша"]
["1.53","даша"]
["1.54","даша"]
["1.55","даша"]
["1.56","даша"]
["1.57","даша"]
["3.1","саша"]
["3.2","саша"]
["3.3","саша"]
["3.4","саша"]
["3.5","саша"]
["3.6","саша"]
["3.7","саша"]
["3.8","саша"]
["3.9","саша"]
["3.10","саша"]
["3.11","саша"]
["3.12","саша"]
["3.13","саша"]
["3.14","саша"]
["3.15","саша"]
["3.16","саша"]
["3.17","саша"]
["3.18","саша"]
["3.19","саша"]
["3.20","саша"]
["3.21","саша"]
["3.22","саша"]
["3.23","саша"]
["3.24","саша"]
["3.25","саша"]
["3.26","саша"]
["3.27","саша"]
["3.28","саша"]
["3.29","саша"]
["3.30","саша"]
["3.31","саша"]
["3.32","саша"]
["3.33","саша"]
["3.34","саша"]
["3.35","саша"]
["3.36","саша"]
["3.37","саша"]
["катя","орех"]
["Мурат","АРЕХ"]