{"text_format":"1","workbook":"xlsx","n_sheets":3,"sheets":["Лист1","Лист2","Лист3"],"not_rendered":{"charts":0,"images":0,"macros":1,"external_links":0,"defined_names":0,"comments":0,"pivot_tables":0},"unopened":[],"bounds":{"document_bytes":16777216,"sheet_cells":100000,"rows_first":2000,"rows_last":500,"rows_between":2000,"halvings":0,"cell_chars":16384,"cell_head_chars":4096},"cells_cut":0,"cells_raw":0,"read":"whole","date_system":"1900"}

{"sheet":"Лист1","index":0,"n_rows":27,"n_cols":14,"rows_kept":27,"cut":false,"hidden":false,"merged":[]}
["Шевченко Э.В.","Кривоносов А.Н.","Ершов В.Н.","Самородский Э.А.","Рыбиков А.Н.","Рыбиков А.Н. маршрут№2.","Миржалилов О.А. ст","Миржалилов О.А. р1","Миржалилов О.А. р2","Чистов А.В.","Чистов А.В. маршрут№2","Намазов А.С.","Намазов А.С.  маршрут№2.","Иванов П.П"]
[17,13,14,17,4,9,2,5,8,6,5,7,8]
[0,"пндр-4",0,"8 с","128-1","1 инт","мечн","10",0,"58-п","обв бю","3 д/д","108",0]
["955","ДГБ гав","111",0,"128-2","33 инт","88","101",0,0,"обв в/б","619 с",0,0]
[0,0,"93","15","110","115","298","20",0,"66-п","обв лаб","619 ш","116",0]
["141",0,"107","69","129","100",0,"103","49","682 ш","карпбю","ЦСО","109",0]
["6-1","65","72-1","125-1",0,"63",0,"74-2","29-2",0,"карпв/б","71","123",0]
["6-2","131","8 сот",0,"17","85",0,"64","60","3-п",0,"81","124",0]
["7-1","132","117",0,0,"3",0,0,"52","49-п","бумаж","90","233",0]
["7-2","135-2","72-2","1",0,"37",0,0,"56","657 ш","4","127","48",0]
["122","74-1","136","677 с2",0,"83",0,0,"29-1","9-п","44",0,"78",0]
["140","95","134","677 с1",0,"53 д/д",0,0,"202",0,"5-п",0,"112",0]
["хосп-3",0,"137","91",0,"3-ф",0,0,"70",0,"82",0,0,0]
["34-2","457","118",0,0,"23",0,0,"104-бюд",0,"2 ф",0,0,0]
["34-1",0,"8 д/д",0,0,"252",0,0,"104-не",0,"2",0,0,0]
["120","67","126","133",0,0,0,0,"дгб зем",0,0,0,0,0]
["139","104","25","130 ш",0,0,0,0,"87",0,0,0,0,0]
["121","99","79","130 с",0,0,0,0,"9",0,0,0,0,0]
["295","135-1","125-2","677 ш",0,0,0,0,"21",0,0,0,0,0]
["113",0,0,"12",0,0,0,0,0,0,0,0,0,0]
["36","138",0,"43",0,0,0,0,0,0,0,0,0,0]
["102",0,0,"27",0,0,0,0,0,0,0,0,0,0]
[0,0,0,"32-1",0,0,0,0,0,0,"66-К",0,0,0]
[0,0,0,0,0,0,0,0,0,"Иоффе","103-лс","83-К","фигурист",0]
[0,0,0,"32-3",0,0,0,0,0,"104-Л","Мичур","9-1 сад","фигур,бюд",0]
[0,"119",0,"32-2",0,0,0,0,0,"104-ЛС","619-л","9-2 сад","лунач. лаб",0]
[0,0,0,0,0,0,0,0,0,"701-К","103-Л","9-3 сад",0,0]

{"sheet":"Лист2","index":1,"n_rows":15,"n_cols":5,"rows_kept":15,"cut":false,"hidden":false,"merged":[]}
["Рейс","Водитель","позиция"]
[1,"Шевченко Э.В.",{"$f":"MATCH($B2,Лист1!$A$1:$N$1,0)","v":1},null,{"$f":"получить_список_клиентов(Лист1!$A$2:$N$27,C2)","v":"17, 955, 141, 6-1, 6-2, 7-1, 7-2, 122, 140, хосп-3, 34-2, 34-1, 120, 139, 121, 295, 113, 36, 102"}]
[2,"Кривоносов А.Н.",{"$f":"MATCH($B3,Лист1!$A$1:$N$1,0)","v":2},null,{"$f":"получить_список_клиентов(Лист1!$A$2:$N$27,C3)","v":"13, пндр-4, ДГБ гав, 65, 131, 132, 135-2, 74-1, 95, 457, 67, 104, 99, 135-1, 138, 119"}]
[3,"Ершов В.Н.",{"$f":"MATCH($B4,Лист1!$A$1:$N$1,0)","v":3},null,{"$f":"получить_список_клиентов(Лист1!$A$2:$N$27,C4)","v":"14, 111, 93, 107, 72-1, 8 сот, 117, 72-2, 136, 134, 137, 118, 8 д/д, 126, 25, 79, 125-2"}]
[4,"Самородский Э.А.",{"$f":"MATCH($B5,Лист1!$A$1:$N$1,0)","v":4},null,{"$f":"получить_список_клиентов(Лист1!$A$2:$N$27,C5)","v":"17, 8 с, 15, 69, 125-1, 1, 677 с2, 677 с1, 91, 133, 130 ш, 130 с, 677 ш, 12, 43, 27, 32-1, 32-3, 32-2"}]
[5,"Рыбиков А.Н.",{"$f":"MATCH($B6,Лист1!$A$1:$N$1,0)","v":5},null,{"$f":"получить_список_клиентов(Лист1!$A$2:$N$27,C6)","v":"4, 128-1, 128-2, 110, 129, 17"}]
[6,"Рыбиков А.Н. маршрут№2.",{"$f":"MATCH($B7,Лист1!$A$1:$N$1,0)","v":6},null,{"$f":"получить_список_клиентов(Лист1!$A$2:$N$27,C7)","v":"9, 1 инт, 33 инт, 115, 100, 63, 85, 3, 37, 83, 53 д/д, 3-ф, 23, 252"}]
[7,"Миржалилов О.А. ст",{"$f":"MATCH($B8,Лист1!$A$1:$N$1,0)","v":7},null,{"$f":"получить_список_клиентов(Лист1!$A$2:$N$27,C8)","v":"2, мечн, 88, 298"}]
[8,"Миржалилов О.А. р1",{"$f":"MATCH($B9,Лист1!$A$1:$N$1,0)","v":8},null,{"$f":"получить_список_клиентов(Лист1!$A$2:$N$27,C9)","v":"5, 10, 101, 20, 103, 74-2, 64"}]
[9,"Миржалилов О.А. р2",{"$f":"MATCH($B10,Лист1!$A$1:$N$1,0)","v":9},null,{"$f":"получить_список_клиентов(Лист1!$A$2:$N$27,C10)","v":"8, 49, 29-2, 60, 52, 56, 29-1, 202, 70, 104-бюд, 104-не, дгб зем, 87, 9, 21"}]
[10,"Чистов А.В.",{"$f":"MATCH($B11,Лист1!$A$1:$N$1,0)","v":10},null,{"$f":"получить_список_клиентов(Лист1!$A$2:$N$27,C11)","v":"6, 58-п, 66-п, 682 ш, 3-п, 49-п, 657 ш, 9-п, Иоффе, 104-Л, 104-ЛС, 701-К"}]
[11,"Чистов А.В. маршрут№2",{"$f":"MATCH($B12,Лист1!$A$1:$N$1,0)","v":11},null,{"$f":"получить_список_клиентов(Лист1!$A$2:$N$27,C12)","v":"5, обв бю, обв в/б, обв лаб, карпбю, карпв/б, бумаж, 4, 44, 5-п, 82, 2 ф, 2, 66-К, 103-лс, Мичур, 619-л, 103-Л"}]
[12,"Намазов А.С.",{"$f":"MATCH($B13,Лист1!$A$1:$N$1,0)","v":12},null,{"$f":"получить_список_клиентов(Лист1!$A$2:$N$27,C13)","v":"7, 3 д/д, 619 с, 619 ш, ЦСО, 71, 81, 90, 127, 83-К, 9-1 сад, 9-2 сад, 9-3 сад"}]
[13,"Намазов А.С.  маршрут№2.",{"$f":"MATCH($B14,Лист1!$A$1:$N$1,0)","v":13},null,{"$f":"получить_список_клиентов(Лист1!$A$2:$N$27,C14)","v":"8, 108, 116, 109, 123, 124, 233, 48, 78, 112, фигурист, фигур,бюд, лунач. лаб"}]
[14,"Иванов П.П",{"$f":"MATCH($B15,Лист1!$A$1:$N$1,0)","v":14},null,{"$f":"получить_список_клиентов(Лист1!$A$2:$N$27,C15)","v":""}]

{"sheet":"Лист3","index":2,"n_rows":0,"n_cols":0,"rows_kept":0,"cut":false,"hidden":false,"merged":[]}