{"text_format":"1","workbook":"xlsx","n_sheets":3,"sheets":["Лист1","Лист2","Лист3"],"not_rendered":{"charts":0,"images":3,"macros":1,"external_links":0,"defined_names":1,"comments":0,"pivot_tables":0},"unopened":[],"bounds":{"document_bytes":16777216,"sheet_cells":100000,"rows_first":2000,"rows_last":500,"rows_between":2000,"halvings":0,"cell_chars":16384,"cell_head_chars":4096},"cells_cut":0,"cells_raw":0,"read":"whole","date_system":"1900"}

{"sheet":"Лист1","index":0,"n_rows":5,"n_cols":10,"rows_kept":5,"cut":false,"hidden":false,"merged":[]}
["номер  ","ДАТА","Фамилия И.О.","Телефон","Модель часов","Фото","Заявл. Неиспр","Дата выдачи","Сумма","Возврат,причина"]
[1,{"$f":"TODAY()","v":"2014-11-04"},"Путин ВВ",123456789,"Павел Буре",null,"Пропала кукушка, наверно пошла погулять",{"$f":"TODAY()","v":"2014-11-04"},12366]
[2,"2013-02-01","медведевсукинсынраздолбанный",234565433,"слава",null,"сука",null,1111111]
[3,"2014-11-03","проплюшкин",657676576,"полет",null,"улетели",null,67657]
[4,"2013-02-03","кукушкин",121321321,"привет",null,"полетел маятник"]

{"sheet":"Лист2","index":1,"n_rows":10,"n_cols":5,"rows_kept":10,"cut":false,"hidden":false,"merged":[]}
["Квитанция №",{"$f":"LOOKUP(2,1/(Лист1!A1:A500<>\"\"),Лист1!A1:A500)","v":4},"от",{"$f":"VLOOKUP(B1,Лист1!A1:J500,2,0)","v":"2013-02-03"}]
[]
["ФИО",null,"Телефон",null,"Итого"]
[{"$f":"VLOOKUP(B1,Лист1!A1:J500,3,0)","v":"кукушкин"},null,{"$f":"VLOOKUP(B1,Лист1!A1:J500,4,0)","v":121321321},null,{"$f":"VLOOKUP(B1,Лист1!A1:J500,9,0)","v":0}]
[]
[]
["Итого",{"$f":"INDEX({\"\",\"сто \",\"двести \",\"триста \",\"четыреста \",\"пятьсот \",\"шестьсот \",\"семьсот \",\"восемьсот \",\"девятьсот \"},MOD(TRUNC(E4/10^8),10)+1)&CHOOSE(MOD(TRUNC(E4/10^7),10)+1,\"\",INDEX({\"десять \",\"одиннадцать \",\"двенадцать \",\"тринадцать \",\"четырнадцать \",\"пятнадцать \",\"шестнадцать \",\"семнадцать \",\"восемнадцать \",\"девятнадцать \"},MOD(TRUNC(E4/10^6),10)+1),\"двадцать \",\"тридцать \",\"сорок \",\"пятьдесят \",\"шестьдесят \",\"семьдесят \",\"восемьдесят \",\"девяносто \")&IF(MOD(TRUNC(E4/10^7),10)<>1,INDEX({\"\",\"один \",\"два \",\"три \",\"четыре \",\"пять \",\"шесть \",\"семь \",\"восемь \",\"девять \"},MOD(TRUNC(E4/10^6),10)+1),\"\")&IF(MOD(TRUNC(E4/10^6),1000),\"миллион\"&IF(MOD(TRUNC(E4/10^7),10)=1,\"ов \",VLOOKUP(MOD(TRUNC(E4/10^6),10),{0,\"ов \";1,\" \";2,\"а \";5,\"ов \"},2)),\"\")&INDEX({\"\",\"сто \",\"двести \",\"триста \",\"четыреста \",\"пятьсот \",\"шестьсот \",\"семьсот \",\"восемьсот \",\"девятьсот \"},MOD(TRUNC(E4/10^5),10)+1)&CHOOSE(MOD(TRUNC(E4/10^4),10)+1,\"\",INDEX({\"десять \",\"одиннадцать \",\"двенадцать \",\"тринадцать \",\"четырнадцать \",\"пятнадцать \",\"шестнадцать \",\"семнадцать \",\"восемнадцать \",\"девятнадцать \"},MOD(TRUNC(E4/1000),10)+1),\"двадцать \",\"тридцать \",\"сорок \",\"пятьдесят \",\"шестьдесят \",\"семьдесят \",\"восемьдесят \",\"девяносто \")&IF(MOD(TRUNC(E4/10^4),10)<>1,INDEX({\"\",\"одна \",\"две \",\"три \",\"четыре \",\"пять \",\"шесть \",\"семь \",\"восемь \",\"девять \"},MOD(TRUNC(A1/1000),10)+1),\"\")&IF(MOD(TRUNC(E4/1000),1000),\"тысяч\"&IF(MOD(TRUNC(E4/10^4),10)=1,\" \",VLOOKUP(MOD(TRUNC(E4/1000),10),{0,\" \";1,\"а \";2,\"и \";5,\" \"},2)),\"\")&INDEX({\"\",\"сто \",\"двести \",\"триста \",\"четыреста \",\"пятьсот \",\"шестьсот \",\"семьсот \",\"восемьсот \",\"девятьсот \"},MOD(TRUNC(E4/100),10)+1)&CHOOSE(MOD(TRUNC(E4/10),10)+1,\"\",INDEX({\"десять \",\"одиннадцать \",\"двенадцать \",\"тринадцать \",\"четырнадцать \",\"пятнадцать \",\"шестнадцать \",\"семнадцать \",\"восемнадцать \",\"девятнадцать \"},MOD(TRUNC(E4),10)+1),\"двадцать \",\"тридцать \",\"сорок \",\"пятьдесят \",\"шестьдесят \",\"семьдесят \",\"восемьдесят \",\"девяносто \")&IF(TRUNC(E4)=0,\"ноль \",IF(MOD(TRUNC(E4/10),10)<>1,INDEX({\"\",\"один \",\"два \",\"три \",\"четыре \",\"пять \",\"шесть \",\"семь \",\"восемь \",\"девять \"},MOD(TRUNC(E4),10)+1),\"\"))&\"рубл\"&IF(MOD(TRUNC(E4/10),10)=1,\"ей\",VLOOKUP(MOD(TRUNC(E4),10),{0,\"ей\";1,\"ь\";2,\"я\";5,\"ей\"},2))&TEXT(TRUNC((E4-TRUNC(E4)+0.00001)*100),\" 00\\ коп.;;\")","v":{"$error":"#VALUE!"}}]
[]
[]
[null,"Принял:",{"$f":"VLOOKUP(B1,Лист1!A1:J500,7,0)","v":"полетел маятник"}]

{"sheet":"Лист3","index":2,"n_rows":21,"n_cols":7,"rows_kept":21,"cut":false,"hidden":false,"merged":[]}
[100,"Метровка",null,"Квитанция №",null,{"$f":"LOOKUP(2,1/(Лист1!A1:A500<>\"\"),Лист1!A1:A500)","v":4},"ул.Юрия Смирнова д. 89"]
[null,null,null,"на прием в ремонт часов."]
[]
["Дата приема:",null,{"$f":"VLOOKUP(Лист3!F1,Лист1!A1:J500,2,0)","v":"2013-02-03"},null,null,"Модель:",{"$f":"VLOOKUP(Лист3!F1,Лист1!A1:J500,5,0)","v":"привет"}]
["ФИО:",null,{"$f":"VLOOKUP(Лист3!F1,Лист1!A1:J500,3,0)","v":"кукушкин"}]
["Телефон:",null,{"$f":"VLOOKUP(Лист3!F1,Лист1!A1:J500,4,0)","v":121321321}]
["Заявленная неисправность:",null,null,null,{"$f":"VLOOKUP(Лист3!F1,Лист1!A1:J500,7,0)","v":"полетел маятник"}]
[]
[]
[]
[]
[]
[]
[]
[]
[]
[]
[]
["Дополнительно:______________________________________________________________"]
[null,"В ремонт принял:__________________ ( Крылов В.)"]
[null,"Выдано:  ___________________",null,null,null,"Подпись заказчика______________"]