{"text_format":"1","workbook":"xlsx","n_sheets":3,"sheets":["Отчет","Исходка","Условие"],"not_rendered":{"charts":0,"images":0,"macros":1,"external_links":0,"defined_names":1,"comments":0,"pivot_tables":0},"unopened":[],"bounds":{"document_bytes":16777216,"sheet_cells":100000,"rows_first":2000,"rows_last":500,"rows_between":2000,"halvings":0,"cell_chars":16384,"cell_head_chars":4096},"cells_cut":0,"cells_raw":0,"read":"whole","date_system":"1900"}

{"sheet":"Отчет","index":0,"n_rows":7,"n_cols":10,"rows_kept":7,"cut":false,"hidden":false,"merged":[[1,1,1,3],[1,4,1,6],[1,7,2,7],[1,8,2,8],[1,9,2,9]]}
[null,"-"]
[null,"МОЛОЧНЫЕ",null,null,"МЯСНЫЕ",null,null,"Итог шт. ","Итог руб.","Итог АКБ"]
["ТП","шт. ","руб.","АКБ","шт. ","руб.","АКБ"]
["*Иванов А.",null,null,{"$f":"коллекцияа(Исходка!$A$9:$A$44,Исходка!$C$9:$C$44,Отчет!A4,Исходка!$I$9:$I$44,B$2)","v":0},232,14670.97,{"$f":"коллекцияа(Исходка!$A$9:$A$44,Исходка!$C$9:$C$44,Отчет!A4,Исходка!$I$9:$I$44,E$2)","v":2},232,14670.97,{"$f":"коллекцияа(Исходка!$A$9:$A$44,Исходка!$C$9:$C$44,Отчет!A4)","v":2}]
["*Петров В.",71,2964.6000000000004,{"$f":"коллекцияа(Исходка!$A$9:$A$44,Исходка!$C$9:$C$44,Отчет!A5,Исходка!$I$9:$I$44,B$2)","v":1},207,13775.2,{"$f":"коллекцияа(Исходка!$A$9:$A$44,Исходка!$C$9:$C$44,Отчет!A5,Исходка!$I$9:$I$44,E$2)","v":3},278,16739.800000000003,{"$f":"коллекцияа(Исходка!$A$9:$A$44,Исходка!$C$9:$C$44,Отчет!A5)","v":3}]
["*Суханов И.",84,4392,{"$f":"коллекцияа(Исходка!$A$9:$A$44,Исходка!$C$9:$C$44,Отчет!A6,Исходка!$I$9:$I$44,B$2)","v":2},397,16018.33,{"$f":"коллекцияа(Исходка!$A$9:$A$44,Исходка!$C$9:$C$44,Отчет!A6,Исходка!$I$9:$I$44,E$2)","v":4},481,20410.330000000002,{"$f":"коллекцияа(Исходка!$A$9:$A$44,Исходка!$C$9:$C$44,Отчет!A6)","v":4}]
["Общий итог",155,7356.6,{"$f":"коллекцияа(Исходка!$A$9:$A$44,Исходка!$I$9:$I$44,B$2)","v":3},836,44464.5,{"$f":"коллекцияа(Исходка!$A$9:$A$44,Исходка!$I$9:$I$44,E$2)","v":9},991,51821.100000000006,{"$f":"коллекцияа(Исходка!$A$9:$A$44)","v":9}]

{"sheet":"Исходка","index":1,"n_rows":43,"n_cols":22,"rows_kept":43,"cut":false,"hidden":false,"merged":[[0,12,1,12],[0,13,0,15],[0,16,0,18],[0,19,0,21]]}
[null,null,null,null,null,null,null,null,null,null,null,null,"ФИО","*моло*",null,null,"*мяс*",null,null,"Всего"]
[null,null,null,null,null,null,null,null,null,null,null,null,null,"шт.","руб.","АКБ","шт.","руб.","АКБ","шт.","руб.","АКБ"]
[null,null,null,null,null,null,null,null,null,null,null,null,"*Иванов А.",{"$f":"SUMIFS($G:$G,$F:$F,$N$1,$C:$C,$M3)","v":0},{"$f":"SUMIFS($H:$H,$F:$F,$N$1,$C:$C,$M3)","v":0},0,{"$f":"SUMIFS($G:$G,$F:$F,$Q$1,$C:$C,$M3)","v":232},{"$f":"SUMIFS($H:$H,$F:$F,$Q$1,$C:$C,$M3)","v":14670.97},2,{"$f":"SUM(N3,Q3)","v":232},14670.97,2]
[null,null,null,null,null,null,null,null,null,null,null,null,"*Петров В.",{"$f":"SUMIFS($G:$G,$F:$F,$N$1,$C:$C,$M4)","v":71},{"$f":"SUMIFS($H:$H,$F:$F,$N$1,$C:$C,$M4)","v":2964.6000000000004},1,{"$f":"SUMIFS($G:$G,$F:$F,$Q$1,$C:$C,$M4)","v":207},{"$f":"SUMIFS($H:$H,$F:$F,$Q$1,$C:$C,$M4)","v":13775.2},3,278,16739.800000000003,3]
[null,null,null,null,null,null,null,null,null,null,null,null,"*Суханов И.",{"$f":"SUMIFS($G:$G,$F:$F,$N$1,$C:$C,$M5)","v":84},{"$f":"SUMIFS($H:$H,$F:$F,$N$1,$C:$C,$M5)","v":4392},2,{"$f":"SUMIFS($G:$G,$F:$F,$Q$1,$C:$C,$M5)","v":397},{"$f":"SUMIFS($H:$H,$F:$F,$Q$1,$C:$C,$M5)","v":16018.33},4,481,20410.330000000002,4]
[]
[null,null,null,null,null,null,{"$f":"SUBTOTAL(9,G9:G43)","v":991},{"$f":"SUBTOTAL(9,H9:H43)","v":51821.1}]
["Накл","Дата","ТП","ТТ","Адрес ТТ","Товар","шт.","Сумма","ГРУППА","КЛИЕНТ","УНИКАЛЬНОСТЬ"]
["Л000003904","04.09.2014","*Суханов И.","Прогресс","Ветеранов пр., 55","Молоко",35,1464,{"$f":"VLOOKUP(Таблица1[Товар],Условие!$A:$B,2,0)","v":"МОЛОЧНЫЕ"},{"$f":"CONCATENATE(Таблица1[[#This Row],[ТТ]],\" - \",Таблица1[[#This Row],[Адрес ТТ]])","v":"Прогресс - Ветеранов пр., 55"},{"$f":"IF(COUNTIF($J$9:J9,J9)>1,0,1)","v":1}]
["Л000003904","04.09.2014","*Суханов И.","Прогресс","Ветеранов пр., 55","Ряженка (молочный продукт)",16,1464,{"$f":"VLOOKUP(Таблица1[Товар],Условие!$A:$B,2,0)","v":"МОЛОЧНЫЕ"},{"$f":"CONCATENATE(Таблица1[[#This Row],[ТТ]],\" - \",Таблица1[[#This Row],[Адрес ТТ]])","v":"Прогресс - Ветеранов пр., 55"},{"$f":"IF(COUNTIF($J$9:J10,J10)>1,0,1)","v":0}]
["Л000003904","04.09.2014","*Суханов И.","Прогресс","Ветеранов пр., 55","Свинина (мясо)",21,1329.8,{"$f":"VLOOKUP(Таблица1[Товар],Условие!$A:$B,2,0)","v":"МЯСНЫЕ"},{"$f":"CONCATENATE(Таблица1[[#This Row],[ТТ]],\" - \",Таблица1[[#This Row],[Адрес ТТ]])","v":"Прогресс - Ветеранов пр., 55"},{"$f":"IF(COUNTIF($J$9:J11,J11)>1,0,1)","v":0}]
["Л000003904","04.09.2014","*Суханов И.","Прогресс","Ветеранов пр., 55","Мясо",35,1189.5,{"$f":"VLOOKUP(Таблица1[Товар],Условие!$A:$B,2,0)","v":"МЯСНЫЕ"},{"$f":"CONCATENATE(Таблица1[[#This Row],[ТТ]],\" - \",Таблица1[[#This Row],[Адрес ТТ]])","v":"Прогресс - Ветеранов пр., 55"},{"$f":"IF(COUNTIF($J$9:J12,J12)>1,0,1)","v":0}]
["Л000003904","04.09.2014","*Суханов И.","Прогресс","Ветеранов пр., 55","Тушенка (мясной продукт)",41,1075.77,{"$f":"VLOOKUP(Таблица1[Товар],Условие!$A:$B,2,0)","v":"МЯСНЫЕ"},{"$f":"CONCATENATE(Таблица1[[#This Row],[ТТ]],\" - \",Таблица1[[#This Row],[Адрес ТТ]])","v":"Прогресс - Ветеранов пр., 55"},{"$f":"IF(COUNTIF($J$9:J13,J13)>1,0,1)","v":0}]
["Л000003940","05.09.2014","*Петров В.","Меркурий","Каретная ул., 4","Молоко",45,1061.4000000000001,{"$f":"VLOOKUP(Таблица1[Товар],Условие!$A:$B,2,0)","v":"МОЛОЧНЫЕ"},{"$f":"CONCATENATE(Таблица1[[#This Row],[ТТ]],\" - \",Таблица1[[#This Row],[Адрес ТТ]])","v":"Меркурий - Каретная ул., 4"},{"$f":"IF(COUNTIF($J$9:J14,J14)>1,0,1)","v":1}]
["Л000003940","05.09.2014","*Петров В.","Меркурий","Каретная ул., 4","Кефир - молочный прод.",26,1903.2,{"$f":"VLOOKUP(Таблица1[Товар],Условие!$A:$B,2,0)","v":"МОЛОЧНЫЕ"},{"$f":"CONCATENATE(Таблица1[[#This Row],[ТТ]],\" - \",Таблица1[[#This Row],[Адрес ТТ]])","v":"Меркурий - Каретная ул., 4"},{"$f":"IF(COUNTIF($J$9:J15,J15)>1,0,1)","v":0}]
["Л000003940","05.09.2014","*Петров В.","Меркурий","Каретная ул., 4","Свинина (мясо)",15,1329.8,{"$f":"VLOOKUP(Таблица1[Товар],Условие!$A:$B,2,0)","v":"МЯСНЫЕ"},{"$f":"CONCATENATE(Таблица1[[#This Row],[ТТ]],\" - \",Таблица1[[#This Row],[Адрес ТТ]])","v":"Меркурий - Каретная ул., 4"},{"$f":"IF(COUNTIF($J$9:J16,J16)>1,0,1)","v":0}]
["Л000003940","05.09.2014","*Петров В.","Меркурий","Каретная ул., 4","Мясо",49,1329.8,{"$f":"VLOOKUP(Таблица1[Товар],Условие!$A:$B,2,0)","v":"МЯСНЫЕ"},{"$f":"CONCATENATE(Таблица1[[#This Row],[ТТ]],\" - \",Таблица1[[#This Row],[Адрес ТТ]])","v":"Меркурий - Каретная ул., 4"},{"$f":"IF(COUNTIF($J$9:J17,J17)>1,0,1)","v":0}]
["Л000003940","05.09.2014","*Петров В.","Меркурий","Каретная ул., 4","Свинина (мясо)",28,1380,{"$f":"VLOOKUP(Таблица1[Товар],Условие!$A:$B,2,0)","v":"МЯСНЫЕ"},{"$f":"CONCATENATE(Таблица1[[#This Row],[ТТ]],\" - \",Таблица1[[#This Row],[Адрес ТТ]])","v":"Меркурий - Каретная ул., 4"},{"$f":"IF(COUNTIF($J$9:J18,J18)>1,0,1)","v":0}]
["Л000003944","05.09.2014","*Суханов И.","Марс","Белова ул, 95","Творог (молочный продукт)",33,1464,{"$f":"VLOOKUP(Таблица1[Товар],Условие!$A:$B,2,0)","v":"МОЛОЧНЫЕ"},{"$f":"CONCATENATE(Таблица1[[#This Row],[ТТ]],\" - \",Таблица1[[#This Row],[Адрес ТТ]])","v":"Марс - Белова ул, 95"},{"$f":"IF(COUNTIF($J$9:J19,J19)>1,0,1)","v":1}]
["Л000003944","05.09.2014","*Суханов И.","Марс","Белова ул, 95","Мясо",20,797.88,{"$f":"VLOOKUP(Таблица1[Товар],Условие!$A:$B,2,0)","v":"МЯСНЫЕ"},{"$f":"CONCATENATE(Таблица1[[#This Row],[ТТ]],\" - \",Таблица1[[#This Row],[Адрес ТТ]])","v":"Марс - Белова ул, 95"},{"$f":"IF(COUNTIF($J$9:J20,J20)>1,0,1)","v":0}]
["Л000003944","05.09.2014","*Суханов И.","Марс","Белова ул, 95","Мясо",25,1683.6,{"$f":"VLOOKUP(Таблица1[Товар],Условие!$A:$B,2,0)","v":"МЯСНЫЕ"},{"$f":"CONCATENATE(Таблица1[[#This Row],[ТТ]],\" - \",Таблица1[[#This Row],[Адрес ТТ]])","v":"Марс - Белова ул, 95"},{"$f":"IF(COUNTIF($J$9:J21,J21)>1,0,1)","v":0}]
["Л000003960","05.09.2014","*Петров В.","Рамса","Фарфоровская ул., 4","Тушенка (мясной продукт)",2,1329.8,{"$f":"VLOOKUP(Таблица1[Товар],Условие!$A:$B,2,0)","v":"МЯСНЫЕ"},{"$f":"CONCATENATE(Таблица1[[#This Row],[ТТ]],\" - \",Таблица1[[#This Row],[Адрес ТТ]])","v":"Рамса - Фарфоровская ул., 4"},{"$f":"IF(COUNTIF($J$9:J22,J22)>1,0,1)","v":1}]
["Л000003960","05.09.2014","*Петров В.","Рамса","Фарфоровская ул., 4","Тушенка (мясной продукт)",44,2318,{"$f":"VLOOKUP(Таблица1[Товар],Условие!$A:$B,2,0)","v":"МЯСНЫЕ"},{"$f":"CONCATENATE(Таблица1[[#This Row],[ТТ]],\" - \",Таблица1[[#This Row],[Адрес ТТ]])","v":"Рамса - Фарфоровская ул., 4"},{"$f":"IF(COUNTIF($J$9:J23,J23)>1,0,1)","v":0}]
["Л000003960","05.09.2014","*Петров В.","Рамса","Фарфоровская ул., 4","Тушенка (мясной продукт)",5,1537.2,{"$f":"VLOOKUP(Таблица1[Товар],Условие!$A:$B,2,0)","v":"МЯСНЫЕ"},{"$f":"CONCATENATE(Таблица1[[#This Row],[ТТ]],\" - \",Таблица1[[#This Row],[Адрес ТТ]])","v":"Рамса - Фарфоровская ул., 4"},{"$f":"IF(COUNTIF($J$9:J24,J24)>1,0,1)","v":0}]
["Л000003961","05.09.2014","*Суханов И.","Магазин №2","Комсомольская ул., 106","Тушенка (мясной продукт)",45,1903.2,{"$f":"VLOOKUP(Таблица1[Товар],Условие!$A:$B,2,0)","v":"МЯСНЫЕ"},{"$f":"CONCATENATE(Таблица1[[#This Row],[ТТ]],\" - \",Таблица1[[#This Row],[Адрес ТТ]])","v":"Магазин №2 - Комсомольская ул., 106"},{"$f":"IF(COUNTIF($J$9:J25,J25)>1,0,1)","v":1}]
["Л000003961","05.09.2014","*Суханов И.","Магазин №2","Комсомольская ул., 106","Тушенка (мясной продукт)",46,1159,{"$f":"VLOOKUP(Таблица1[Товар],Условие!$A:$B,2,0)","v":"МЯСНЫЕ"},{"$f":"CONCATENATE(Таблица1[[#This Row],[ТТ]],\" - \",Таблица1[[#This Row],[Адрес ТТ]])","v":"Магазин №2 - Комсомольская ул., 106"},{"$f":"IF(COUNTIF($J$9:J26,J26)>1,0,1)","v":0}]
["Л000003961","05.09.2014","*Суханов И.","Магазин №2","Комсомольская ул., 106","Тушенка (мясной продукт)",4,797.88,{"$f":"VLOOKUP(Таблица1[Товар],Условие!$A:$B,2,0)","v":"МЯСНЫЕ"},{"$f":"CONCATENATE(Таблица1[[#This Row],[ТТ]],\" - \",Таблица1[[#This Row],[Адрес ТТ]])","v":"Магазин №2 - Комсомольская ул., 106"},{"$f":"IF(COUNTIF($J$9:J27,J27)>1,0,1)","v":0}]
["Л000003964","05.09.2014","*Иванов А.","Крона","Южный пр., 70","Тушенка (мясной продукт)",43,925,{"$f":"VLOOKUP(Таблица1[Товар],Условие!$A:$B,2,0)","v":"МЯСНЫЕ"},{"$f":"CONCATENATE(Таблица1[[#This Row],[ТТ]],\" - \",Таблица1[[#This Row],[Адрес ТТ]])","v":"Крона - Южный пр., 70"},{"$f":"IF(COUNTIF($J$9:J28,J28)>1,0,1)","v":1}]
["Л000003964","05.09.2014","*Иванов А.","Крона","Южный пр., 70","Тушенка (мясной продукт)",40,4636,{"$f":"VLOOKUP(Таблица1[Товар],Условие!$A:$B,2,0)","v":"МЯСНЫЕ"},{"$f":"CONCATENATE(Таблица1[[#This Row],[ТТ]],\" - \",Таблица1[[#This Row],[Адрес ТТ]])","v":"Крона - Южный пр., 70"},{"$f":"IF(COUNTIF($J$9:J29,J29)>1,0,1)","v":0}]
["Л000003964","05.09.2014","*Иванов А.","Крона","Южный пр., 70","Тушенка (мясной продукт)",23,2659.6,{"$f":"VLOOKUP(Таблица1[Товар],Условие!$A:$B,2,0)","v":"МЯСНЫЕ"},{"$f":"CONCATENATE(Таблица1[[#This Row],[ТТ]],\" - \",Таблица1[[#This Row],[Адрес ТТ]])","v":"Крона - Южный пр., 70"},{"$f":"IF(COUNTIF($J$9:J30,J30)>1,0,1)","v":0}]
["Л000003964","05.09.2014","*Иванов А.","Крона","Южный пр., 70","Тушенка (мясной продукт)",18,1329.8,{"$f":"VLOOKUP(Таблица1[Товар],Условие!$A:$B,2,0)","v":"МЯСНЫЕ"},{"$f":"CONCATENATE(Таблица1[[#This Row],[ТТ]],\" - \",Таблица1[[#This Row],[Адрес ТТ]])","v":"Крона - Южный пр., 70"},{"$f":"IF(COUNTIF($J$9:J31,J31)>1,0,1)","v":0}]
["Л000003965","05.09.2014","*Суханов И.","Магазин №1","Строителей ул, 4","Тушенка (мясной продукт)",49,530.70000000000005,{"$f":"VLOOKUP(Таблица1[Товар],Условие!$A:$B,2,0)","v":"МЯСНЫЕ"},{"$f":"CONCATENATE(Таблица1[[#This Row],[ТТ]],\" - \",Таблица1[[#This Row],[Адрес ТТ]])","v":"Магазин №1 - Строителей ул, 4"},{"$f":"IF(COUNTIF($J$9:J32,J32)>1,0,1)","v":1}]
["Л000003965","05.09.2014","*Суханов И.","Магазин №1","Строителей ул, 4","Тушенка (мясной продукт)",29,1159,{"$f":"VLOOKUP(Таблица1[Товар],Условие!$A:$B,2,0)","v":"МЯСНЫЕ"},{"$f":"CONCATENATE(Таблица1[[#This Row],[ТТ]],\" - \",Таблица1[[#This Row],[Адрес ТТ]])","v":"Магазин №1 - Строителей ул, 4"},{"$f":"IF(COUNTIF($J$9:J33,J33)>1,0,1)","v":0}]
["Л000003965","05.09.2014","*Суханов И.","Магазин №1","Строителей ул, 4","Тушенка (мясной продукт)",30,1903.2,{"$f":"VLOOKUP(Таблица1[Товар],Условие!$A:$B,2,0)","v":"МЯСНЫЕ"},{"$f":"CONCATENATE(Таблица1[[#This Row],[ТТ]],\" - \",Таблица1[[#This Row],[Адрес ТТ]])","v":"Магазин №1 - Строителей ул, 4"},{"$f":"IF(COUNTIF($J$9:J34,J34)>1,0,1)","v":0}]
["Л000003965","05.09.2014","*Суханов И.","Магазин №1","Строителей ул, 4","Тушенка (мясной продукт)",22,1159,{"$f":"VLOOKUP(Таблица1[Товар],Условие!$A:$B,2,0)","v":"МЯСНЫЕ"},{"$f":"CONCATENATE(Таблица1[[#This Row],[ТТ]],\" - \",Таблица1[[#This Row],[Адрес ТТ]])","v":"Магазин №1 - Строителей ул, 4"},{"$f":"IF(COUNTIF($J$9:J35,J35)>1,0,1)","v":0}]
["Л000003965","05.09.2014","*Суханов И.","Магазин №1","Строителей ул, 4","Тушенка (мясной продукт)",30,1329.8,{"$f":"VLOOKUP(Таблица1[Товар],Условие!$A:$B,2,0)","v":"МЯСНЫЕ"},{"$f":"CONCATENATE(Таблица1[[#This Row],[ТТ]],\" - \",Таблица1[[#This Row],[Адрес ТТ]])","v":"Магазин №1 - Строителей ул, 4"},{"$f":"IF(COUNTIF($J$9:J36,J36)>1,0,1)","v":0}]
["Л000003968","05.09.2014","*Петров В.","Лига","Салова ул., 16","Тушенка (мясной продукт)",27,1329.8,{"$f":"VLOOKUP(Таблица1[Товар],Условие!$A:$B,2,0)","v":"МЯСНЫЕ"},{"$f":"CONCATENATE(Таблица1[[#This Row],[ТТ]],\" - \",Таблица1[[#This Row],[Адрес ТТ]])","v":"Лига - Салова ул., 16"},{"$f":"IF(COUNTIF($J$9:J37,J37)>1,0,1)","v":1}]
["Л000003968","05.09.2014","*Петров В.","Лига","Салова ул., 16","Тушенка (мясной продукт)",9,1537.2,{"$f":"VLOOKUP(Таблица1[Товар],Условие!$A:$B,2,0)","v":"МЯСНЫЕ"},{"$f":"CONCATENATE(Таблица1[[#This Row],[ТТ]],\" - \",Таблица1[[#This Row],[Адрес ТТ]])","v":"Лига - Салова ул., 16"},{"$f":"IF(COUNTIF($J$9:J38,J38)>1,0,1)","v":0}]
["Л000003968","05.09.2014","*Петров В.","Лига","Салова ул., 16","Тушенка (мясной продукт)",28,1683.6,{"$f":"VLOOKUP(Таблица1[Товар],Условие!$A:$B,2,0)","v":"МЯСНЫЕ"},{"$f":"CONCATENATE(Таблица1[[#This Row],[ТТ]],\" - \",Таблица1[[#This Row],[Адрес ТТ]])","v":"Лига - Салова ул., 16"},{"$f":"IF(COUNTIF($J$9:J39,J39)>1,0,1)","v":0}]
["Ф000000002","08.09.2014","*Иванов А.","Фаргус","Московский, 37","Тушенка (мясной продукт)",15,1329.8,{"$f":"VLOOKUP(Таблица1[Товар],Условие!$A:$B,2,0)","v":"МЯСНЫЕ"},{"$f":"CONCATENATE(Таблица1[[#This Row],[ТТ]],\" - \",Таблица1[[#This Row],[Адрес ТТ]])","v":"Фаргус - Московский, 37"},{"$f":"IF(COUNTIF($J$9:J40,J40)>1,0,1)","v":1}]
["Ф000000002","08.09.2014","*Иванов А.","Фаргус","Московский, 37","Тушенка (мясной продукт)",28,920,{"$f":"VLOOKUP(Таблица1[Товар],Условие!$A:$B,2,0)","v":"МЯСНЫЕ"},{"$f":"CONCATENATE(Таблица1[[#This Row],[ТТ]],\" - \",Таблица1[[#This Row],[Адрес ТТ]])","v":"Фаргус - Московский, 37"},{"$f":"IF(COUNTIF($J$9:J41,J41)>1,0,1)","v":0}]
["Ф000000002","08.09.2014","*Иванов А.","Фаргус","Московский, 37","Тушенка (мясной продукт)",29,1795,{"$f":"VLOOKUP(Таблица1[Товар],Условие!$A:$B,2,0)","v":"МЯСНЫЕ"},{"$f":"CONCATENATE(Таблица1[[#This Row],[ТТ]],\" - \",Таблица1[[#This Row],[Адрес ТТ]])","v":"Фаргус - Московский, 37"},{"$f":"IF(COUNTIF($J$9:J42,J42)>1,0,1)","v":0}]
["Ф000000002","08.09.2014","*Иванов А.","Фаргус","Московский, 37","Мясо",36,1075.77,{"$f":"VLOOKUP(Таблица1[Товар],Условие!$A:$B,2,0)","v":"МЯСНЫЕ"},{"$f":"CONCATENATE(Таблица1[[#This Row],[ТТ]],\" - \",Таблица1[[#This Row],[Адрес ТТ]])","v":"Фаргус - Московский, 37"},{"$f":"IF(COUNTIF($J$9:J43,J43)>1,0,1)","v":0}]

{"sheet":"Условие","index":2,"n_rows":8,"n_cols":2,"rows_kept":8,"cut":false,"hidden":false,"merged":[]}
["Товар","ГРУППА"]
["Кефир - молочный прод.","МОЛОЧНЫЕ"]
["Молоко","МОЛОЧНЫЕ"]
["Мясо","МЯСНЫЕ"]
["Ряженка (молочный продукт)","МОЛОЧНЫЕ"]
["Свинина (мясо)","МЯСНЫЕ"]
["Творог (молочный продукт)","МОЛОЧНЫЕ"]
["Тушенка (мясной продукт)","МЯСНЫЕ"]