{"text_format":"1","workbook":"xlsx","n_sheets":3,"sheets":["Наш прайс","Ру-Курьер","Прайс поставщика"],"not_rendered":{"charts":0,"images":0,"macros":1,"external_links":0,"defined_names":0,"comments":0,"pivot_tables":0},"unopened":[],"bounds":{"document_bytes":16777216,"sheet_cells":100000,"rows_first":2000,"rows_last":500,"rows_between":2000,"halvings":0,"cell_chars":16384,"cell_head_chars":4096},"cells_cut":0,"cells_raw":0,"read":"whole","date_system":"1900"}

{"sheet":"Наш прайс","index":0,"n_rows":13,"n_cols":15,"rows_kept":13,"cut":false,"hidden":false,"merged":[]}
["№","Наименование","Наименование","Штрихкод EAN13","ШК поставщика (если есть)","ШК свой (если есть)","Тип своего ШК","Код","Артикул - ОЛДИМ","ШК РК","Цена продажи","РРЦ","Закупочная цена"]
[null,"Paraframe II Tanto",null,null,null,null,null,null,"31001734N",null,null,2457,1301,{"$f":"INDEX('Прайс поставщика'!$L$3:$L$48,MATCH(\"*\"&I2,'Прайс поставщика'!$B$3:$B$48,0),1)","v":2457},{"$f":"INDEX('Прайс поставщика'!$J$3:$J$48,MATCH(\"*\"&I2,'Прайс поставщика'!$B$3:$B$48,0),1)","v":1301}]
[null,"Paraframe II Fine",null,null,null,null,null,null,"2248448",null,null,null,null,{"$f":"INDEX('Прайс поставщика'!$L$3:$L$48,MATCH(\"*\"&I3,'Прайс поставщика'!$B$3:$B$48,0),1)","v":2552},{"$f":"INDEX('Прайс поставщика'!$J$3:$J$48,MATCH(\"*\"&I3,'Прайс поставщика'!$B$3:$B$48,0),1)","v":1351}]
[null,"Paraframe II Serrated",null,null,null,null,null,null,"2248447N",null,null,null,null,{"$f":"INDEX('Прайс поставщика'!$L$3:$L$48,MATCH(\"*\"&I4,'Прайс поставщика'!$B$3:$B$48,0),1)","v":2285},{"$f":"INDEX('Прайс поставщика'!$J$3:$J$48,MATCH(\"*\"&I4,'Прайс поставщика'!$B$3:$B$48,0),1)","v":1210}]
[null,"Paraframe Mini Fine",null,null,null,null,null,null,"2248485N",null,null,null,null,{"$f":"INDEX('Прайс поставщика'!$L$3:$L$48,MATCH(\"*\"&I5,'Прайс поставщика'!$B$3:$B$48,0),1)","v":1428},{"$f":"INDEX('Прайс поставщика'!$J$3:$J$48,MATCH(\"*\"&I5,'Прайс поставщика'!$B$3:$B$48,0),1)","v":756}]
[null,"PR 3.0 Serrated",null,null,null,null,null,null,"2241551",null,null,null,null,{"$f":"INDEX('Прайс поставщика'!$L$3:$L$48,MATCH(\"*\"&I6,'Прайс поставщика'!$B$3:$B$48,0),1)","v":3671},{"$f":"INDEX('Прайс поставщика'!$J$3:$J$48,MATCH(\"*\"&I6,'Прайс поставщика'!$B$3:$B$48,0),1)","v":1944}]
[null,"Remix Fine",null,null,null,null,null,null,"2241968/2231000302",null,null,null,null,{"$f":"INDEX('Прайс поставщика'!$L$3:$L$48,MATCH(\"*\"&I7,'Прайс поставщика'!$B$3:$B$48,0),1)","v":2534},{"$f":"INDEX('Прайс поставщика'!$J$3:$J$48,MATCH(\"*\"&I7,'Прайс поставщика'!$B$3:$B$48,0),1)","v":1342}]
[null,"Remix Serrated",null,null,null,null,null,null,"2241969N",null,null,null,null,{"$f":"INDEX('Прайс поставщика'!$L$3:$L$48,MATCH(\"*\"&I8,'Прайс поставщика'!$B$3:$B$48,0),1)","v":2534},{"$f":"INDEX('Прайс поставщика'!$J$3:$J$48,MATCH(\"*\"&I8,'Прайс поставщика'!$B$3:$B$48,0),1)","v":1342}]
[null,"Mini-Remix",null,null,null,null,null,null,"31000346N/31001191",null,null,null,null,{"$f":"INDEX('Прайс поставщика'!$L$3:$L$48,MATCH(\"*\"&I9,'Прайс поставщика'!$B$3:$B$48,0),1)","v":1895},{"$f":"INDEX('Прайс поставщика'!$J$3:$J$48,MATCH(\"*\"&I9,'Прайс поставщика'!$B$3:$B$48,0),1)","v":1003}]
[null,"Remix Tactical",null,null,null,null,null,null,"31001098N",null,null,null,null,{"$f":"INDEX('Прайс поставщика'!$L$3:$L$48,MATCH(\"*\"&I10,'Прайс поставщика'!$B$3:$B$48,0),1)","v":3119},{"$f":"INDEX('Прайс поставщика'!$J$3:$J$48,MATCH(\"*\"&I10,'Прайс поставщика'!$B$3:$B$48,0),1)","v":1652}]
[null,"STL 2.5",null,null,null,null,null,null,"31000716/2231000781",null,null,null,null,{"$f":"INDEX('Прайс поставщика'!$L$3:$L$48,MATCH(\"*\"&I11,'Прайс поставщика'!$B$3:$B$48,0),1)","v":1316},{"$f":"INDEX('Прайс поставщика'!$J$3:$J$48,MATCH(\"*\"&I11,'Прайс поставщика'!$B$3:$B$48,0),1)","v":697}]
[null,"Swagger",null,null,null,null,null,null,"31000594N",null,null,null,null,{"$f":"INDEX('Прайс поставщика'!$L$3:$L$48,MATCH(\"*\"&I12,'Прайс поставщика'!$B$3:$B$48,0),1)","v":2513},{"$f":"INDEX('Прайс поставщика'!$J$3:$J$48,MATCH(\"*\"&I12,'Прайс поставщика'!$B$3:$B$48,0),1)","v":1331}]
[null,"E.A.B. Lite",null,null,null,null,null,null,"31000345N",null,null,null,null,{"$f":"INDEX('Прайс поставщика'!$L$3:$L$48,MATCH(\"*\"&I13,'Прайс поставщика'!$B$3:$B$48,0),1)","v":1088},{"$f":"INDEX('Прайс поставщика'!$J$3:$J$48,MATCH(\"*\"&I13,'Прайс поставщика'!$B$3:$B$48,0),1)","v":577}]

{"sheet":"Ру-Курьер","index":1,"n_rows":529,"n_cols":13,"rows_kept":529,"cut":false,"hidden":true,"merged":[]}
["Номенклатура","Вид (Товар, Услуга)","ШК Производителя","ШК поставщика (если есть)","ШК свой (если есть)","Тип своего ШК","Артикул свой","Вес","Глубина","Ширина","Высота","ШК РК","Цена"]
[{"$f":"IF('Наш прайс'!#REF!=0,\"\",'Наш прайс'!#REF!)","v":{"$error":"#REF!"}},{"$f":"IF('Наш прайс'!#REF!=0,\"\",'Наш прайс'!#REF!)","v":{"$error":"#REF!"}},{"$f":"IF('Наш прайс'!#REF!=0,\"\",'Наш прайс'!#REF!)","v":{"$error":"#REF!"}},{"$f":"L2","v":{"$error":"#REF!"}},null,null,{"$f":"IF('Наш прайс'!#REF!=0,\"\",'Наш прайс'!#REF!)","v":{"$error":"#REF!"}},{"$f":"IF('Наш прайс'!#REF!=0,\"\",'Наш прайс'!#REF!)","v":{"$error":"#REF!"}},{"$f":"IF('Наш прайс'!#REF!=0,\"\",'Наш прайс'!#REF!)","v":{"$error":"#REF!"}},{"$f":"IF('Наш прайс'!#REF!=0,\"\",'Наш прайс'!#REF!)","v":{"$error":"#REF!"}},{"$f":"IF('Наш прайс'!#REF!=0,\"\",'Наш прайс'!#REF!)","v":{"$error":"#REF!"}},{"$f":"IF('Наш прайс'!#REF!=0,\"\",'Наш прайс'!#REF!)","v":{"$error":"#REF!"}},{"$f":"IF('Наш прайс'!#REF!=0,\"\",'Наш прайс'!#REF!)","v":{"$error":"#REF!"}}]
[{"$f":"IF('Наш прайс'!#REF!=0,\"\",'Наш прайс'!#REF!)","v":{"$error":"#REF!"}},{"$f":"IF('Наш прайс'!#REF!=0,\"\",'Наш прайс'!#REF!)","v":{"$error":"#REF!"}},{"$f":"IF('Наш прайс'!#REF!=0,\"\",'Наш прайс'!#REF!)","v":{"$error":"#REF!"}},{"$f":"L3","v":{"$error":"#REF!"}},null,null,{"$f":"IF('Наш прайс'!#REF!=0,\"\",'Наш прайс'!#REF!)","v":{"$error":"#REF!"}},{"$f":"IF('Наш прайс'!#REF!=0,\"\",'Наш прайс'!#REF!)","v":{"$error":"#REF!"}},{"$f":"IF('Наш прайс'!#REF!=0,\"\",'Наш прайс'!#REF!)","v":{"$error":"#REF!"}},{"$f":"IF('Наш прайс'!#REF!=0,\"\",'Наш прайс'!#REF!)","v":{"$error":"#REF!"}},{"$f":"IF('Наш прайс'!#REF!=0,\"\",'Наш прайс'!#REF!)","v":{"$error":"#REF!"}},{"$f":"IF('Наш прайс'!#REF!=0,\"\",'Наш прайс'!#REF!)","v":{"$error":"#REF!"}},{"$f":"IF('Наш прайс'!#REF!=0,\"\",'Наш прайс'!#REF!)","v":{"$error":"#REF!"}}]
[{"$f":"IF('Наш прайс'!#REF!=0,\"\",'Наш прайс'!#REF!)","v":{"$error":"#REF!"}},{"$f":"IF('Наш прайс'!#REF!=0,\"\",'Наш прайс'!#REF!)","v":{"$error":"#REF!"}},{"$f":"IF('Наш прайс'!#REF!=0,\"\",'Наш прайс'!#REF!)","v":{"$error":"#REF!"}},{"$error":"#REF!"},null,null,{"$f":"IF('Наш прайс'!#REF!=0,\"\",'Наш прайс'!#REF!)","v":{"$error":"#REF!"}},{"$f":"IF('Наш прайс'!#REF!=0,\"\",'Наш прайс'!#REF!)","v":{"$error":"#REF!"}},{"$f":"IF('Наш прайс'!#REF!=0,\"\",'Наш прайс'!#REF!)","v":{"$error":"#REF!"}},{"$f":"IF('Наш прайс'!#REF!=0,\"\",'Наш прайс'!#REF!)","v":{"$error":"#REF!"}},{"$f":"IF('Наш прайс'!#REF!=0,\"\",'Наш прайс'!#REF!)","v":{"$error":"#REF!"}},{"$f":"IF('Наш прайс'!#REF!=0,\"\",'Наш прайс'!#REF!)","v":{"$error":"#REF!"}},{"$f":"IF('Наш прайс'!#REF!=0,\"\",'Наш прайс'!#REF!)","v":{"$error":"#REF!"}}]
[{"$f":"IF('Наш прайс'!#REF!=0,\"\",'Наш прайс'!#REF!)","v":{"$error":"#REF!"}},{"$f":"IF('Наш прайс'!#REF!=0,\"\",'Наш прайс'!#REF!)","v":{"$error":"#REF!"}},{"$f":"IF('Наш прайс'!#REF!=0,\"\",'Наш прайс'!#REF!)","v":{"$error":"#REF!"}},{"$error":"#REF!"},null,null,{"$f":"IF('Наш прайс'!#REF!=0,\"\",'Наш прайс'!#REF!)","v":{"$error":"#REF!"}},{"$f":"IF('Наш прайс'!#REF!=0,\"\",'Наш прайс'!#REF!)","v":{"$error":"#REF!"}},{"$f":"IF('Наш прайс'!#REF!=0,\"\",'Наш прайс'!#REF!)","v":{"$error":"#REF!"}},{"$f":"IF('Наш прайс'!#REF!=0,\"\",'Наш прайс'!#REF!)","v":{"$error":"#REF!"}},{"$f":"IF('Наш прайс'!#REF!=0,\"\",'Наш прайс'!#REF!)","v":{"$error":"#REF!"}},{"$f":"IF('Наш прайс'!#REF!=0,\"\",'Наш прайс'!#REF!)","v":{"$error":"#REF!"}},{"$f":"IF('Наш прайс'!#REF!=0,\"\",'Наш прайс'!#REF!)","v":{"$error":"#REF!"}}]
[{"$f":"IF('Наш прайс'!#REF!=0,\"\",'Наш прайс'!#REF!)","v":{"$error":"#REF!"}},{"$f":"IF('Наш прайс'!#REF!=0,\"\",'Наш прайс'!#REF!)","v":{"$error":"#REF!"}},{"$f":"IF('Наш прайс'!#REF!=0,\"\",'Наш прайс'!#REF!)","v":{"$error":"#REF!"}},{"$error":"#REF!"},null,null,{"$f":"IF('Наш прайс'!#REF!=0,\"\",'Наш прайс'!#REF!)","v":{"$error":"#REF!"}},{"$f":"IF('Наш прайс'!#REF!=0,\"\",'Наш прайс'!#REF!)","v":{"$error":"#REF!"}},{"$f":"IF('Наш прайс'!#REF!=0,\"\",'Наш прайс'!#REF!)","v":{"$error":"#REF!"}},{"$f":"IF('Наш прайс'!#REF!=0,\"\",'Наш прайс'!#REF!)","v":{"$error":"#REF!"}},{"$f":"IF('Наш прайс'!#REF!=0,\"\",'Наш прайс'!#REF!)","v":{"$error":"#REF!"}},{"$f":"IF('Наш прайс'!#REF!=0,\"\",'Наш прайс'!#REF!)","v":{"$error":"#REF!"}},{"$f":"IF('Наш прайс'!#REF!=0,\"\",'Наш прайс'!#REF!)","v":{"$error":"#REF!"}}]
[{"$f":"IF('Наш прайс'!#REF!=0,\"\",'Наш прайс'!#REF!)","v":{"$error":"#REF!"}},{"$f":"IF('Наш прайс'!#REF!=0,\"\",'Наш прайс'!#REF!)","v":{"$error":"#REF!"}},{"$f":"IF('Наш прайс'!#REF!=0,\"\",'Наш прайс'!#REF!)","v":{"$error":"#REF!"}},{"$error":"#REF!"},null,null,{"$f":"IF('Наш прайс'!#REF!=0,\"\",'Наш прайс'!#REF!)","v":{"$error":"#REF!"}},{"$f":"IF('Наш прайс'!#REF!=0,\"\",'Наш прайс'!#REF!)","v":{"$error":"#REF!"}},{"$f":"IF('Наш прайс'!#REF!=0,\"\",'Наш прайс'!#REF!)","v":{"$error":"#REF!"}},{"$f":"IF('Наш прайс'!#REF!=0,\"\",'Наш прайс'!#REF!)","v":{"$error":"#REF!"}},{"$f":"IF('Наш прайс'!#REF!=0,\"\",'Наш прайс'!#REF!)","v":{"$error":"#REF!"}},{"$f":"IF('Наш прайс'!#REF!=0,\"\",'Наш прайс'!#REF!)","v":{"$error":"#REF!"}},{"$f":"IF('Наш прайс'!#REF!=0,\"\",'Наш прайс'!#REF!)","v":{"$error":"#REF!"}}]
[{"$f":"IF('Наш прайс'!#REF!=0,\"\",'Наш прайс'!#REF!)","v":{"$error":"#REF!"}},{"$f":"IF('Наш прайс'!#REF!=0,\"\",'Наш прайс'!#REF!)","v":{"$error":"#REF!"}},{"$f":"IF('Наш прайс'!#REF!=0,\"\",'Наш прайс'!#REF!)","v":{"$error":"#REF!"}},{"$error":"#REF!"},null,null,{"$f":"IF('Наш прайс'!#REF!=0,\"\",'Наш прайс'!#REF!)","v":{"$error":"#REF!"}},{"$f":"IF('Наш прайс'!#REF!=0,\"\",'Наш прайс'!#REF!)","v":{"$error":"#REF!"}},{"$f":"IF('Наш прайс'!#REF!=0,\"\",'Наш прайс'!#REF!)","v":{"$error":"#REF!"}},{"$f":"IF('Наш прайс'!#REF!=0,\"\",'Наш прайс'!#REF!)","v":{"$error":"#REF!"}},{"$f":"IF('Наш прайс'!#REF!=0,\"\",'Наш прайс'!#REF!)","v":{"$error":"#REF!"}},{"$f":"IF('Наш прайс'!#REF!=0,\"\",'Наш прайс'!#REF!)","v":{"$error":"#REF!"}},{"$f":"IF('Наш прайс'!#REF!=0,\"\",'Наш прайс'!#REF!)","v":{"$error":"#REF!"}}]
[{"$f":"IF('Наш прайс'!#REF!=0,\"\",'Наш прайс'!#REF!)","v":{"$error":"#REF!"}},{"$f":"IF('Наш прайс'!#REF!=0,\"\",'Наш прайс'!#REF!)","v":{"$error":"#REF!"}},{"$f":"IF('Наш прайс'!#REF!=0,\"\",'Наш прайс'!#REF!)","v":{"$error":"#REF!"}},{"$error":"#REF!"},null,null,{"$f":"IF('Наш прайс'!#REF!=0,\"\",'Наш прайс'!#REF!)","v":{"$error":"#REF!"}},{"$f":"IF('Наш прайс'!#REF!=0,\"\",'Наш прайс'!#REF!)","v":{"$error":"#REF!"}},{"$f":"IF('Наш прайс'!#REF!=0,\"\",'Наш прайс'!#REF!)","v":{"$error":"#REF!"}},{"$f":"IF('Наш прайс'!#REF!=0,\"\",'Наш прайс'!#REF!)","v":{"$error":"#REF!"}},{"$f":"IF('Наш прайс'!#REF!=0,\"\",'Наш прайс'!#REF!)","v":{"$error":"#REF!"}},{"$f":"IF('Наш прайс'!#REF!=0,\"\",'Наш прайс'!#REF!)","v":{"$error":"#REF!"}},{"$f":"IF('Наш прайс'!#REF!=0,\"\",'Наш прайс'!#REF!)","v":{"$error":"#REF!"}}]
[{"$f":"IF('Наш прайс'!#REF!=0,\"\",'Наш прайс'!#REF!)","v":{"$error":"#REF!"}},{"$f":"IF('Наш прайс'!#REF!=0,\"\",'Наш прайс'!#REF!)","v":{"$error":"#REF!"}},{"$f":"IF('Наш прайс'!#REF!=0,\"\",'Наш прайс'!#REF!)","v":{"$error":"#REF!"}},{"$error":"#REF!"},null,null,{"$f":"IF('Наш прайс'!#REF!=0,\"\",'Наш прайс'!#REF!)","v":{"$error":"#REF!"}},{"$f":"IF('Наш прайс'!#REF!=0,\"\",'Наш прайс'!#REF!)","v":{"$error":"#REF!"}},{"$f":"IF('Наш прайс'!#REF!=0,\"\",'Наш прайс'!#REF!)","v":{"$error":"#REF!"}},{"$f":"IF('Наш прайс'!#REF!=0,\"\",'Наш прайс'!#REF!)","v":{"$error":"#REF!"}},{"$f":"IF('Наш прайс'!#REF!=0,\"\",'Наш прайс'!#REF!)","v":{"$error":"#REF!"}},{"$f":"IF('Наш прайс'!#REF!=0,\"\",'Наш прайс'!#REF!)","v":{"$error":"#REF!"}},{"$f":"IF('Наш прайс'!#REF!=0,\"\",'Наш прайс'!#REF!)","v":{"$error":"#REF!"}}]
[{"$f":"IF('Наш прайс'!#REF!=0,\"\",'Наш прайс'!#REF!)","v":{"$error":"#REF!"}},{"$f":"IF('Наш прайс'!#REF!=0,\"\",'Наш прайс'!#REF!)","v":{"$error":"#REF!"}},{"$f":"IF('Наш прайс'!#REF!=0,\"\",'Наш прайс'!#REF!)","v":{"$error":"#REF!"}},{"$error":"#REF!"},null,null,{"$f":"IF('Наш прайс'!#REF!=0,\"\",'Наш прайс'!#REF!)","v":{"$error":"#REF!"}},{"$f":"IF('Наш прайс'!#REF!=0,\"\",'Наш прайс'!#REF!)","v":{"$error":"#REF!"}},{"$f":"IF('Наш прайс'!#REF!=0,\"\",'Наш прайс'!#REF!)","v":{"$error":"#REF!"}},{"$f":"IF('Наш прайс'!#REF!=0,\"\",'Наш прайс'!#REF!)","v":{"$error":"#REF!"}},{"$f":"IF('Наш прайс'!#REF!=0,\"\",'Наш прайс'!#REF!)","v":{"$error":"#REF!"}},{"$f":"IF('Наш прайс'!#REF!=0,\"\",'Наш прайс'!#REF!)","v":{"$error":"#REF!"}},{"$f":"IF('Наш прайс'!#REF!=0,\"\",'Наш прайс'!#REF!)","v":{"$error":"#REF!"}}]
[{"$f":"IF('Наш прайс'!#REF!=0,\"\",'Наш прайс'!#REF!)","v":{"$error":"#REF!"}},{"$f":"IF('Наш прайс'!#REF!=0,\"\",'Наш прайс'!#REF!)","v":{"$error":"#REF!"}},{"$f":"IF('Наш прайс'!#REF!=0,\"\",'Наш прайс'!#REF!)","v":{"$error":"#REF!"}},{"$error":"#REF!"},null,null,{"$f":"IF('Наш прайс'!#REF!=0,\"\",'Наш прайс'!#REF!)","v":{"$error":"#REF!"}},{"$f":"IF('Наш прайс'!#REF!=0,\"\",'Наш прайс'!#REF!)","v":{"$error":"#REF!"}},{"$f":"IF('Наш прайс'!#REF!=0,\"\",'Наш прайс'!#REF!)","v":{"$error":"#REF!"}},{"$f":"IF('Наш прайс'!#REF!=0,\"\",'Наш прайс'!#REF!)","v":{"$error":"#REF!"}},{"$f":"IF('Наш прайс'!#REF!=0,\"\",'Наш прайс'!#REF!)","v":{"$error":"#REF!"}},{"$f":"IF('Наш прайс'!#REF!=0,\"\",'Наш прайс'!#REF!)","v":{"$error":"#REF!"}},{"$f":"IF('Наш прайс'!#REF!=0,\"\",'Наш прайс'!#REF!)","v":{"$error":"#REF!"}}]
[{"$f":"IF('Наш прайс'!#REF!=0,\"\",'Наш прайс'!#REF!)","v":{"$error":"#REF!"}},{"$f":"IF('Наш прайс'!#REF!=0,\"\",'Наш прайс'!#REF!)","v":{"$error":"#REF!"}},{"$f":"IF('Наш прайс'!#REF!=0,\"\",'Наш прайс'!#REF!)","v":{"$error":"#REF!"}},{"$error":"#REF!"},null,null,{"$f":"IF('Наш прайс'!#REF!=0,\"\",'Наш прайс'!#REF!)","v":{"$error":"#REF!"}},{"$f":"IF('Наш прайс'!#REF!=0,\"\",'Наш прайс'!#REF!)","v":{"$error":"#REF!"}},{"$f":"IF('Наш прайс'!#REF!=0,\"\",'Наш прайс'!#REF!)","v":{"$error":"#REF!"}},{"$f":"IF('Наш прайс'!#REF!=0,\"\",'Наш прайс'!#REF!)","v":{"$error":"#REF!"}},{"$f":"IF('Наш прайс'!#REF!=0,\"\",'Наш прайс'!#REF!)","v":{"$error":"#REF!"}},{"$f":"IF('Наш прайс'!#REF!=0,\"\",'Наш прайс'!#REF!)","v":{"$error":"#REF!"}},{"$f":"IF('Наш прайс'!#REF!=0,\"\",'Наш прайс'!#REF!)","v":{"$error":"#REF!"}}]
[{"$f":"IF('Наш прайс'!#REF!=0,\"\",'Наш прайс'!#REF!)","v":{"$error":"#REF!"}},{"$f":"IF('Наш прайс'!#REF!=0,\"\",'Наш прайс'!#REF!)","v":{"$error":"#REF!"}},{"$f":"IF('Наш прайс'!#REF!=0,\"\",'Наш прайс'!#REF!)","v":{"$error":"#REF!"}},{"$error":"#REF!"},null,null,{"$f":"IF('Наш прайс'!#REF!=0,\"\",'Наш прайс'!#REF!)","v":{"$error":"#REF!"}},{"$f":"IF('Наш прайс'!#REF!=0,\"\",'Наш прайс'!#REF!)","v":{"$error":"#REF!"}},{"$f":"IF('Наш прайс'!#REF!=0,\"\",'Наш прайс'!#REF!)","v":{"$error":"#REF!"}},{"$f":"IF('Наш прайс'!#REF!=0,\"\",'Наш прайс'!#REF!)","v":{"$error":"#REF!"}},{"$f":"IF('Наш прайс'!#REF!=0,\"\",'Наш прайс'!#REF!)","v":{"$error":"#REF!"}},{"$f":"IF('Наш прайс'!#REF!=0,\"\",'Наш прайс'!#REF!)","v":{"$error":"#REF!"}},{"$f":"IF('Наш прайс'!#REF!=0,\"\",'Наш прайс'!#REF!)","v":{"$error":"#REF!"}}]
[{"$f":"IF('Наш прайс'!#REF!=0,\"\",'Наш прайс'!#REF!)","v":{"$error":"#REF!"}},{"$f":"IF('Наш прайс'!#REF!=0,\"\",'Наш прайс'!#REF!)","v":{"$error":"#REF!"}},{"$f":"IF('Наш прайс'!#REF!=0,\"\",'Наш прайс'!#REF!)","v":{"$error":"#REF!"}},{"$error":"#REF!"},null,null,{"$f":"IF('Наш прайс'!#REF!=0,\"\",'Наш прайс'!#REF!)","v":{"$error":"#REF!"}},{"$f":"IF('Наш прайс'!#REF!=0,\"\",'Наш прайс'!#REF!)","v":{"$error":"#REF!"}},{"$f":"IF('Наш прайс'!#REF!=0,\"\",'Наш прайс'!#REF!)","v":{"$error":"#REF!"}},{"$f":"IF('Наш прайс'!#REF!=0,\"\",'Наш прайс'!#REF!)","v":{"$error":"#REF!"}},{"$f":"IF('Наш прайс'!#REF!=0,\"\",'Наш прайс'!#REF!)","v":{"$error":"#REF!"}},{"$f":"IF('Наш прайс'!#REF!=0,\"\",'Наш прайс'!#REF!)","v":{"$error":"#REF!"}},{"$f":"IF('Наш прайс'!#REF!=0,\"\",'Наш прайс'!#REF!)","v":{"$error":"#REF!"}}]
[{"$f":"IF('Наш прайс'!#REF!=0,\"\",'Наш прайс'!#REF!)","v":{"$error":"#REF!"}},{"$f":"IF('Наш прайс'!#REF!=0,\"\",'Наш прайс'!#REF!)","v":{"$error":"#REF!"}},{"$f":"IF('Наш прайс'!#REF!=0,\"\",'Наш прайс'!#REF!)","v":{"$error":"#REF!"}},{"$error":"#REF!"},null,null,{"$f":"IF('Наш прайс'!#REF!=0,\"\",'Наш прайс'!#REF!)","v":{"$error":"#REF!"}},{"$f":"IF('Наш прайс'!#REF!=0,\"\",'Наш прайс'!#REF!)","v":{"$error":"#REF!"}},{"$f":"IF('Наш прайс'!#REF!=0,\"\",'Наш прайс'!#REF!)","v":{"$error":"#REF!"}},{"$f":"IF('Наш прайс'!#REF!=0,\"\",'Наш прайс'!#REF!)","v":{"$error":"#REF!"}},{"$f":"IF('Наш прайс'!#REF!=0,\"\",'Наш прайс'!#REF!)","v":{"$error":"#REF!"}},{"$f":"IF('Наш прайс'!#REF!=0,\"\",'Наш прайс'!#REF!)","v":{"$error":"#REF!"}},{"$f":"IF('Наш прайс'!#REF!=0,\"\",'Наш прайс'!#REF!)","v":{"$error":"#REF!"}}]
[{"$f":"IF('Наш прайс'!#REF!=0,\"\",'Наш прайс'!#REF!)","v":{"$error":"#REF!"}},{"$f":"IF('Наш прайс'!#REF!=0,\"\",'Наш прайс'!#REF!)","v":{"$error":"#REF!"}},{"$f":"IF('Наш прайс'!#REF!=0,\"\",'Наш прайс'!#REF!)","v":{"$error":"#REF!"}},{"$error":"#REF!"},null,null,{"$f":"IF('Наш прайс'!#REF!=0,\"\",'Наш прайс'!#REF!)","v":{"$error":"#REF!"}},{"$f":"IF('Наш прайс'!#REF!=0,\"\",'Наш прайс'!#REF!)","v":{"$error":"#REF!"}},{"$f":"IF('Наш прайс'!#REF!=0,\"\",'Наш прайс'!#REF!)","v":{"$error":"#REF!"}},{"$f":"IF('Наш прайс'!#REF!=0,\"\",'Наш прайс'!#REF!)","v":{"$error":"#REF!"}},{"$f":"IF('Наш прайс'!#REF!=0,\"\",'Наш прайс'!#REF!)","v":{"$error":"#REF!"}},{"$f":"IF('Наш прайс'!#REF!=0,\"\",'Наш прайс'!#REF!)","v":{"$error":"#REF!"}},{"$f":"IF('Наш прайс'!#REF!=0,\"\",'Наш прайс'!#REF!)","v":{"$error":"#REF!"}}]
[{"$f":"IF('Наш прайс'!#REF!=0,\"\",'Наш прайс'!#REF!)","v":{"$error":"#REF!"}},{"$f":"IF('Наш прайс'!#REF!=0,\"\",'Наш прайс'!#REF!)","v":{"$error":"#REF!"}},{"$f":"IF('Наш прайс'!#REF!=0,\"\",'Наш прайс'!#REF!)","v":{"$error":"#REF!"}},{"$error":"#REF!"},null,null,{"$f":"IF('Наш прайс'!#REF!=0,\"\",'Наш прайс'!#REF!)","v":{"$error":"#REF!"}},{"$f":"IF('Наш прайс'!#REF!=0,\"\",'Наш прайс'!#REF!)","v":{"$error":"#REF!"}},{"$f":"IF('Наш прайс'!#REF!=0,\"\",'Наш прайс'!#REF!)","v":{"$error":"#REF!"}},{"$f":"IF('Наш прайс'!#REF!=0,\"\",'Наш прайс'!#REF!)","v":{"$error":"#REF!"}},{"$f":"IF('Наш прайс'!#REF!=0,\"\",'Наш прайс'!#REF!)","v":{"$error":"#REF!"}},{"$f":"IF('Наш прайс'!#REF!=0,\"\",'Наш прайс'!#REF!)","v":{"$error":"#REF!"}},{"$f":"IF('Наш прайс'!#REF!=0,\"\",'Наш прайс'!#REF!)","v":{"$error":"#REF!"}}]
[{"$f":"IF('Наш прайс'!#REF!=0,\"\",'Наш прайс'!#REF!)","v":{"$error":"#REF!"}},{"$f":"IF('Наш прайс'!#REF!=0,\"\",'Наш прайс'!#REF!)","v":{"$error":"#REF!"}},{"$f":"IF('Наш прайс'!#REF!=0,\"\",'Наш прайс'!#REF!)","v":{"$error":"#REF!"}},{"$error":"#REF!"},null,null,{"$f":"IF('Наш прайс'!#REF!=0,\"\",'Наш прайс'!#REF!)","v":{"$error":"#REF!"}},{"$f":"IF('Наш прайс'!#REF!=0,\"\",'Наш прайс'!#REF!)","v":{"$error":"#REF!"}},{"$f":"IF('Наш прайс'!#REF!=0,\"\",'Наш прайс'!#REF!)","v":{"$error":"#REF!"}},{"$f":"IF('Наш прайс'!#REF!=0,\"\",'Наш прайс'!#REF!)","v":{"$error":"#REF!"}},{"$f":"IF('Наш прайс'!#REF!=0,\"\",'Наш прайс'!#REF!)","v":{"$error":"#REF!"}},{"$f":"IF('Наш прайс'!#REF!=0,\"\",'Наш прайс'!#REF!)","v":{"$error":"#REF!"}},{"$f":"IF('Наш прайс'!#REF!=0,\"\",'Наш прайс'!#REF!)","v":{"$error":"#REF!"}}]
[{"$f":"IF('Наш прайс'!#REF!=0,\"\",'Наш прайс'!#REF!)","v":{"$error":"#REF!"}},{"$f":"IF('Наш прайс'!#REF!=0,\"\",'Наш прайс'!#REF!)","v":{"$error":"#REF!"}},{"$f":"IF('Наш прайс'!#REF!=0,\"\",'Наш прайс'!#REF!)","v":{"$error":"#REF!"}},{"$error":"#REF!"},null,null,{"$f":"IF('Наш прайс'!#REF!=0,\"\",'Наш прайс'!#REF!)","v":{"$error":"#REF!"}},{"$f":"IF('Наш прайс'!#REF!=0,\"\",'Наш прайс'!#REF!)","v":{"$error":"#REF!"}},{"$f":"IF('Наш прайс'!#REF!=0,\"\",'Наш прайс'!#REF!)","v":{"$error":"#REF!"}},{"$f":"IF('Наш прайс'!#REF!=0,\"\",'Наш прайс'!#REF!)","v":{"$error":"#REF!"}},{"$f":"IF('Наш прайс'!#REF!=0,\"\",'Наш прайс'!#REF!)","v":{"$error":"#REF!"}},{"$f":"IF('Наш прайс'!#REF!=0,\"\",'Наш прайс'!#REF!)","v":{"$error":"#REF!"}},{"$f":"IF('Наш прайс'!#REF!=0,\"\",'Наш прайс'!#REF!)","v":{"$error":"#REF!"}}]
[{"$f":"IF('Наш прайс'!#REF!=0,\"\",'Наш прайс'!#REF!)","v":{"$error":"#REF!"}},{"$f":"IF('Наш прайс'!#REF!=0,\"\",'Наш прайс'!#REF!)","v":{"$error":"#REF!"}},{"$f":"IF('Наш прайс'!#REF!=0,\"\",'Наш прайс'!#REF!)","v":{"$error":"#REF!"}},{"$error":"#REF!"},null,null,{"$f":"IF('Наш прайс'!#REF!=0,\"\",'Наш прайс'!#REF!)","v":{"$error":"#REF!"}},{"$f":"IF('Наш прайс'!#REF!=0,\"\",'Наш прайс'!#REF!)","v":{"$error":"#REF!"}},{"$f":"IF('Наш прайс'!#REF!=0,\"\",'Наш прайс'!#REF!)","v":{"$error":"#REF!"}},{"$f":"IF('Наш прайс'!#REF!=0,\"\",'Наш прайс'!#REF!)","v":{"$error":"#REF!"}},{"$f":"IF('Наш прайс'!#REF!=0,\"\",'Наш прайс'!#REF!)","v":{"$error":"#REF!"}},{"$f":"IF('Наш прайс'!#REF!=0,\"\",'Наш прайс'!#REF!)","v":{"$error":"#REF!"}},{"$f":"IF('Наш прайс'!#REF!=0,\"\",'Наш прайс'!#REF!)","v":{"$error":"#REF!"}}]
[{"$f":"IF('Наш прайс'!#REF!=0,\"\",'Наш прайс'!#REF!)","v":{"$error":"#REF!"}},{"$f":"IF('Наш прайс'!#REF!=0,\"\",'Наш прайс'!#REF!)","v":{"$error":"#REF!"}},{"$f":"IF('Наш прайс'!#REF!=0,\"\",'Наш прайс'!#REF!)","v":{"$error":"#REF!"}},{"$error":"#REF!"},null,null,{"$f":"IF('Наш прайс'!#REF!=0,\"\",'Наш прайс'!#REF!)","v":{"$error":"#REF!"}},{"$f":"IF('Наш прайс'!#REF!=0,\"\",'Наш прайс'!#REF!)","v":{"$error":"#REF!"}},{"$f":"IF('Наш прайс'!#REF!=0,\"\",'Наш прайс'!#REF!)","v":{"$error":"#REF!"}},{"$f":"IF('Наш прайс'!#REF!=0,\"\",'Наш прайс'!#REF!)","v":{"$error":"#REF!"}},{"$f":"IF('Наш прайс'!#REF!=0,\"\",'Наш прайс'!#REF!)","v":{"$error":"#REF!"}},{"$f":"IF('Наш прайс'!#REF!=0,\"\",'Наш прайс'!#REF!)","v":{"$error":"#REF!"}},{"$f":"IF('Наш прайс'!#REF!=0,\"\",'Наш прайс'!#REF!)","v":{"$error":"#REF!"}}]
[{"$f":"IF('Наш прайс'!#REF!=0,\"\",'Наш прайс'!#REF!)","v":{"$error":"#REF!"}},{"$f":"IF('Наш прайс'!#REF!=0,\"\",'Наш прайс'!#REF!)","v":{"$error":"#REF!"}},{"$f":"IF('Наш прайс'!#REF!=0,\"\",'Наш прайс'!#REF!)","v":{"$error":"#REF!"}},{"$error":"#REF!"},null,null,{"$f":"IF('Наш прайс'!#REF!=0,\"\",'Наш прайс'!#REF!)","v":{"$error":"#REF!"}},{"$f":"IF('Наш прайс'!#REF!=0,\"\",'Наш прайс'!#REF!)","v":{"$error":"#REF!"}},{"$f":"IF('Наш прайс'!#REF!=0,\"\",'Наш прайс'!#REF!)","v":{"$error":"#REF!"}},{"$f":"IF('Наш прайс'!#REF!=0,\"\",'Наш прайс'!#REF!)","v":{"$error":"#REF!"}},{"$f":"IF('Наш прайс'!#REF!=0,\"\",'Наш прайс'!#REF!)","v":{"$error":"#REF!"}},{"$f":"IF('Наш прайс'!#REF!=0,\"\",'Наш прайс'!#REF!)","v":{"$error":"#REF!"}},{"$f":"IF('Наш прайс'!#REF!=0,\"\",'Наш прайс'!#REF!)","v":{"$error":"#REF!"}}]
[{"$f":"IF('Наш прайс'!#REF!=0,\"\",'Наш прайс'!#REF!)","v":{"$error":"#REF!"}},{"$f":"IF('Наш прайс'!#REF!=0,\"\",'Наш прайс'!#REF!)","v":{"$error":"#REF!"}},{"$f":"IF('Наш прайс'!#REF!=0,\"\",'Наш прайс'!#REF!)","v":{"$error":"#REF!"}},{"$error":"#REF!"},null,null,{"$f":"IF('Наш прайс'!#REF!=0,\"\",'Наш прайс'!#REF!)","v":{"$error":"#REF!"}},{"$f":"IF('Наш прайс'!#REF!=0,\"\",'Наш прайс'!#REF!)","v":{"$error":"#REF!"}},{"$f":"IF('Наш прайс'!#REF!=0,\"\",'Наш прайс'!#REF!)","v":{"$error":"#REF!"}},{"$f":"IF('Наш прайс'!#REF!=0,\"\",'Наш прайс'!#REF!)","v":{"$error":"#REF!"}},{"$f":"IF('Наш прайс'!#REF!=0,\"\",'Наш прайс'!#REF!)","v":{"$error":"#REF!"}},{"$f":"IF('Наш прайс'!#REF!=0,\"\",'Наш прайс'!#REF!)","v":{"$error":"#REF!"}},{"$f":"IF('Наш прайс'!#REF!=0,\"\",'Наш прайс'!#REF!)","v":{"$error":"#REF!"}}]
[{"$f":"IF('Наш прайс'!#REF!=0,\"\",'Наш прайс'!#REF!)","v":{"$error":"#REF!"}},{"$f":"IF('Наш прайс'!#REF!=0,\"\",'Наш прайс'!#REF!)","v":{"$error":"#REF!"}},{"$f":"IF('Наш прайс'!#REF!=0,\"\",'Наш прайс'!#REF!)","v":{"$error":"#REF!"}},{"$error":"#REF!"},null,null,{"$f":"IF('Наш прайс'!#REF!=0,\"\",'Наш прайс'!#REF!)","v":{"$error":"#REF!"}},{"$f":"IF('Наш прайс'!#REF!=0,\"\",'Наш прайс'!#REF!)","v":{"$error":"#REF!"}},{"$f":"IF('Наш прайс'!#REF!=0,\"\",'Наш прайс'!#REF!)","v":{"$error":"#REF!"}},{"$f":"IF('Наш прайс'!#REF!=0,\"\",'Наш прайс'!#REF!)","v":{"$error":"#REF!"}},{"$f":"IF('Наш прайс'!#REF!=0,\"\",'Наш прайс'!#REF!)","v":{"$error":"#REF!"}},{"$f":"IF('Наш прайс'!#REF!=0,\"\",'Наш прайс'!#REF!)","v":{"$error":"#REF!"}},{"$f":"IF('Наш прайс'!#REF!=0,\"\",'Наш прайс'!#REF!)","v":{"$error":"#REF!"}}]
[{"$f":"IF('Наш прайс'!#REF!=0,\"\",'Наш прайс'!#REF!)","v":{"$error":"#REF!"}},{"$f":"IF('Наш прайс'!#REF!=0,\"\",'Наш прайс'!#REF!)","v":{"$error":"#REF!"}},{"$f":"IF('Наш прайс'!#REF!=0,\"\",'Наш прайс'!#REF!)","v":{"$error":"#REF!"}},{"$error":"#REF!"},null,null,{"$f":"IF('Наш прайс'!#REF!=0,\"\",'Наш прайс'!#REF!)","v":{"$error":"#REF!"}},{"$f":"IF('Наш прайс'!#REF!=0,\"\",'Наш прайс'!#REF!)","v":{"$error":"#REF!"}},{"$f":"IF('Наш прайс'!#REF!=0,\"\",'Наш прайс'!#REF!)","v":{"$error":"#REF!"}},{"$f":"IF('Наш прайс'!#REF!=0,\"\",'Наш прайс'!#REF!)","v":{"$error":"#REF!"}},{"$f":"IF('Наш прайс'!#REF!=0,\"\",'Наш прайс'!#REF!)","v":{"$error":"#REF!"}},{"$f":"IF('Наш прайс'!#REF!=0,\"\",'Наш прайс'!#REF!)","v":{"$error":"#REF!"}},{"$f":"IF('Наш прайс'!#REF!=0,\"\",'Наш прайс'!#REF!)","v":{"$error":"#REF!"}}]
[{"$f":"IF('Наш прайс'!#REF!=0,\"\",'Наш прайс'!#REF!)","v":{"$error":"#REF!"}},{"$f":"IF('Наш прайс'!#REF!=0,\"\",'Наш прайс'!#REF!)","v":{"$error":"#REF!"}},{"$f":"IF('Наш прайс'!#REF!=0,\"\",'Наш прайс'!#REF!)","v":{"$error":"#REF!"}},{"$error":"#REF!"},null,null,{"$f":"IF('Наш прайс'!#REF!=0,\"\",'Наш прайс'!#REF!)","v":{"$error":"#REF!"}},{"$f":"IF('Наш прайс'!#REF!=0,\"\",'Наш прайс'!#REF!)","v":{"$error":"#REF!"}},{"$f":"IF('Наш прайс'!#REF!=0,\"\",'Наш прайс'!#REF!)","v":{"$error":"#REF!"}},{"$f":"IF('Наш прайс'!#REF!=0,\"\",'Наш прайс'!#REF!)","v":{"$error":"#REF!"}},{"$f":"IF('Наш прайс'!#REF!=0,\"\",'Наш прайс'!#REF!)","v":{"$error":"#REF!"}},{"$f":"IF('Наш прайс'!#REF!=0,\"\",'Наш прайс'!#REF!)","v":{"$error":"#REF!"}},{"$f":"IF('Наш прайс'!#REF!=0,\"\",'Наш прайс'!#REF!)","v":{"$error":"#REF!"}}]
[{"$f":"IF('Наш прайс'!#REF!=0,\"\",'Наш прайс'!#REF!)","v":{"$error":"#REF!"}},{"$f":"IF('Наш прайс'!#REF!=0,\"\",'Наш прайс'!#REF!)","v":{"$error":"#REF!"}},{"$f":"IF('Наш прайс'!#REF!=0,\"\",'Наш прайс'!#REF!)","v":{"$error":"#REF!"}},{"$error":"#REF!"},null,null,{"$f":"IF('Наш прайс'!#REF!=0,\"\",'Наш прайс'!#REF!)","v":{"$error":"#REF!"}},{"$f":"IF('Наш прайс'!#REF!=0,\"\",'Наш прайс'!#REF!)","v":{"$error":"#REF!"}},{"$f":"IF('Наш прайс'!#REF!=0,\"\",'Наш прайс'!#REF!)","v":{"$error":"#REF!"}},{"$f":"IF('Наш прайс'!#REF!=0,\"\",'Наш прайс'!#REF!)","v":{"$error":"#REF!"}},{"$f":"IF('Наш прайс'!#REF!=0,\"\",'Наш прайс'!#REF!)","v":{"$error":"#REF!"}},{"$f":"IF('Наш прайс'!#REF!=0,\"\",'Наш прайс'!#REF!)","v":{"$error":"#REF!"}},{"$f":"IF('Наш прайс'!#REF!=0,\"\",'Наш прайс'!#REF!)","v":{"$error":"#REF!"}}]
[{"$f":"IF('Наш прайс'!#REF!=0,\"\",'Наш прайс'!#REF!)","v":{"$error":"#REF!"}},{"$f":"IF('Наш прайс'!#REF!=0,\"\",'Наш прайс'!#REF!)","v":{"$error":"#REF!"}},{"$f":"IF('Наш прайс'!#REF!=0,\"\",'Наш прайс'!#REF!)","v":{"$error":"#REF!"}},{"$error":"#REF!"},null,null,{"$f":"IF('Наш прайс'!#REF!=0,\"\",'Наш прайс'!#REF!)","v":{"$error":"#REF!"}},{"$f":"IF('Наш прайс'!#REF!=0,\"\",'Наш прайс'!#REF!)","v":{"$error":"#REF!"}},{"$f":"IF('Наш прайс'!#REF!=0,\"\",'Наш прайс'!#REF!)","v":{"$error":"#REF!"}},{"$f":"IF('Наш прайс'!#REF!=0,\"\",'Наш прайс'!#REF!)","v":{"$error":"#REF!"}},{"$f":"IF('Наш прайс'!#REF!=0,\"\",'Наш прайс'!#REF!)","v":{"$error":"#REF!"}},{"$f":"IF('Наш прайс'!#REF!=0,\"\",'Наш прайс'!#REF!)","v":{"$error":"#REF!"}},{"$f":"IF('Наш прайс'!#REF!=0,\"\",'Наш прайс'!#REF!)","v":{"$error":"#REF!"}}]
[{"$f":"IF('Наш прайс'!#REF!=0,\"\",'Наш прайс'!#REF!)","v":{"$error":"#REF!"}},{"$f":"IF('Наш прайс'!#REF!=0,\"\",'Наш прайс'!#REF!)","v":{"$error":"#REF!"}},{"$f":"IF('Наш прайс'!#REF!=0,\"\",'Наш прайс'!#REF!)","v":{"$error":"#REF!"}},{"$error":"#REF!"},null,null,{"$f":"IF('Наш прайс'!#REF!=0,\"\",'Наш прайс'!#REF!)","v":{"$error":"#REF!"}},{"$f":"IF('Наш прайс'!#REF!=0,\"\",'Наш прайс'!#REF!)","v":{"$error":"#REF!"}},{"$f":"IF('Наш прайс'!#REF!=0,\"\",'Наш прайс'!#REF!)","v":{"$error":"#REF!"}},{"$f":"IF('Наш прайс'!#REF!=0,\"\",'Наш прайс'!#REF!)","v":{"$error":"#REF!"}},{"$f":"IF('Наш прайс'!#REF!=0,\"\",'Наш прайс'!#REF!)","v":{"$error":"#REF!"}},{"$f":"IF('Наш прайс'!#REF!=0,\"\",'Наш прайс'!#REF!)","v":{"$error":"#REF!"}},{"$f":"IF('Наш прайс'!#REF!=0,\"\",'Наш прайс'!#REF!)","v":{"$error":"#REF!"}}]
[{"$f":"IF('Наш прайс'!#REF!=0,\"\",'Наш прайс'!#REF!)","v":{"$error":"#REF!"}},{"$f":"IF('Наш прайс'!#REF!=0,\"\",'Наш прайс'!#REF!)","v":{"$error":"#REF!"}},{"$f":"IF('Наш прайс'!#REF!=0,\"\",'Наш прайс'!#REF!)","v":{"$error":"#REF!"}},{"$error":"#REF!"},null,null,{"$f":"IF('Наш прайс'!#REF!=0,\"\",'Наш прайс'!#REF!)","v":{"$error":"#REF!"}},{"$f":"IF('Наш прайс'!#REF!=0,\"\",'Наш прайс'!#REF!)","v":{"$error":"#REF!"}},{"$f":"IF('Наш прайс'!#REF!=0,\"\",'Наш прайс'!#REF!)","v":{"$error":"#REF!"}},{"$f":"IF('Наш прайс'!#REF!=0,\"\",'Наш прайс'!#REF!)","v":{"$error":"#REF!"}},{"$f":"IF('Наш прайс'!#REF!=0,\"\",'Наш прайс'!#REF!)","v":{"$error":"#REF!"}},{"$f":"IF('Наш прайс'!#REF!=0,\"\",'Наш прайс'!#REF!)","v":{"$error":"#REF!"}},{"$f":"IF('Наш прайс'!#REF!=0,\"\",'Наш прайс'!#REF!)","v":{"$error":"#REF!"}}]
[{"$f":"IF('Наш прайс'!#REF!=0,\"\",'Наш прайс'!#REF!)","v":{"$error":"#REF!"}},{"$f":"IF('Наш прайс'!#REF!=0,\"\",'Наш прайс'!#REF!)","v":{"$error":"#REF!"}},{"$f":"IF('Наш прайс'!#REF!=0,\"\",'Наш прайс'!#REF!)","v":{"$error":"#REF!"}},{"$error":"#REF!"},null,null,{"$f":"IF('Наш прайс'!#REF!=0,\"\",'Наш прайс'!#REF!)","v":{"$error":"#REF!"}},{"$f":"IF('Наш прайс'!#REF!=0,\"\",'Наш прайс'!#REF!)","v":{"$error":"#REF!"}},{"$f":"IF('Наш прайс'!#REF!=0,\"\",'Наш прайс'!#REF!)","v":{"$error":"#REF!"}},{"$f":"IF('Наш прайс'!#REF!=0,\"\",'Наш прайс'!#REF!)","v":{"$error":"#REF!"}},{"$f":"IF('Наш прайс'!#REF!=0,\"\",'Наш прайс'!#REF!)","v":{"$error":"#REF!"}},{"$f":"IF('Наш прайс'!#REF!=0,\"\",'Наш прайс'!#REF!)","v":{"$error":"#REF!"}},{"$f":"IF('Наш прайс'!#REF!=0,\"\",'Наш прайс'!#REF!)","v":{"$error":"#REF!"}}]
[{"$f":"IF('Наш прайс'!#REF!=0,\"\",'Наш прайс'!#REF!)","v":{"$error":"#REF!"}},{"$f":"IF('Наш прайс'!#REF!=0,\"\",'Наш прайс'!#REF!)","v":{"$error":"#REF!"}},{"$f":"IF('Наш прайс'!#REF!=0,\"\",'Наш прайс'!#REF!)","v":{"$error":"#REF!"}},{"$error":"#REF!"},null,null,{"$f":"IF('Наш прайс'!#REF!=0,\"\",'Наш прайс'!#REF!)","v":{"$error":"#REF!"}},{"$f":"IF('Наш прайс'!#REF!=0,\"\",'Наш прайс'!#REF!)","v":{"$error":"#REF!"}},{"$f":"IF('Наш прайс'!#REF!=0,\"\",'Наш прайс'!#REF!)","v":{"$error":"#REF!"}},{"$f":"IF('Наш прайс'!#REF!=0,\"\",'Наш прайс'!#REF!)","v":{"$error":"#REF!"}},{"$f":"IF('Наш прайс'!#REF!=0,\"\",'Наш прайс'!#REF!)","v":{"$error":"#REF!"}},{"$f":"IF('Наш прайс'!#REF!=0,\"\",'Наш прайс'!#REF!)","v":{"$error":"#REF!"}},{"$f":"IF('Наш прайс'!#REF!=0,\"\",'Наш прайс'!#REF!)","v":{"$error":"#REF!"}}]
[{"$f":"IF('Наш прайс'!#REF!=0,\"\",'Наш прайс'!#REF!)","v":{"$error":"#REF!"}},{"$f":"IF('Наш прайс'!#REF!=0,\"\",'Наш прайс'!#REF!)","v":{"$error":"#REF!"}},{"$f":"IF('Наш прайс'!#REF!=0,\"\",'Наш прайс'!#REF!)","v":{"$error":"#REF!"}},{"$error":"#REF!"},null,null,{"$f":"IF('Наш прайс'!#REF!=0,\"\",'Наш прайс'!#REF!)","v":{"$error":"#REF!"}},{"$f":"IF('Наш прайс'!#REF!=0,\"\",'Наш прайс'!#REF!)","v":{"$error":"#REF!"}},{"$f":"IF('Наш прайс'!#REF!=0,\"\",'Наш прайс'!#REF!)","v":{"$error":"#REF!"}},{"$f":"IF('Наш прайс'!#REF!=0,\"\",'Наш прайс'!#REF!)","v":{"$error":"#REF!"}},{"$f":"IF('Наш прайс'!#REF!=0,\"\",'Наш прайс'!#REF!)","v":{"$error":"#REF!"}},{"$f":"IF('Наш прайс'!#REF!=0,\"\",'Наш прайс'!#REF!)","v":{"$error":"#REF!"}},{"$f":"IF('Наш прайс'!#REF!=0,\"\",'Наш прайс'!#REF!)","v":{"$error":"#REF!"}}]
[{"$f":"IF('Наш прайс'!#REF!=0,\"\",'Наш прайс'!#REF!)","v":{"$error":"#REF!"}},{"$f":"IF('Наш прайс'!#REF!=0,\"\",'Наш прайс'!#REF!)","v":{"$error":"#REF!"}},{"$f":"IF('Наш прайс'!#REF!=0,\"\",'Наш прайс'!#REF!)","v":{"$error":"#REF!"}},{"$error":"#REF!"},null,null,{"$f":"IF('Наш прайс'!#REF!=0,\"\",'Наш прайс'!#REF!)","v":{"$error":"#REF!"}},{"$f":"IF('Наш прайс'!#REF!=0,\"\",'Наш прайс'!#REF!)","v":{"$error":"#REF!"}},{"$f":"IF('Наш прайс'!#REF!=0,\"\",'Наш прайс'!#REF!)","v":{"$error":"#REF!"}},{"$f":"IF('Наш прайс'!#REF!=0,\"\",'Наш прайс'!#REF!)","v":{"$error":"#REF!"}},{"$f":"IF('Наш прайс'!#REF!=0,\"\",'Наш прайс'!#REF!)","v":{"$error":"#REF!"}},{"$f":"IF('Наш прайс'!#REF!=0,\"\",'Наш прайс'!#REF!)","v":{"$error":"#REF!"}},{"$f":"IF('Наш прайс'!#REF!=0,\"\",'Наш прайс'!#REF!)","v":{"$error":"#REF!"}}]
[{"$f":"IF('Наш прайс'!#REF!=0,\"\",'Наш прайс'!#REF!)","v":{"$error":"#REF!"}},{"$f":"IF('Наш прайс'!#REF!=0,\"\",'Наш прайс'!#REF!)","v":{"$error":"#REF!"}},{"$f":"IF('Наш прайс'!#REF!=0,\"\",'Наш прайс'!#REF!)","v":{"$error":"#REF!"}},{"$error":"#REF!"},null,null,{"$f":"IF('Наш прайс'!#REF!=0,\"\",'Наш прайс'!#REF!)","v":{"$error":"#REF!"}},{"$f":"IF('Наш прайс'!#REF!=0,\"\",'Наш прайс'!#REF!)","v":{"$error":"#REF!"}},{"$f":"IF('Наш прайс'!#REF!=0,\"\",'Наш прайс'!#REF!)","v":{"$error":"#REF!"}},{"$f":"IF('Наш прайс'!#REF!=0,\"\",'Наш прайс'!#REF!)","v":{"$error":"#REF!"}},{"$f":"IF('Наш прайс'!#REF!=0,\"\",'Наш прайс'!#REF!)","v":{"$error":"#REF!"}},{"$f":"IF('Наш прайс'!#REF!=0,\"\",'Наш прайс'!#REF!)","v":{"$error":"#REF!"}},{"$f":"IF('Наш прайс'!#REF!=0,\"\",'Наш прайс'!#REF!)","v":{"$error":"#REF!"}}]
[{"$f":"IF('Наш прайс'!#REF!=0,\"\",'Наш прайс'!#REF!)","v":{"$error":"#REF!"}},{"$f":"IF('Наш прайс'!#REF!=0,\"\",'Наш прайс'!#REF!)","v":{"$error":"#REF!"}},{"$f":"IF('Наш прайс'!#REF!=0,\"\",'Наш прайс'!#REF!)","v":{"$error":"#REF!"}},{"$error":"#REF!"},null,null,{"$f":"IF('Наш прайс'!#REF!=0,\"\",'Наш прайс'!#REF!)","v":{"$error":"#REF!"}},{"$f":"IF('Наш прайс'!#REF!=0,\"\",'Наш прайс'!#REF!)","v":{"$error":"#REF!"}},{"$f":"IF('Наш прайс'!#REF!=0,\"\",'Наш прайс'!#REF!)","v":{"$error":"#REF!"}},{"$f":"IF('Наш прайс'!#REF!=0,\"\",'Наш прайс'!#REF!)","v":{"$error":"#REF!"}},{"$f":"IF('Наш прайс'!#REF!=0,\"\",'Наш прайс'!#REF!)","v":{"$error":"#REF!"}},{"$f":"IF('Наш прайс'!#REF!=0,\"\",'Наш прайс'!#REF!)","v":{"$error":"#REF!"}},{"$f":"IF('Наш прайс'!#REF!=0,\"\",'Наш прайс'!#REF!)","v":{"$error":"#REF!"}}]
[{"$f":"IF('Наш прайс'!#REF!=0,\"\",'Наш прайс'!#REF!)","v":{"$error":"#REF!"}},{"$f":"IF('Наш прайс'!#REF!=0,\"\",'Наш прайс'!#REF!)","v":{"$error":"#REF!"}},{"$f":"IF('Наш прайс'!#REF!=0,\"\",'Наш прайс'!#REF!)","v":{"$error":"#REF!"}},{"$error":"#REF!"},null,null,{"$f":"IF('Наш прайс'!#REF!=0,\"\",'Наш прайс'!#REF!)","v":{"$error":"#REF!"}},{"$f":"IF('Наш прайс'!#REF!=0,\"\",'Наш прайс'!#REF!)","v":{"$error":"#REF!"}},{"$f":"IF('Наш прайс'!#REF!=0,\"\",'Наш прайс'!#REF!)","v":{"$error":"#REF!"}},{"$f":"IF('Наш прайс'!#REF!=0,\"\",'Наш прайс'!#REF!)","v":{"$error":"#REF!"}},{"$f":"IF('Наш прайс'!#REF!=0,\"\",'Наш прайс'!#REF!)","v":{"$error":"#REF!"}},{"$f":"IF('Наш прайс'!#REF!=0,\"\",'Наш прайс'!#REF!)","v":{"$error":"#REF!"}},{"$f":"IF('Наш прайс'!#REF!=0,\"\",'Наш прайс'!#REF!)","v":{"$error":"#REF!"}}]
[{"$f":"IF('Наш прайс'!#REF!=0,\"\",'Наш прайс'!#REF!)","v":{"$error":"#REF!"}},{"$f":"IF('Наш прайс'!#REF!=0,\"\",'Наш прайс'!#REF!)","v":{"$error":"#REF!"}},{"$f":"IF('Наш прайс'!#REF!=0,\"\",'Наш прайс'!#REF!)","v":{"$error":"#REF!"}},{"$error":"#REF!"},null,null,{"$f":"IF('Наш прайс'!#REF!=0,\"\",'Наш прайс'!#REF!)","v":{"$error":"#REF!"}},{"$f":"IF('Наш прайс'!#REF!=0,\"\",'Наш прайс'!#REF!)","v":{"$error":"#REF!"}},{"$f":"IF('Наш прайс'!#REF!=0,\"\",'Наш прайс'!#REF!)","v":{"$error":"#REF!"}},{"$f":"IF('Наш прайс'!#REF!=0,\"\",'Наш прайс'!#REF!)","v":{"$error":"#REF!"}},{"$f":"IF('Наш прайс'!#REF!=0,\"\",'Наш прайс'!#REF!)","v":{"$error":"#REF!"}},{"$f":"IF('Наш прайс'!#REF!=0,\"\",'Наш прайс'!#REF!)","v":{"$error":"#REF!"}},{"$f":"IF('Наш прайс'!#REF!=0,\"\",'Наш прайс'!#REF!)","v":{"$error":"#REF!"}}]
[{"$f":"IF('Наш прайс'!#REF!=0,\"\",'Наш прайс'!#REF!)","v":{"$error":"#REF!"}},{"$f":"IF('Наш прайс'!#REF!=0,\"\",'Наш прайс'!#REF!)","v":{"$error":"#REF!"}},{"$f":"IF('Наш прайс'!#REF!=0,\"\",'Наш прайс'!#REF!)","v":{"$error":"#REF!"}},{"$error":"#REF!"},null,null,{"$f":"IF('Наш прайс'!#REF!=0,\"\",'Наш прайс'!#REF!)","v":{"$error":"#REF!"}},{"$f":"IF('Наш прайс'!#REF!=0,\"\",'Наш прайс'!#REF!)","v":{"$error":"#REF!"}},{"$f":"IF('Наш прайс'!#REF!=0,\"\",'Наш прайс'!#REF!)","v":{"$error":"#REF!"}},{"$f":"IF('Наш прайс'!#REF!=0,\"\",'Наш прайс'!#REF!)","v":{"$error":"#REF!"}},{"$f":"IF('Наш прайс'!#REF!=0,\"\",'Наш прайс'!#REF!)","v":{"$error":"#REF!"}},{"$f":"IF('Наш прайс'!#REF!=0,\"\",'Наш прайс'!#REF!)","v":{"$error":"#REF!"}},{"$f":"IF('Наш прайс'!#REF!=0,\"\",'Наш прайс'!#REF!)","v":{"$error":"#REF!"}}]
[{"$f":"IF('Наш прайс'!#REF!=0,\"\",'Наш прайс'!#REF!)","v":{"$error":"#REF!"}},{"$f":"IF('Наш прайс'!#REF!=0,\"\",'Наш прайс'!#REF!)","v":{"$error":"#REF!"}},{"$f":"IF('Наш прайс'!#REF!=0,\"\",'Наш прайс'!#REF!)","v":{"$error":"#REF!"}},{"$error":"#REF!"},null,null,{"$f":"IF('Наш прайс'!#REF!=0,\"\",'Наш прайс'!#REF!)","v":{"$error":"#REF!"}},{"$f":"IF('Наш прайс'!#REF!=0,\"\",'Наш прайс'!#REF!)","v":{"$error":"#REF!"}},{"$f":"IF('Наш прайс'!#REF!=0,\"\",'Наш прайс'!#REF!)","v":{"$error":"#REF!"}},{"$f":"IF('Наш прайс'!#REF!=0,\"\",'Наш прайс'!#REF!)","v":{"$error":"#REF!"}},{"$f":"IF('Наш прайс'!#REF!=0,\"\",'Наш прайс'!#REF!)","v":{"$error":"#REF!"}},{"$f":"IF('Наш прайс'!#REF!=0,\"\",'Наш прайс'!#REF!)","v":{"$error":"#REF!"}},{"$f":"IF('Наш прайс'!#REF!=0,\"\",'Наш прайс'!#REF!)","v":{"$error":"#REF!"}}]
[{"$f":"IF('Наш прайс'!#REF!=0,\"\",'Наш прайс'!#REF!)","v":{"$error":"#REF!"}},{"$f":"IF('Наш прайс'!#REF!=0,\"\",'Наш прайс'!#REF!)","v":{"$error":"#REF!"}},{"$f":"IF('Наш прайс'!#REF!=0,\"\",'Наш прайс'!#REF!)","v":{"$error":"#REF!"}},{"$error":"#REF!"},null,null,{"$f":"IF('Наш прайс'!#REF!=0,\"\",'Наш прайс'!#REF!)","v":{"$error":"#REF!"}},{"$f":"IF('Наш прайс'!#REF!=0,\"\",'Наш прайс'!#REF!)","v":{"$error":"#REF!"}},{"$f":"IF('Наш прайс'!#REF!=0,\"\",'Наш прайс'!#REF!)","v":{"$error":"#REF!"}},{"$f":"IF('Наш прайс'!#REF!=0,\"\",'Наш прайс'!#REF!)","v":{"$error":"#REF!"}},{"$f":"IF('Наш прайс'!#REF!=0,\"\",'Наш прайс'!#REF!)","v":{"$error":"#REF!"}},{"$f":"IF('Наш прайс'!#REF!=0,\"\",'Наш прайс'!#REF!)","v":{"$error":"#REF!"}},{"$f":"IF('Наш прайс'!#REF!=0,\"\",'Наш прайс'!#REF!)","v":{"$error":"#REF!"}}]
[{"$f":"IF('Наш прайс'!#REF!=0,\"\",'Наш прайс'!#REF!)","v":{"$error":"#REF!"}},{"$f":"IF('Наш прайс'!#REF!=0,\"\",'Наш прайс'!#REF!)","v":{"$error":"#REF!"}},{"$f":"IF('Наш прайс'!#REF!=0,\"\",'Наш прайс'!#REF!)","v":{"$error":"#REF!"}},{"$error":"#REF!"},null,null,{"$f":"IF('Наш прайс'!#REF!=0,\"\",'Наш прайс'!#REF!)","v":{"$error":"#REF!"}},{"$f":"IF('Наш прайс'!#REF!=0,\"\",'Наш прайс'!#REF!)","v":{"$error":"#REF!"}},{"$f":"IF('Наш прайс'!#REF!=0,\"\",'Наш прайс'!#REF!)","v":{"$error":"#REF!"}},{"$f":"IF('Наш прайс'!#REF!=0,\"\",'Наш прайс'!#REF!)","v":{"$error":"#REF!"}},{"$f":"IF('Наш прайс'!#REF!=0,\"\",'Наш прайс'!#REF!)","v":{"$error":"#REF!"}},{"$f":"IF('Наш прайс'!#REF!=0,\"\",'Наш прайс'!#REF!)","v":{"$error":"#REF!"}},{"$f":"IF('Наш прайс'!#REF!=0,\"\",'Наш прайс'!#REF!)","v":{"$error":"#REF!"}}]
[{"$f":"IF('Наш прайс'!#REF!=0,\"\",'Наш прайс'!#REF!)","v":{"$error":"#REF!"}},{"$f":"IF('Наш прайс'!#REF!=0,\"\",'Наш прайс'!#REF!)","v":{"$error":"#REF!"}},{"$f":"IF('Наш прайс'!#REF!=0,\"\",'Наш прайс'!#REF!)","v":{"$error":"#REF!"}},{"$error":"#REF!"},null,null,{"$f":"IF('Наш прайс'!#REF!=0,\"\",'Наш прайс'!#REF!)","v":{"$error":"#REF!"}},{"$f":"IF('Наш прайс'!#REF!=0,\"\",'Наш прайс'!#REF!)","v":{"$error":"#REF!"}},{"$f":"IF('Наш прайс'!#REF!=0,\"\",'Наш прайс'!#REF!)","v":{"$error":"#REF!"}},{"$f":"IF('Наш прайс'!#REF!=0,\"\",'Наш прайс'!#REF!)","v":{"$error":"#REF!"}},{"$f":"IF('Наш прайс'!#REF!=0,\"\",'Наш прайс'!#REF!)","v":{"$error":"#REF!"}},{"$f":"IF('Наш прайс'!#REF!=0,\"\",'Наш прайс'!#REF!)","v":{"$error":"#REF!"}},{"$f":"IF('Наш прайс'!#REF!=0,\"\",'Наш прайс'!#REF!)","v":{"$error":"#REF!"}}]
[{"$f":"IF('Наш прайс'!#REF!=0,\"\",'Наш прайс'!#REF!)","v":{"$error":"#REF!"}},{"$f":"IF('Наш прайс'!#REF!=0,\"\",'Наш прайс'!#REF!)","v":{"$error":"#REF!"}},{"$f":"IF('Наш прайс'!#REF!=0,\"\",'Наш прайс'!#REF!)","v":{"$error":"#REF!"}},{"$error":"#REF!"},null,null,{"$f":"IF('Наш прайс'!#REF!=0,\"\",'Наш прайс'!#REF!)","v":{"$error":"#REF!"}},{"$f":"IF('Наш прайс'!#REF!=0,\"\",'Наш прайс'!#REF!)","v":{"$error":"#REF!"}},{"$f":"IF('Наш прайс'!#REF!=0,\"\",'Наш прайс'!#REF!)","v":{"$error":"#REF!"}},{"$f":"IF('Наш прайс'!#REF!=0,\"\",'Наш прайс'!#REF!)","v":{"$error":"#REF!"}},{"$f":"IF('Наш прайс'!#REF!=0,\"\",'Наш прайс'!#REF!)","v":{"$error":"#REF!"}},{"$f":"IF('Наш прайс'!#REF!=0,\"\",'Наш прайс'!#REF!)","v":{"$error":"#REF!"}},{"$f":"IF('Наш прайс'!#REF!=0,\"\",'Наш прайс'!#REF!)","v":{"$error":"#REF!"}}]
[{"$f":"IF('Наш прайс'!#REF!=0,\"\",'Наш прайс'!#REF!)","v":{"$error":"#REF!"}},{"$f":"IF('Наш прайс'!#REF!=0,\"\",'Наш прайс'!#REF!)","v":{"$error":"#REF!"}},{"$f":"IF('Наш прайс'!#REF!=0,\"\",'Наш прайс'!#REF!)","v":{"$error":"#REF!"}},{"$error":"#REF!"},null,null,{"$f":"IF('Наш прайс'!#REF!=0,\"\",'Наш прайс'!#REF!)","v":{"$error":"#REF!"}},{"$f":"IF('Наш прайс'!#REF!=0,\"\",'Наш прайс'!#REF!)","v":{"$error":"#REF!"}},{"$f":"IF('Наш прайс'!#REF!=0,\"\",'Наш прайс'!#REF!)","v":{"$error":"#REF!"}},{"$f":"IF('Наш прайс'!#REF!=0,\"\",'Наш прайс'!#REF!)","v":{"$error":"#REF!"}},{"$f":"IF('Наш прайс'!#REF!=0,\"\",'Наш прайс'!#REF!)","v":{"$error":"#REF!"}},{"$f":"IF('Наш прайс'!#REF!=0,\"\",'Наш прайс'!#REF!)","v":{"$error":"#REF!"}},{"$f":"IF('Наш прайс'!#REF!=0,\"\",'Наш прайс'!#REF!)","v":{"$error":"#REF!"}}]
[{"$f":"IF('Наш прайс'!#REF!=0,\"\",'Наш прайс'!#REF!)","v":{"$error":"#REF!"}},{"$f":"IF('Наш прайс'!#REF!=0,\"\",'Наш прайс'!#REF!)","v":{"$error":"#REF!"}},{"$f":"IF('Наш прайс'!#REF!=0,\"\",'Наш прайс'!#REF!)","v":{"$error":"#REF!"}},{"$error":"#REF!"},null,null,{"$f":"IF('Наш прайс'!#REF!=0,\"\",'Наш прайс'!#REF!)","v":{"$error":"#REF!"}},{"$f":"IF('Наш прайс'!#REF!=0,\"\",'Наш прайс'!#REF!)","v":{"$error":"#REF!"}},{"$f":"IF('Наш прайс'!#REF!=0,\"\",'Наш прайс'!#REF!)","v":{"$error":"#REF!"}},{"$f":"IF('Наш прайс'!#REF!=0,\"\",'Наш прайс'!#REF!)","v":{"$error":"#REF!"}},{"$f":"IF('Наш прайс'!#REF!=0,\"\",'Наш прайс'!#REF!)","v":{"$error":"#REF!"}},{"$f":"IF('Наш прайс'!#REF!=0,\"\",'Наш прайс'!#REF!)","v":{"$error":"#REF!"}},{"$f":"IF('Наш прайс'!#REF!=0,\"\",'Наш прайс'!#REF!)","v":{"$error":"#REF!"}}]
[{"$f":"IF('Наш прайс'!#REF!=0,\"\",'Наш прайс'!#REF!)","v":{"$error":"#REF!"}},{"$f":"IF('Наш прайс'!#REF!=0,\"\",'Наш прайс'!#REF!)","v":{"$error":"#REF!"}},{"$f":"IF('Наш прайс'!#REF!=0,\"\",'Наш прайс'!#REF!)","v":{"$error":"#REF!"}},{"$error":"#REF!"},null,null,{"$f":"IF('Наш прайс'!#REF!=0,\"\",'Наш прайс'!#REF!)","v":{"$error":"#REF!"}},{"$f":"IF('Наш прайс'!#REF!=0,\"\",'Наш прайс'!#REF!)","v":{"$error":"#REF!"}},{"$f":"IF('Наш прайс'!#REF!=0,\"\",'Наш прайс'!#REF!)","v":{"$error":"#REF!"}},{"$f":"IF('Наш прайс'!#REF!=0,\"\",'Наш прайс'!#REF!)","v":{"$error":"#REF!"}},{"$f":"IF('Наш прайс'!#REF!=0,\"\",'Наш прайс'!#REF!)","v":{"$error":"#REF!"}},{"$f":"IF('Наш прайс'!#REF!=0,\"\",'Наш прайс'!#REF!)","v":{"$error":"#REF!"}},{"$f":"IF('Наш прайс'!#REF!=0,\"\",'Наш прайс'!#REF!)","v":{"$error":"#REF!"}}]
[{"$f":"IF('Наш прайс'!#REF!=0,\"\",'Наш прайс'!#REF!)","v":{"$error":"#REF!"}},{"$f":"IF('Наш прайс'!#REF!=0,\"\",'Наш прайс'!#REF!)","v":{"$error":"#REF!"}},{"$f":"IF('Наш прайс'!#REF!=0,\"\",'Наш прайс'!#REF!)","v":{"$error":"#REF!"}},{"$error":"#REF!"},null,null,{"$f":"IF('Наш прайс'!#REF!=0,\"\",'Наш прайс'!#REF!)","v":{"$error":"#REF!"}},{"$f":"IF('Наш прайс'!#REF!=0,\"\",'Наш прайс'!#REF!)","v":{"$error":"#REF!"}},{"$f":"IF('Наш прайс'!#REF!=0,\"\",'Наш прайс'!#REF!)","v":{"$error":"#REF!"}},{"$f":"IF('Наш прайс'!#REF!=0,\"\",'Наш прайс'!#REF!)","v":{"$error":"#REF!"}},{"$f":"IF('Наш прайс'!#REF!=0,\"\",'Наш прайс'!#REF!)","v":{"$error":"#REF!"}},{"$f":"IF('Наш прайс'!#REF!=0,\"\",'Наш прайс'!#REF!)","v":{"$error":"#REF!"}},{"$f":"IF('Наш прайс'!#REF!=0,\"\",'Наш прайс'!#REF!)","v":{"$error":"#REF!"}}]
[{"$f":"IF('Наш прайс'!#REF!=0,\"\",'Наш прайс'!#REF!)","v":{"$error":"#REF!"}},{"$f":"IF('Наш прайс'!#REF!=0,\"\",'Наш прайс'!#REF!)","v":{"$error":"#REF!"}},{"$f":"IF('Наш прайс'!#REF!=0,\"\",'Наш прайс'!#REF!)","v":{"$error":"#REF!"}},{"$error":"#REF!"},null,null,{"$f":"IF('Наш прайс'!#REF!=0,\"\",'Наш прайс'!#REF!)","v":{"$error":"#REF!"}},{"$f":"IF('Наш прайс'!#REF!=0,\"\",'Наш прайс'!#REF!)","v":{"$error":"#REF!"}},{"$f":"IF('Наш прайс'!#REF!=0,\"\",'Наш прайс'!#REF!)","v":{"$error":"#REF!"}},{"$f":"IF('Наш прайс'!#REF!=0,\"\",'Наш прайс'!#REF!)","v":{"$error":"#REF!"}},{"$f":"IF('Наш прайс'!#REF!=0,\"\",'Наш прайс'!#REF!)","v":{"$error":"#REF!"}},{"$f":"IF('Наш прайс'!#REF!=0,\"\",'Наш прайс'!#REF!)","v":{"$error":"#REF!"}},{"$f":"IF('Наш прайс'!#REF!=0,\"\",'Наш прайс'!#REF!)","v":{"$error":"#REF!"}}]
[{"$f":"IF('Наш прайс'!#REF!=0,\"\",'Наш прайс'!#REF!)","v":{"$error":"#REF!"}},{"$f":"IF('Наш прайс'!#REF!=0,\"\",'Наш прайс'!#REF!)","v":{"$error":"#REF!"}},{"$f":"IF('Наш прайс'!#REF!=0,\"\",'Наш прайс'!#REF!)","v":{"$error":"#REF!"}},{"$error":"#REF!"},null,null,{"$f":"IF('Наш прайс'!#REF!=0,\"\",'Наш прайс'!#REF!)","v":{"$error":"#REF!"}},{"$f":"IF('Наш прайс'!#REF!=0,\"\",'Наш прайс'!#REF!)","v":{"$error":"#REF!"}},{"$f":"IF('Наш прайс'!#REF!=0,\"\",'Наш прайс'!#REF!)","v":{"$error":"#REF!"}},{"$f":"IF('Наш прайс'!#REF!=0,\"\",'Наш прайс'!#REF!)","v":{"$error":"#REF!"}},{"$f":"IF('Наш прайс'!#REF!=0,\"\",'Наш прайс'!#REF!)","v":{"$error":"#REF!"}},{"$f":"IF('Наш прайс'!#REF!=0,\"\",'Наш прайс'!#REF!)","v":{"$error":"#REF!"}},{"$f":"IF('Наш прайс'!#REF!=0,\"\",'Наш прайс'!#REF!)","v":{"$error":"#REF!"}}]
[{"$f":"IF('Наш прайс'!#REF!=0,\"\",'Наш прайс'!#REF!)","v":{"$error":"#REF!"}},{"$f":"IF('Наш прайс'!#REF!=0,\"\",'Наш прайс'!#REF!)","v":{"$error":"#REF!"}},{"$f":"IF('Наш прайс'!#REF!=0,\"\",'Наш прайс'!#REF!)","v":{"$error":"#REF!"}},{"$error":"#REF!"},null,null,{"$f":"IF('Наш прайс'!#REF!=0,\"\",'Наш прайс'!#REF!)","v":{"$error":"#REF!"}},{"$f":"IF('Наш прайс'!#REF!=0,\"\",'Наш прайс'!#REF!)","v":{"$error":"#REF!"}},{"$f":"IF('Наш прайс'!#REF!=0,\"\",'Наш прайс'!#REF!)","v":{"$error":"#REF!"}},{"$f":"IF('Наш прайс'!#REF!=0,\"\",'Наш прайс'!#REF!)","v":{"$error":"#REF!"}},{"$f":"IF('Наш прайс'!#REF!=0,\"\",'Наш прайс'!#REF!)","v":{"$error":"#REF!"}},{"$f":"IF('Наш прайс'!#REF!=0,\"\",'Наш прайс'!#REF!)","v":{"$error":"#REF!"}},{"$f":"IF('Наш прайс'!#REF!=0,\"\",'Наш прайс'!#REF!)","v":{"$error":"#REF!"}}]
[{"$f":"IF('Наш прайс'!#REF!=0,\"\",'Наш прайс'!#REF!)","v":{"$error":"#REF!"}},{"$f":"IF('Наш прайс'!#REF!=0,\"\",'Наш прайс'!#REF!)","v":{"$error":"#REF!"}},{"$f":"IF('Наш прайс'!#REF!=0,\"\",'Наш прайс'!#REF!)","v":{"$error":"#REF!"}},{"$error":"#REF!"},null,null,{"$f":"IF('Наш прайс'!#REF!=0,\"\",'Наш прайс'!#REF!)","v":{"$error":"#REF!"}},{"$f":"IF('Наш прайс'!#REF!=0,\"\",'Наш прайс'!#REF!)","v":{"$error":"#REF!"}},{"$f":"IF('Наш прайс'!#REF!=0,\"\",'Наш прайс'!#REF!)","v":{"$error":"#REF!"}},{"$f":"IF('Наш прайс'!#REF!=0,\"\",'Наш прайс'!#REF!)","v":{"$error":"#REF!"}},{"$f":"IF('Наш прайс'!#REF!=0,\"\",'Наш прайс'!#REF!)","v":{"$error":"#REF!"}},{"$f":"IF('Наш прайс'!#REF!=0,\"\",'Наш прайс'!#REF!)","v":{"$error":"#REF!"}},{"$f":"IF('Наш прайс'!#REF!=0,\"\",'Наш прайс'!#REF!)","v":{"$error":"#REF!"}}]
[{"$f":"IF('Наш прайс'!#REF!=0,\"\",'Наш прайс'!#REF!)","v":{"$error":"#REF!"}},{"$f":"IF('Наш прайс'!#REF!=0,\"\",'Наш прайс'!#REF!)","v":{"$error":"#REF!"}},{"$f":"IF('Наш прайс'!#REF!=0,\"\",'Наш прайс'!#REF!)","v":{"$error":"#REF!"}},{"$error":"#REF!"},null,null,{"$f":"IF('Наш прайс'!#REF!=0,\"\",'Наш прайс'!#REF!)","v":{"$error":"#REF!"}},{"$f":"IF('Наш прайс'!#REF!=0,\"\",'Наш прайс'!#REF!)","v":{"$error":"#REF!"}},{"$f":"IF('Наш прайс'!#REF!=0,\"\",'Наш прайс'!#REF!)","v":{"$error":"#REF!"}},{"$f":"IF('Наш прайс'!#REF!=0,\"\",'Наш прайс'!#REF!)","v":{"$error":"#REF!"}},{"$f":"IF('Наш прайс'!#REF!=0,\"\",'Наш прайс'!#REF!)","v":{"$error":"#REF!"}},{"$f":"IF('Наш прайс'!#REF!=0,\"\",'Наш прайс'!#REF!)","v":{"$error":"#REF!"}},{"$f":"IF('Наш прайс'!#REF!=0,\"\",'Наш прайс'!#REF!)","v":{"$error":"#REF!"}}]
[{"$f":"IF('Наш прайс'!#REF!=0,\"\",'Наш прайс'!#REF!)","v":{"$error":"#REF!"}},{"$f":"IF('Наш прайс'!#REF!=0,\"\",'Наш прайс'!#REF!)","v":{"$error":"#REF!"}},{"$f":"IF('Наш прайс'!#REF!=0,\"\",'Наш прайс'!#REF!)","v":{"$error":"#REF!"}},{"$error":"#REF!"},null,null,{"$f":"IF('Наш прайс'!#REF!=0,\"\",'Наш прайс'!#REF!)","v":{"$error":"#REF!"}},{"$f":"IF('Наш прайс'!#REF!=0,\"\",'Наш прайс'!#REF!)","v":{"$error":"#REF!"}},{"$f":"IF('Наш прайс'!#REF!=0,\"\",'Наш прайс'!#REF!)","v":{"$error":"#REF!"}},{"$f":"IF('Наш прайс'!#REF!=0,\"\",'Наш прайс'!#REF!)","v":{"$error":"#REF!"}},{"$f":"IF('Наш прайс'!#REF!=0,\"\",'Наш прайс'!#REF!)","v":{"$error":"#REF!"}},{"$f":"IF('Наш прайс'!#REF!=0,\"\",'Наш прайс'!#REF!)","v":{"$error":"#REF!"}},{"$f":"IF('Наш прайс'!#REF!=0,\"\",'Наш прайс'!#REF!)","v":{"$error":"#REF!"}}]
[{"$f":"IF('Наш прайс'!#REF!=0,\"\",'Наш прайс'!#REF!)","v":{"$error":"#REF!"}},{"$f":"IF('Наш прайс'!#REF!=0,\"\",'Наш прайс'!#REF!)","v":{"$error":"#REF!"}},{"$f":"IF('Наш прайс'!#REF!=0,\"\",'Наш прайс'!#REF!)","v":{"$error":"#REF!"}},{"$error":"#REF!"},null,null,{"$f":"IF('Наш прайс'!#REF!=0,\"\",'Наш прайс'!#REF!)","v":{"$error":"#REF!"}},{"$f":"IF('Наш прайс'!#REF!=0,\"\",'Наш прайс'!#REF!)","v":{"$error":"#REF!"}},{"$f":"IF('Наш прайс'!#REF!=0,\"\",'Наш прайс'!#REF!)","v":{"$error":"#REF!"}},{"$f":"IF('Наш прайс'!#REF!=0,\"\",'Наш прайс'!#REF!)","v":{"$error":"#REF!"}},{"$f":"IF('Наш прайс'!#REF!=0,\"\",'Наш прайс'!#REF!)","v":{"$error":"#REF!"}},{"$f":"IF('Наш прайс'!#REF!=0,\"\",'Наш прайс'!#REF!)","v":{"$error":"#REF!"}},{"$f":"IF('Наш прайс'!#REF!=0,\"\",'Наш прайс'!#REF!)","v":{"$error":"#REF!"}}]
[{"$f":"IF('Наш прайс'!#REF!=0,\"\",'Наш прайс'!#REF!)","v":{"$error":"#REF!"}},{"$f":"IF('Наш прайс'!#REF!=0,\"\",'Наш прайс'!#REF!)","v":{"$error":"#REF!"}},{"$f":"IF('Наш прайс'!#REF!=0,\"\",'Наш прайс'!#REF!)","v":{"$error":"#REF!"}},{"$error":"#REF!"},null,null,{"$f":"IF('Наш прайс'!#REF!=0,\"\",'Наш прайс'!#REF!)","v":{"$error":"#REF!"}},{"$f":"IF('Наш прайс'!#REF!=0,\"\",'Наш прайс'!#REF!)","v":{"$error":"#REF!"}},{"$f":"IF('Наш прайс'!#REF!=0,\"\",'Наш прайс'!#REF!)","v":{"$error":"#REF!"}},{"$f":"IF('Наш прайс'!#REF!=0,\"\",'Наш прайс'!#REF!)","v":{"$error":"#REF!"}},{"$f":"IF('Наш прайс'!#REF!=0,\"\",'Наш прайс'!#REF!)","v":{"$error":"#REF!"}},{"$f":"IF('Наш прайс'!#REF!=0,\"\",'Наш прайс'!#REF!)","v":{"$error":"#REF!"}},{"$f":"IF('Наш прайс'!#REF!=0,\"\",'Наш прайс'!#REF!)","v":{"$error":"#REF!"}}]
[{"$f":"IF('Наш прайс'!#REF!=0,\"\",'Наш прайс'!#REF!)","v":{"$error":"#REF!"}},{"$f":"IF('Наш прайс'!#REF!=0,\"\",'Наш прайс'!#REF!)","v":{"$error":"#REF!"}},{"$f":"IF('Наш прайс'!#REF!=0,\"\",'Наш прайс'!#REF!)","v":{"$error":"#REF!"}},{"$error":"#REF!"},null,null,{"$f":"IF('Наш прайс'!#REF!=0,\"\",'Наш прайс'!#REF!)","v":{"$error":"#REF!"}},{"$f":"IF('Наш прайс'!#REF!=0,\"\",'Наш прайс'!#REF!)","v":{"$error":"#REF!"}},{"$f":"IF('Наш прайс'!#REF!=0,\"\",'Наш прайс'!#REF!)","v":{"$error":"#REF!"}},{"$f":"IF('Наш прайс'!#REF!=0,\"\",'Наш прайс'!#REF!)","v":{"$error":"#REF!"}},{"$f":"IF('Наш прайс'!#REF!=0,\"\",'Наш прайс'!#REF!)","v":{"$error":"#REF!"}},{"$f":"IF('Наш прайс'!#REF!=0,\"\",'Наш прайс'!#REF!)","v":{"$error":"#REF!"}},{"$f":"IF('Наш прайс'!#REF!=0,\"\",'Наш прайс'!#REF!)","v":{"$error":"#REF!"}}]
[{"$f":"IF('Наш прайс'!#REF!=0,\"\",'Наш прайс'!#REF!)","v":{"$error":"#REF!"}},{"$f":"IF('Наш прайс'!#REF!=0,\"\",'Наш прайс'!#REF!)","v":{"$error":"#REF!"}},{"$f":"IF('Наш прайс'!#REF!=0,\"\",'Наш прайс'!#REF!)","v":{"$error":"#REF!"}},{"$error":"#REF!"},null,null,{"$f":"IF('Наш прайс'!#REF!=0,\"\",'Наш прайс'!#REF!)","v":{"$error":"#REF!"}},{"$f":"IF('Наш прайс'!#REF!=0,\"\",'Наш прайс'!#REF!)","v":{"$error":"#REF!"}},{"$f":"IF('Наш прайс'!#REF!=0,\"\",'Наш прайс'!#REF!)","v":{"$error":"#REF!"}},{"$f":"IF('Наш прайс'!#REF!=0,\"\",'Наш прайс'!#REF!)","v":{"$error":"#REF!"}},{"$f":"IF('Наш прайс'!#REF!=0,\"\",'Наш прайс'!#REF!)","v":{"$error":"#REF!"}},{"$f":"IF('Наш прайс'!#REF!=0,\"\",'Наш прайс'!#REF!)","v":{"$error":"#REF!"}},{"$f":"IF('Наш прайс'!#REF!=0,\"\",'Наш прайс'!#REF!)","v":{"$error":"#REF!"}}]
[{"$f":"IF('Наш прайс'!#REF!=0,\"\",'Наш прайс'!#REF!)","v":{"$error":"#REF!"}},{"$f":"IF('Наш прайс'!#REF!=0,\"\",'Наш прайс'!#REF!)","v":{"$error":"#REF!"}},{"$f":"IF('Наш прайс'!#REF!=0,\"\",'Наш прайс'!#REF!)","v":{"$error":"#REF!"}},{"$error":"#REF!"},null,null,{"$f":"IF('Наш прайс'!#REF!=0,\"\",'Наш прайс'!#REF!)","v":{"$error":"#REF!"}},{"$f":"IF('Наш прайс'!#REF!=0,\"\",'Наш прайс'!#REF!)","v":{"$error":"#REF!"}},{"$f":"IF('Наш прайс'!#REF!=0,\"\",'Наш прайс'!#REF!)","v":{"$error":"#REF!"}},{"$f":"IF('Наш прайс'!#REF!=0,\"\",'Наш прайс'!#REF!)","v":{"$error":"#REF!"}},{"$f":"IF('Наш прайс'!#REF!=0,\"\",'Наш прайс'!#REF!)","v":{"$error":"#REF!"}},{"$f":"IF('Наш прайс'!#REF!=0,\"\",'Наш прайс'!#REF!)","v":{"$error":"#REF!"}},{"$f":"IF('Наш прайс'!#REF!=0,\"\",'Наш прайс'!#REF!)","v":{"$error":"#REF!"}}]
[{"$f":"IF('Наш прайс'!#REF!=0,\"\",'Наш прайс'!#REF!)","v":{"$error":"#REF!"}},{"$f":"IF('Наш прайс'!#REF!=0,\"\",'Наш прайс'!#REF!)","v":{"$error":"#REF!"}},{"$f":"IF('Наш прайс'!#REF!=0,\"\",'Наш прайс'!#REF!)","v":{"$error":"#REF!"}},{"$error":"#REF!"},null,null,{"$f":"IF('Наш прайс'!#REF!=0,\"\",'Наш прайс'!#REF!)","v":{"$error":"#REF!"}},{"$f":"IF('Наш прайс'!#REF!=0,\"\",'Наш прайс'!#REF!)","v":{"$error":"#REF!"}},{"$f":"IF('Наш прайс'!#REF!=0,\"\",'Наш прайс'!#REF!)","v":{"$error":"#REF!"}},{"$f":"IF('Наш прайс'!#REF!=0,\"\",'Наш прайс'!#REF!)","v":{"$error":"#REF!"}},{"$f":"IF('Наш прайс'!#REF!=0,\"\",'Наш прайс'!#REF!)","v":{"$error":"#REF!"}},{"$f":"IF('Наш прайс'!#REF!=0,\"\",'Наш прайс'!#REF!)","v":{"$error":"#REF!"}},{"$f":"IF('Наш прайс'!#REF!=0,\"\",'Наш прайс'!#REF!)","v":{"$error":"#REF!"}}]
[{"$f":"IF('Наш прайс'!#REF!=0,\"\",'Наш прайс'!#REF!)","v":{"$error":"#REF!"}},{"$f":"IF('Наш прайс'!#REF!=0,\"\",'Наш прайс'!#REF!)","v":{"$error":"#REF!"}},{"$f":"IF('Наш прайс'!#REF!=0,\"\",'Наш прайс'!#REF!)","v":{"$error":"#REF!"}},{"$error":"#REF!"},null,null,{"$f":"IF('Наш прайс'!#REF!=0,\"\",'Наш прайс'!#REF!)","v":{"$error":"#REF!"}},{"$f":"IF('Наш прайс'!#REF!=0,\"\",'Наш прайс'!#REF!)","v":{"$error":"#REF!"}},{"$f":"IF('Наш прайс'!#REF!=0,\"\",'Наш прайс'!#REF!)","v":{"$error":"#REF!"}},{"$f":"IF('Наш прайс'!#REF!=0,\"\",'Наш прайс'!#REF!)","v":{"$error":"#REF!"}},{"$f":"IF('Наш прайс'!#REF!=0,\"\",'Наш прайс'!#REF!)","v":{"$error":"#REF!"}},{"$f":"IF('Наш прайс'!#REF!=0,\"\",'Наш прайс'!#REF!)","v":{"$error":"#REF!"}},{"$f":"IF('Наш прайс'!#REF!=0,\"\",'Наш прайс'!#REF!)","v":{"$error":"#REF!"}}]
[{"$f":"IF('Наш прайс'!#REF!=0,\"\",'Наш прайс'!#REF!)","v":{"$error":"#REF!"}},{"$f":"IF('Наш прайс'!#REF!=0,\"\",'Наш прайс'!#REF!)","v":{"$error":"#REF!"}},{"$f":"IF('Наш прайс'!#REF!=0,\"\",'Наш прайс'!#REF!)","v":{"$error":"#REF!"}},{"$error":"#REF!"},null,null,{"$f":"IF('Наш прайс'!#REF!=0,\"\",'Наш прайс'!#REF!)","v":{"$error":"#REF!"}},{"$f":"IF('Наш прайс'!#REF!=0,\"\",'Наш прайс'!#REF!)","v":{"$error":"#REF!"}},{"$f":"IF('Наш прайс'!#REF!=0,\"\",'Наш прайс'!#REF!)","v":{"$error":"#REF!"}},{"$f":"IF('Наш прайс'!#REF!=0,\"\",'Наш прайс'!#REF!)","v":{"$error":"#REF!"}},{"$f":"IF('Наш прайс'!#REF!=0,\"\",'Наш прайс'!#REF!)","v":{"$error":"#REF!"}},{"$f":"IF('Наш прайс'!#REF!=0,\"\",'Наш прайс'!#REF!)","v":{"$error":"#REF!"}},{"$f":"IF('Наш прайс'!#REF!=0,\"\",'Наш прайс'!#REF!)","v":{"$error":"#REF!"}}]
[{"$f":"IF('Наш прайс'!#REF!=0,\"\",'Наш прайс'!#REF!)","v":{"$error":"#REF!"}},{"$f":"IF('Наш прайс'!#REF!=0,\"\",'Наш прайс'!#REF!)","v":{"$error":"#REF!"}},{"$f":"IF('Наш прайс'!#REF!=0,\"\",'Наш прайс'!#REF!)","v":{"$error":"#REF!"}},{"$error":"#REF!"},null,null,{"$f":"IF('Наш прайс'!#REF!=0,\"\",'Наш прайс'!#REF!)","v":{"$error":"#REF!"}},{"$f":"IF('Наш прайс'!#REF!=0,\"\",'Наш прайс'!#REF!)","v":{"$error":"#REF!"}},{"$f":"IF('Наш прайс'!#REF!=0,\"\",'Наш прайс'!#REF!)","v":{"$error":"#REF!"}},{"$f":"IF('Наш прайс'!#REF!=0,\"\",'Наш прайс'!#REF!)","v":{"$error":"#REF!"}},{"$f":"IF('Наш прайс'!#REF!=0,\"\",'Наш прайс'!#REF!)","v":{"$error":"#REF!"}},{"$f":"IF('Наш прайс'!#REF!=0,\"\",'Наш прайс'!#REF!)","v":{"$error":"#REF!"}},{"$f":"IF('Наш прайс'!#REF!=0,\"\",'Наш прайс'!#REF!)","v":{"$error":"#REF!"}}]
[{"$f":"IF('Наш прайс'!#REF!=0,\"\",'Наш прайс'!#REF!)","v":{"$error":"#REF!"}},{"$f":"IF('Наш прайс'!#REF!=0,\"\",'Наш прайс'!#REF!)","v":{"$error":"#REF!"}},{"$f":"IF('Наш прайс'!#REF!=0,\"\",'Наш прайс'!#REF!)","v":{"$error":"#REF!"}},{"$error":"#REF!"},null,null,{"$f":"IF('Наш прайс'!#REF!=0,\"\",'Наш прайс'!#REF!)","v":{"$error":"#REF!"}},{"$f":"IF('Наш прайс'!#REF!=0,\"\",'Наш прайс'!#REF!)","v":{"$error":"#REF!"}},{"$f":"IF('Наш прайс'!#REF!=0,\"\",'Наш прайс'!#REF!)","v":{"$error":"#REF!"}},{"$f":"IF('Наш прайс'!#REF!=0,\"\",'Наш прайс'!#REF!)","v":{"$error":"#REF!"}},{"$f":"IF('Наш прайс'!#REF!=0,\"\",'Наш прайс'!#REF!)","v":{"$error":"#REF!"}},{"$f":"IF('Наш прайс'!#REF!=0,\"\",'Наш прайс'!#REF!)","v":{"$error":"#REF!"}},{"$f":"IF('Наш прайс'!#REF!=0,\"\",'Наш прайс'!#REF!)","v":{"$error":"#REF!"}}]
[{"$f":"IF('Наш прайс'!#REF!=0,\"\",'Наш прайс'!#REF!)","v":{"$error":"#REF!"}},{"$f":"IF('Наш прайс'!#REF!=0,\"\",'Наш прайс'!#REF!)","v":{"$error":"#REF!"}},{"$f":"IF('Наш прайс'!#REF!=0,\"\",'Наш прайс'!#REF!)","v":{"$error":"#REF!"}},{"$error":"#REF!"},null,null,{"$f":"IF('Наш прайс'!#REF!=0,\"\",'Наш прайс'!#REF!)","v":{"$error":"#REF!"}},{"$f":"IF('Наш прайс'!#REF!=0,\"\",'Наш прайс'!#REF!)","v":{"$error":"#REF!"}},{"$f":"IF('Наш прайс'!#REF!=0,\"\",'Наш прайс'!#REF!)","v":{"$error":"#REF!"}},{"$f":"IF('Наш прайс'!#REF!=0,\"\",'Наш прайс'!#REF!)","v":{"$error":"#REF!"}},{"$f":"IF('Наш прайс'!#REF!=0,\"\",'Наш прайс'!#REF!)","v":{"$error":"#REF!"}},{"$f":"IF('Наш прайс'!#REF!=0,\"\",'Наш прайс'!#REF!)","v":{"$error":"#REF!"}},{"$f":"IF('Наш прайс'!#REF!=0,\"\",'Наш прайс'!#REF!)","v":{"$error":"#REF!"}}]
[{"$f":"IF('Наш прайс'!#REF!=0,\"\",'Наш прайс'!#REF!)","v":{"$error":"#REF!"}},{"$f":"IF('Наш прайс'!#REF!=0,\"\",'Наш прайс'!#REF!)","v":{"$error":"#REF!"}},{"$f":"IF('Наш прайс'!#REF!=0,\"\",'Наш прайс'!#REF!)","v":{"$error":"#REF!"}},{"$f":"L67","v":{"$error":"#REF!"}},null,null,{"$f":"IF('Наш прайс'!#REF!=0,\"\",'Наш прайс'!#REF!)","v":{"$error":"#REF!"}},{"$f":"IF('Наш прайс'!#REF!=0,\"\",'Наш прайс'!#REF!)","v":{"$error":"#REF!"}},{"$f":"IF('Наш прайс'!#REF!=0,\"\",'Наш прайс'!#REF!)","v":{"$error":"#REF!"}},{"$f":"IF('Наш прайс'!#REF!=0,\"\",'Наш прайс'!#REF!)","v":{"$error":"#REF!"}},{"$f":"IF('Наш прайс'!#REF!=0,\"\",'Наш прайс'!#REF!)","v":{"$error":"#REF!"}},{"$f":"IF('Наш прайс'!#REF!=0,\"\",'Наш прайс'!#REF!)","v":{"$error":"#REF!"}},{"$f":"IF('Наш прайс'!#REF!=0,\"\",'Наш прайс'!#REF!)","v":{"$error":"#REF!"}}]
[{"$f":"IF('Наш прайс'!#REF!=0,\"\",'Наш прайс'!#REF!)","v":{"$error":"#REF!"}},{"$f":"IF('Наш прайс'!#REF!=0,\"\",'Наш прайс'!#REF!)","v":{"$error":"#REF!"}},{"$f":"IF('Наш прайс'!#REF!=0,\"\",'Наш прайс'!#REF!)","v":{"$error":"#REF!"}},{"$error":"#REF!"},null,null,{"$f":"IF('Наш прайс'!#REF!=0,\"\",'Наш прайс'!#REF!)","v":{"$error":"#REF!"}},{"$f":"IF('Наш прайс'!#REF!=0,\"\",'Наш прайс'!#REF!)","v":{"$error":"#REF!"}},{"$f":"IF('Наш прайс'!#REF!=0,\"\",'Наш прайс'!#REF!)","v":{"$error":"#REF!"}},{"$f":"IF('Наш прайс'!#REF!=0,\"\",'Наш прайс'!#REF!)","v":{"$error":"#REF!"}},{"$f":"IF('Наш прайс'!#REF!=0,\"\",'Наш прайс'!#REF!)","v":{"$error":"#REF!"}},{"$f":"IF('Наш прайс'!#REF!=0,\"\",'Наш прайс'!#REF!)","v":{"$error":"#REF!"}},{"$f":"IF('Наш прайс'!#REF!=0,\"\",'Наш прайс'!#REF!)","v":{"$error":"#REF!"}}]
[{"$f":"IF('Наш прайс'!#REF!=0,\"\",'Наш прайс'!#REF!)","v":{"$error":"#REF!"}},{"$f":"IF('Наш прайс'!#REF!=0,\"\",'Наш прайс'!#REF!)","v":{"$error":"#REF!"}},{"$f":"IF('Наш прайс'!#REF!=0,\"\",'Наш прайс'!#REF!)","v":{"$error":"#REF!"}},{"$error":"#REF!"},null,null,{"$f":"IF('Наш прайс'!#REF!=0,\"\",'Наш прайс'!#REF!)","v":{"$error":"#REF!"}},{"$f":"IF('Наш прайс'!#REF!=0,\"\",'Наш прайс'!#REF!)","v":{"$error":"#REF!"}},{"$f":"IF('Наш прайс'!#REF!=0,\"\",'Наш прайс'!#REF!)","v":{"$error":"#REF!"}},{"$f":"IF('Наш прайс'!#REF!=0,\"\",'Наш прайс'!#REF!)","v":{"$error":"#REF!"}},{"$f":"IF('Наш прайс'!#REF!=0,\"\",'Наш прайс'!#REF!)","v":{"$error":"#REF!"}},{"$f":"IF('Наш прайс'!#REF!=0,\"\",'Наш прайс'!#REF!)","v":{"$error":"#REF!"}},{"$f":"IF('Наш прайс'!#REF!=0,\"\",'Наш прайс'!#REF!)","v":{"$error":"#REF!"}}]
[{"$f":"IF('Наш прайс'!#REF!=0,\"\",'Наш прайс'!#REF!)","v":{"$error":"#REF!"}},{"$f":"IF('Наш прайс'!#REF!=0,\"\",'Наш прайс'!#REF!)","v":{"$error":"#REF!"}},{"$f":"IF('Наш прайс'!#REF!=0,\"\",'Наш прайс'!#REF!)","v":{"$error":"#REF!"}},{"$error":"#REF!"},null,null,{"$f":"IF('Наш прайс'!#REF!=0,\"\",'Наш прайс'!#REF!)","v":{"$error":"#REF!"}},{"$f":"IF('Наш прайс'!#REF!=0,\"\",'Наш прайс'!#REF!)","v":{"$error":"#REF!"}},{"$f":"IF('Наш прайс'!#REF!=0,\"\",'Наш прайс'!#REF!)","v":{"$error":"#REF!"}},{"$f":"IF('Наш прайс'!#REF!=0,\"\",'Наш прайс'!#REF!)","v":{"$error":"#REF!"}},{"$f":"IF('Наш прайс'!#REF!=0,\"\",'Наш прайс'!#REF!)","v":{"$error":"#REF!"}},{"$f":"IF('Наш прайс'!#REF!=0,\"\",'Наш прайс'!#REF!)","v":{"$error":"#REF!"}},{"$f":"IF('Наш прайс'!#REF!=0,\"\",'Наш прайс'!#REF!)","v":{"$error":"#REF!"}}]
[{"$f":"IF('Наш прайс'!#REF!=0,\"\",'Наш прайс'!#REF!)","v":{"$error":"#REF!"}},{"$f":"IF('Наш прайс'!#REF!=0,\"\",'Наш прайс'!#REF!)","v":{"$error":"#REF!"}},{"$f":"IF('Наш прайс'!#REF!=0,\"\",'Наш прайс'!#REF!)","v":{"$error":"#REF!"}},{"$error":"#REF!"},null,null,{"$f":"IF('Наш прайс'!#REF!=0,\"\",'Наш прайс'!#REF!)","v":{"$error":"#REF!"}},{"$f":"IF('Наш прайс'!#REF!=0,\"\",'Наш прайс'!#REF!)","v":{"$error":"#REF!"}},{"$f":"IF('Наш прайс'!#REF!=0,\"\",'Наш прайс'!#REF!)","v":{"$error":"#REF!"}},{"$f":"IF('Наш прайс'!#REF!=0,\"\",'Наш прайс'!#REF!)","v":{"$error":"#REF!"}},{"$f":"IF('Наш прайс'!#REF!=0,\"\",'Наш прайс'!#REF!)","v":{"$error":"#REF!"}},{"$f":"IF('Наш прайс'!#REF!=0,\"\",'Наш прайс'!#REF!)","v":{"$error":"#REF!"}},{"$f":"IF('Наш прайс'!#REF!=0,\"\",'Наш прайс'!#REF!)","v":{"$error":"#REF!"}}]
[{"$f":"IF('Наш прайс'!#REF!=0,\"\",'Наш прайс'!#REF!)","v":{"$error":"#REF!"}},{"$f":"IF('Наш прайс'!#REF!=0,\"\",'Наш прайс'!#REF!)","v":{"$error":"#REF!"}},{"$f":"IF('Наш прайс'!#REF!=0,\"\",'Наш прайс'!#REF!)","v":{"$error":"#REF!"}},{"$error":"#REF!"},null,null,{"$f":"IF('Наш прайс'!#REF!=0,\"\",'Наш прайс'!#REF!)","v":{"$error":"#REF!"}},{"$f":"IF('Наш прайс'!#REF!=0,\"\",'Наш прайс'!#REF!)","v":{"$error":"#REF!"}},{"$f":"IF('Наш прайс'!#REF!=0,\"\",'Наш прайс'!#REF!)","v":{"$error":"#REF!"}},{"$f":"IF('Наш прайс'!#REF!=0,\"\",'Наш прайс'!#REF!)","v":{"$error":"#REF!"}},{"$f":"IF('Наш прайс'!#REF!=0,\"\",'Наш прайс'!#REF!)","v":{"$error":"#REF!"}},{"$f":"IF('Наш прайс'!#REF!=0,\"\",'Наш прайс'!#REF!)","v":{"$error":"#REF!"}},{"$f":"IF('Наш прайс'!#REF!=0,\"\",'Наш прайс'!#REF!)","v":{"$error":"#REF!"}}]
[{"$f":"IF('Наш прайс'!#REF!=0,\"\",'Наш прайс'!#REF!)","v":{"$error":"#REF!"}},{"$f":"IF('Наш прайс'!#REF!=0,\"\",'Наш прайс'!#REF!)","v":{"$error":"#REF!"}},{"$f":"IF('Наш прайс'!#REF!=0,\"\",'Наш прайс'!#REF!)","v":{"$error":"#REF!"}},{"$error":"#REF!"},null,null,{"$f":"IF('Наш прайс'!#REF!=0,\"\",'Наш прайс'!#REF!)","v":{"$error":"#REF!"}},{"$f":"IF('Наш прайс'!#REF!=0,\"\",'Наш прайс'!#REF!)","v":{"$error":"#REF!"}},{"$f":"IF('Наш прайс'!#REF!=0,\"\",'Наш прайс'!#REF!)","v":{"$error":"#REF!"}},{"$f":"IF('Наш прайс'!#REF!=0,\"\",'Наш прайс'!#REF!)","v":{"$error":"#REF!"}},{"$f":"IF('Наш прайс'!#REF!=0,\"\",'Наш прайс'!#REF!)","v":{"$error":"#REF!"}},{"$f":"IF('Наш прайс'!#REF!=0,\"\",'Наш прайс'!#REF!)","v":{"$error":"#REF!"}},{"$f":"IF('Наш прайс'!#REF!=0,\"\",'Наш прайс'!#REF!)","v":{"$error":"#REF!"}}]
[{"$f":"IF('Наш прайс'!#REF!=0,\"\",'Наш прайс'!#REF!)","v":{"$error":"#REF!"}},{"$f":"IF('Наш прайс'!#REF!=0,\"\",'Наш прайс'!#REF!)","v":{"$error":"#REF!"}},{"$f":"IF('Наш прайс'!#REF!=0,\"\",'Наш прайс'!#REF!)","v":{"$error":"#REF!"}},{"$error":"#REF!"},null,null,{"$f":"IF('Наш прайс'!#REF!=0,\"\",'Наш прайс'!#REF!)","v":{"$error":"#REF!"}},{"$f":"IF('Наш прайс'!#REF!=0,\"\",'Наш прайс'!#REF!)","v":{"$error":"#REF!"}},{"$f":"IF('Наш прайс'!#REF!=0,\"\",'Наш прайс'!#REF!)","v":{"$error":"#REF!"}},{"$f":"IF('Наш прайс'!#REF!=0,\"\",'Наш прайс'!#REF!)","v":{"$error":"#REF!"}},{"$f":"IF('Наш прайс'!#REF!=0,\"\",'Наш прайс'!#REF!)","v":{"$error":"#REF!"}},{"$f":"IF('Наш прайс'!#REF!=0,\"\",'Наш прайс'!#REF!)","v":{"$error":"#REF!"}},{"$f":"IF('Наш прайс'!#REF!=0,\"\",'Наш прайс'!#REF!)","v":{"$error":"#REF!"}}]
[{"$f":"IF('Наш прайс'!#REF!=0,\"\",'Наш прайс'!#REF!)","v":{"$error":"#REF!"}},{"$f":"IF('Наш прайс'!#REF!=0,\"\",'Наш прайс'!#REF!)","v":{"$error":"#REF!"}},{"$f":"IF('Наш прайс'!#REF!=0,\"\",'Наш прайс'!#REF!)","v":{"$error":"#REF!"}},{"$error":"#REF!"},null,null,{"$f":"IF('Наш прайс'!#REF!=0,\"\",'Наш прайс'!#REF!)","v":{"$error":"#REF!"}},{"$f":"IF('Наш прайс'!#REF!=0,\"\",'Наш прайс'!#REF!)","v":{"$error":"#REF!"}},{"$f":"IF('Наш прайс'!#REF!=0,\"\",'Наш прайс'!#REF!)","v":{"$error":"#REF!"}},{"$f":"IF('Наш прайс'!#REF!=0,\"\",'Наш прайс'!#REF!)","v":{"$error":"#REF!"}},{"$f":"IF('Наш прайс'!#REF!=0,\"\",'Наш прайс'!#REF!)","v":{"$error":"#REF!"}},{"$f":"IF('Наш прайс'!#REF!=0,\"\",'Наш прайс'!#REF!)","v":{"$error":"#REF!"}},{"$f":"IF('Наш прайс'!#REF!=0,\"\",'Наш прайс'!#REF!)","v":{"$error":"#REF!"}}]
[{"$f":"IF('Наш прайс'!#REF!=0,\"\",'Наш прайс'!#REF!)","v":{"$error":"#REF!"}},{"$f":"IF('Наш прайс'!#REF!=0,\"\",'Наш прайс'!#REF!)","v":{"$error":"#REF!"}},{"$f":"IF('Наш прайс'!#REF!=0,\"\",'Наш прайс'!#REF!)","v":{"$error":"#REF!"}},{"$error":"#REF!"},null,null,{"$f":"IF('Наш прайс'!#REF!=0,\"\",'Наш прайс'!#REF!)","v":{"$error":"#REF!"}},{"$f":"IF('Наш прайс'!#REF!=0,\"\",'Наш прайс'!#REF!)","v":{"$error":"#REF!"}},{"$f":"IF('Наш прайс'!#REF!=0,\"\",'Наш прайс'!#REF!)","v":{"$error":"#REF!"}},{"$f":"IF('Наш прайс'!#REF!=0,\"\",'Наш прайс'!#REF!)","v":{"$error":"#REF!"}},{"$f":"IF('Наш прайс'!#REF!=0,\"\",'Наш прайс'!#REF!)","v":{"$error":"#REF!"}},{"$f":"IF('Наш прайс'!#REF!=0,\"\",'Наш прайс'!#REF!)","v":{"$error":"#REF!"}},{"$f":"IF('Наш прайс'!#REF!=0,\"\",'Наш прайс'!#REF!)","v":{"$error":"#REF!"}}]
[{"$f":"IF('Наш прайс'!#REF!=0,\"\",'Наш прайс'!#REF!)","v":{"$error":"#REF!"}},{"$f":"IF('Наш прайс'!#REF!=0,\"\",'Наш прайс'!#REF!)","v":{"$error":"#REF!"}},{"$f":"IF('Наш прайс'!#REF!=0,\"\",'Наш прайс'!#REF!)","v":{"$error":"#REF!"}},{"$error":"#REF!"},null,null,{"$f":"IF('Наш прайс'!#REF!=0,\"\",'Наш прайс'!#REF!)","v":{"$error":"#REF!"}},{"$f":"IF('Наш прайс'!#REF!=0,\"\",'Наш прайс'!#REF!)","v":{"$error":"#REF!"}},{"$f":"IF('Наш прайс'!#REF!=0,\"\",'Наш прайс'!#REF!)","v":{"$error":"#REF!"}},{"$f":"IF('Наш прайс'!#REF!=0,\"\",'Наш прайс'!#REF!)","v":{"$error":"#REF!"}},{"$f":"IF('Наш прайс'!#REF!=0,\"\",'Наш прайс'!#REF!)","v":{"$error":"#REF!"}},{"$f":"IF('Наш прайс'!#REF!=0,\"\",'Наш прайс'!#REF!)","v":{"$error":"#REF!"}},{"$f":"IF('Наш прайс'!#REF!=0,\"\",'Наш прайс'!#REF!)","v":{"$error":"#REF!"}}]
[{"$f":"IF('Наш прайс'!#REF!=0,\"\",'Наш прайс'!#REF!)","v":{"$error":"#REF!"}},{"$f":"IF('Наш прайс'!#REF!=0,\"\",'Наш прайс'!#REF!)","v":{"$error":"#REF!"}},{"$f":"IF('Наш прайс'!#REF!=0,\"\",'Наш прайс'!#REF!)","v":{"$error":"#REF!"}},{"$error":"#REF!"},null,null,{"$f":"IF('Наш прайс'!#REF!=0,\"\",'Наш прайс'!#REF!)","v":{"$error":"#REF!"}},{"$f":"IF('Наш прайс'!#REF!=0,\"\",'Наш прайс'!#REF!)","v":{"$error":"#REF!"}},{"$f":"IF('Наш прайс'!#REF!=0,\"\",'Наш прайс'!#REF!)","v":{"$error":"#REF!"}},{"$f":"IF('Наш прайс'!#REF!=0,\"\",'Наш прайс'!#REF!)","v":{"$error":"#REF!"}},{"$f":"IF('Наш прайс'!#REF!=0,\"\",'Наш прайс'!#REF!)","v":{"$error":"#REF!"}},{"$f":"IF('Наш прайс'!#REF!=0,\"\",'Наш прайс'!#REF!)","v":{"$error":"#REF!"}},{"$f":"IF('Наш прайс'!#REF!=0,\"\",'Наш прайс'!#REF!)","v":{"$error":"#REF!"}}]
[{"$f":"IF('Наш прайс'!#REF!=0,\"\",'Наш прайс'!#REF!)","v":{"$error":"#REF!"}},{"$f":"IF('Наш прайс'!#REF!=0,\"\",'Наш прайс'!#REF!)","v":{"$error":"#REF!"}},{"$f":"IF('Наш прайс'!#REF!=0,\"\",'Наш прайс'!#REF!)","v":{"$error":"#REF!"}},{"$error":"#REF!"},null,null,{"$f":"IF('Наш прайс'!#REF!=0,\"\",'Наш прайс'!#REF!)","v":{"$error":"#REF!"}},{"$f":"IF('Наш прайс'!#REF!=0,\"\",'Наш прайс'!#REF!)","v":{"$error":"#REF!"}},{"$f":"IF('Наш прайс'!#REF!=0,\"\",'Наш прайс'!#REF!)","v":{"$error":"#REF!"}},{"$f":"IF('Наш прайс'!#REF!=0,\"\",'Наш прайс'!#REF!)","v":{"$error":"#REF!"}},{"$f":"IF('Наш прайс'!#REF!=0,\"\",'Наш прайс'!#REF!)","v":{"$error":"#REF!"}},{"$f":"IF('Наш прайс'!#REF!=0,\"\",'Наш прайс'!#REF!)","v":{"$error":"#REF!"}},{"$f":"IF('Наш прайс'!#REF!=0,\"\",'Наш прайс'!#REF!)","v":{"$error":"#REF!"}}]
[{"$f":"IF('Наш прайс'!#REF!=0,\"\",'Наш прайс'!#REF!)","v":{"$error":"#REF!"}},{"$f":"IF('Наш прайс'!#REF!=0,\"\",'Наш прайс'!#REF!)","v":{"$error":"#REF!"}},{"$f":"IF('Наш прайс'!#REF!=0,\"\",'Наш прайс'!#REF!)","v":{"$error":"#REF!"}},{"$f":"L80","v":{"$error":"#REF!"}},null,null,{"$f":"IF('Наш прайс'!#REF!=0,\"\",'Наш прайс'!#REF!)","v":{"$error":"#REF!"}},{"$f":"IF('Наш прайс'!#REF!=0,\"\",'Наш прайс'!#REF!)","v":{"$error":"#REF!"}},{"$f":"IF('Наш прайс'!#REF!=0,\"\",'Наш прайс'!#REF!)","v":{"$error":"#REF!"}},{"$f":"IF('Наш прайс'!#REF!=0,\"\",'Наш прайс'!#REF!)","v":{"$error":"#REF!"}},{"$f":"IF('Наш прайс'!#REF!=0,\"\",'Наш прайс'!#REF!)","v":{"$error":"#REF!"}},{"$f":"IF('Наш прайс'!#REF!=0,\"\",'Наш прайс'!#REF!)","v":{"$error":"#REF!"}},{"$f":"IF('Наш прайс'!#REF!=0,\"\",'Наш прайс'!#REF!)","v":{"$error":"#REF!"}}]
[{"$f":"IF('Наш прайс'!#REF!=0,\"\",'Наш прайс'!#REF!)","v":{"$error":"#REF!"}},{"$f":"IF('Наш прайс'!#REF!=0,\"\",'Наш прайс'!#REF!)","v":{"$error":"#REF!"}},{"$f":"IF('Наш прайс'!#REF!=0,\"\",'Наш прайс'!#REF!)","v":{"$error":"#REF!"}},{"$error":"#REF!"},null,null,{"$f":"IF('Наш прайс'!#REF!=0,\"\",'Наш прайс'!#REF!)","v":{"$error":"#REF!"}},{"$f":"IF('Наш прайс'!#REF!=0,\"\",'Наш прайс'!#REF!)","v":{"$error":"#REF!"}},{"$f":"IF('Наш прайс'!#REF!=0,\"\",'Наш прайс'!#REF!)","v":{"$error":"#REF!"}},{"$f":"IF('Наш прайс'!#REF!=0,\"\",'Наш прайс'!#REF!)","v":{"$error":"#REF!"}},{"$f":"IF('Наш прайс'!#REF!=0,\"\",'Наш прайс'!#REF!)","v":{"$error":"#REF!"}},{"$f":"IF('Наш прайс'!#REF!=0,\"\",'Наш прайс'!#REF!)","v":{"$error":"#REF!"}},{"$f":"IF('Наш прайс'!#REF!=0,\"\",'Наш прайс'!#REF!)","v":{"$error":"#REF!"}}]
[{"$f":"IF('Наш прайс'!#REF!=0,\"\",'Наш прайс'!#REF!)","v":{"$error":"#REF!"}},{"$f":"IF('Наш прайс'!#REF!=0,\"\",'Наш прайс'!#REF!)","v":{"$error":"#REF!"}},{"$f":"IF('Наш прайс'!#REF!=0,\"\",'Наш прайс'!#REF!)","v":{"$error":"#REF!"}},{"$error":"#REF!"},null,null,{"$f":"IF('Наш прайс'!#REF!=0,\"\",'Наш прайс'!#REF!)","v":{"$error":"#REF!"}},{"$f":"IF('Наш прайс'!#REF!=0,\"\",'Наш прайс'!#REF!)","v":{"$error":"#REF!"}},{"$f":"IF('Наш прайс'!#REF!=0,\"\",'Наш прайс'!#REF!)","v":{"$error":"#REF!"}},{"$f":"IF('Наш прайс'!#REF!=0,\"\",'Наш прайс'!#REF!)","v":{"$error":"#REF!"}},{"$f":"IF('Наш прайс'!#REF!=0,\"\",'Наш прайс'!#REF!)","v":{"$error":"#REF!"}},{"$f":"IF('Наш прайс'!#REF!=0,\"\",'Наш прайс'!#REF!)","v":{"$error":"#REF!"}},{"$f":"IF('Наш прайс'!#REF!=0,\"\",'Наш прайс'!#REF!)","v":{"$error":"#REF!"}}]
[{"$f":"IF('Наш прайс'!#REF!=0,\"\",'Наш прайс'!#REF!)","v":{"$error":"#REF!"}},{"$f":"IF('Наш прайс'!#REF!=0,\"\",'Наш прайс'!#REF!)","v":{"$error":"#REF!"}},{"$f":"IF('Наш прайс'!#REF!=0,\"\",'Наш прайс'!#REF!)","v":{"$error":"#REF!"}},{"$error":"#REF!"},null,null,{"$f":"IF('Наш прайс'!#REF!=0,\"\",'Наш прайс'!#REF!)","v":{"$error":"#REF!"}},{"$f":"IF('Наш прайс'!#REF!=0,\"\",'Наш прайс'!#REF!)","v":{"$error":"#REF!"}},{"$f":"IF('Наш прайс'!#REF!=0,\"\",'Наш прайс'!#REF!)","v":{"$error":"#REF!"}},{"$f":"IF('Наш прайс'!#REF!=0,\"\",'Наш прайс'!#REF!)","v":{"$error":"#REF!"}},{"$f":"IF('Наш прайс'!#REF!=0,\"\",'Наш прайс'!#REF!)","v":{"$error":"#REF!"}},{"$f":"IF('Наш прайс'!#REF!=0,\"\",'Наш прайс'!#REF!)","v":{"$error":"#REF!"}},{"$f":"IF('Наш прайс'!#REF!=0,\"\",'Наш прайс'!#REF!)","v":{"$error":"#REF!"}}]
[{"$f":"IF('Наш прайс'!#REF!=0,\"\",'Наш прайс'!#REF!)","v":{"$error":"#REF!"}},{"$f":"IF('Наш прайс'!#REF!=0,\"\",'Наш прайс'!#REF!)","v":{"$error":"#REF!"}},{"$f":"IF('Наш прайс'!#REF!=0,\"\",'Наш прайс'!#REF!)","v":{"$error":"#REF!"}},{"$error":"#REF!"},null,null,{"$f":"IF('Наш прайс'!#REF!=0,\"\",'Наш прайс'!#REF!)","v":{"$error":"#REF!"}},{"$f":"IF('Наш прайс'!#REF!=0,\"\",'Наш прайс'!#REF!)","v":{"$error":"#REF!"}},{"$f":"IF('Наш прайс'!#REF!=0,\"\",'Наш прайс'!#REF!)","v":{"$error":"#REF!"}},{"$f":"IF('Наш прайс'!#REF!=0,\"\",'Наш прайс'!#REF!)","v":{"$error":"#REF!"}},{"$f":"IF('Наш прайс'!#REF!=0,\"\",'Наш прайс'!#REF!)","v":{"$error":"#REF!"}},{"$f":"IF('Наш прайс'!#REF!=0,\"\",'Наш прайс'!#REF!)","v":{"$error":"#REF!"}},{"$f":"IF('Наш прайс'!#REF!=0,\"\",'Наш прайс'!#REF!)","v":{"$error":"#REF!"}}]
[{"$f":"IF('Наш прайс'!#REF!=0,\"\",'Наш прайс'!#REF!)","v":{"$error":"#REF!"}},{"$f":"IF('Наш прайс'!#REF!=0,\"\",'Наш прайс'!#REF!)","v":{"$error":"#REF!"}},{"$f":"IF('Наш прайс'!#REF!=0,\"\",'Наш прайс'!#REF!)","v":{"$error":"#REF!"}},{"$error":"#REF!"},null,null,{"$f":"IF('Наш прайс'!#REF!=0,\"\",'Наш прайс'!#REF!)","v":{"$error":"#REF!"}},{"$f":"IF('Наш прайс'!#REF!=0,\"\",'Наш прайс'!#REF!)","v":{"$error":"#REF!"}},{"$f":"IF('Наш прайс'!#REF!=0,\"\",'Наш прайс'!#REF!)","v":{"$error":"#REF!"}},{"$f":"IF('Наш прайс'!#REF!=0,\"\",'Наш прайс'!#REF!)","v":{"$error":"#REF!"}},{"$f":"IF('Наш прайс'!#REF!=0,\"\",'Наш прайс'!#REF!)","v":{"$error":"#REF!"}},{"$f":"IF('Наш прайс'!#REF!=0,\"\",'Наш прайс'!#REF!)","v":{"$error":"#REF!"}},{"$f":"IF('Наш прайс'!#REF!=0,\"\",'Наш прайс'!#REF!)","v":{"$error":"#REF!"}}]
[{"$f":"IF('Наш прайс'!#REF!=0,\"\",'Наш прайс'!#REF!)","v":{"$error":"#REF!"}},{"$f":"IF('Наш прайс'!#REF!=0,\"\",'Наш прайс'!#REF!)","v":{"$error":"#REF!"}},{"$f":"IF('Наш прайс'!#REF!=0,\"\",'Наш прайс'!#REF!)","v":{"$error":"#REF!"}},{"$error":"#REF!"},null,null,{"$f":"IF('Наш прайс'!#REF!=0,\"\",'Наш прайс'!#REF!)","v":{"$error":"#REF!"}},{"$f":"IF('Наш прайс'!#REF!=0,\"\",'Наш прайс'!#REF!)","v":{"$error":"#REF!"}},{"$f":"IF('Наш прайс'!#REF!=0,\"\",'Наш прайс'!#REF!)","v":{"$error":"#REF!"}},{"$f":"IF('Наш прайс'!#REF!=0,\"\",'Наш прайс'!#REF!)","v":{"$error":"#REF!"}},{"$f":"IF('Наш прайс'!#REF!=0,\"\",'Наш прайс'!#REF!)","v":{"$error":"#REF!"}},{"$f":"IF('Наш прайс'!#REF!=0,\"\",'Наш прайс'!#REF!)","v":{"$error":"#REF!"}},{"$f":"IF('Наш прайс'!#REF!=0,\"\",'Наш прайс'!#REF!)","v":{"$error":"#REF!"}}]
[{"$f":"IF('Наш прайс'!#REF!=0,\"\",'Наш прайс'!#REF!)","v":{"$error":"#REF!"}},{"$f":"IF('Наш прайс'!#REF!=0,\"\",'Наш прайс'!#REF!)","v":{"$error":"#REF!"}},{"$f":"IF('Наш прайс'!#REF!=0,\"\",'Наш прайс'!#REF!)","v":{"$error":"#REF!"}},{"$error":"#REF!"},null,null,{"$f":"IF('Наш прайс'!#REF!=0,\"\",'Наш прайс'!#REF!)","v":{"$error":"#REF!"}},{"$f":"IF('Наш прайс'!#REF!=0,\"\",'Наш прайс'!#REF!)","v":{"$error":"#REF!"}},{"$f":"IF('Наш прайс'!#REF!=0,\"\",'Наш прайс'!#REF!)","v":{"$error":"#REF!"}},{"$f":"IF('Наш прайс'!#REF!=0,\"\",'Наш прайс'!#REF!)","v":{"$error":"#REF!"}},{"$f":"IF('Наш прайс'!#REF!=0,\"\",'Наш прайс'!#REF!)","v":{"$error":"#REF!"}},{"$f":"IF('Наш прайс'!#REF!=0,\"\",'Наш прайс'!#REF!)","v":{"$error":"#REF!"}},{"$f":"IF('Наш прайс'!#REF!=0,\"\",'Наш прайс'!#REF!)","v":{"$error":"#REF!"}}]
[{"$f":"IF('Наш прайс'!#REF!=0,\"\",'Наш прайс'!#REF!)","v":{"$error":"#REF!"}},{"$f":"IF('Наш прайс'!#REF!=0,\"\",'Наш прайс'!#REF!)","v":{"$error":"#REF!"}},{"$f":"IF('Наш прайс'!#REF!=0,\"\",'Наш прайс'!#REF!)","v":{"$error":"#REF!"}},{"$error":"#REF!"},null,null,{"$f":"IF('Наш прайс'!#REF!=0,\"\",'Наш прайс'!#REF!)","v":{"$error":"#REF!"}},{"$f":"IF('Наш прайс'!#REF!=0,\"\",'Наш прайс'!#REF!)","v":{"$error":"#REF!"}},{"$f":"IF('Наш прайс'!#REF!=0,\"\",'Наш прайс'!#REF!)","v":{"$error":"#REF!"}},{"$f":"IF('Наш прайс'!#REF!=0,\"\",'Наш прайс'!#REF!)","v":{"$error":"#REF!"}},{"$f":"IF('Наш прайс'!#REF!=0,\"\",'Наш прайс'!#REF!)","v":{"$error":"#REF!"}},{"$f":"IF('Наш прайс'!#REF!=0,\"\",'Наш прайс'!#REF!)","v":{"$error":"#REF!"}},{"$f":"IF('Наш прайс'!#REF!=0,\"\",'Наш прайс'!#REF!)","v":{"$error":"#REF!"}}]
[{"$f":"IF('Наш прайс'!#REF!=0,\"\",'Наш прайс'!#REF!)","v":{"$error":"#REF!"}},{"$f":"IF('Наш прайс'!#REF!=0,\"\",'Наш прайс'!#REF!)","v":{"$error":"#REF!"}},{"$f":"IF('Наш прайс'!#REF!=0,\"\",'Наш прайс'!#REF!)","v":{"$error":"#REF!"}},{"$error":"#REF!"},null,null,{"$f":"IF('Наш прайс'!#REF!=0,\"\",'Наш прайс'!#REF!)","v":{"$error":"#REF!"}},{"$f":"IF('Наш прайс'!#REF!=0,\"\",'Наш прайс'!#REF!)","v":{"$error":"#REF!"}},{"$f":"IF('Наш прайс'!#REF!=0,\"\",'Наш прайс'!#REF!)","v":{"$error":"#REF!"}},{"$f":"IF('Наш прайс'!#REF!=0,\"\",'Наш прайс'!#REF!)","v":{"$error":"#REF!"}},{"$f":"IF('Наш прайс'!#REF!=0,\"\",'Наш прайс'!#REF!)","v":{"$error":"#REF!"}},{"$f":"IF('Наш прайс'!#REF!=0,\"\",'Наш прайс'!#REF!)","v":{"$error":"#REF!"}},{"$f":"IF('Наш прайс'!#REF!=0,\"\",'Наш прайс'!#REF!)","v":{"$error":"#REF!"}}]
[{"$f":"IF('Наш прайс'!#REF!=0,\"\",'Наш прайс'!#REF!)","v":{"$error":"#REF!"}},{"$f":"IF('Наш прайс'!#REF!=0,\"\",'Наш прайс'!#REF!)","v":{"$error":"#REF!"}},{"$f":"IF('Наш прайс'!#REF!=0,\"\",'Наш прайс'!#REF!)","v":{"$error":"#REF!"}},{"$error":"#REF!"},null,null,{"$f":"IF('Наш прайс'!#REF!=0,\"\",'Наш прайс'!#REF!)","v":{"$error":"#REF!"}},{"$f":"IF('Наш прайс'!#REF!=0,\"\",'Наш прайс'!#REF!)","v":{"$error":"#REF!"}},{"$f":"IF('Наш прайс'!#REF!=0,\"\",'Наш прайс'!#REF!)","v":{"$error":"#REF!"}},{"$f":"IF('Наш прайс'!#REF!=0,\"\",'Наш прайс'!#REF!)","v":{"$error":"#REF!"}},{"$f":"IF('Наш прайс'!#REF!=0,\"\",'Наш прайс'!#REF!)","v":{"$error":"#REF!"}},{"$f":"IF('Наш прайс'!#REF!=0,\"\",'Наш прайс'!#REF!)","v":{"$error":"#REF!"}},{"$f":"IF('Наш прайс'!#REF!=0,\"\",'Наш прайс'!#REF!)","v":{"$error":"#REF!"}}]
[{"$f":"IF('Наш прайс'!#REF!=0,\"\",'Наш прайс'!#REF!)","v":{"$error":"#REF!"}},{"$f":"IF('Наш прайс'!#REF!=0,\"\",'Наш прайс'!#REF!)","v":{"$error":"#REF!"}},{"$f":"IF('Наш прайс'!#REF!=0,\"\",'Наш прайс'!#REF!)","v":{"$error":"#REF!"}},{"$error":"#REF!"},null,null,{"$f":"IF('Наш прайс'!#REF!=0,\"\",'Наш прайс'!#REF!)","v":{"$error":"#REF!"}},{"$f":"IF('Наш прайс'!#REF!=0,\"\",'Наш прайс'!#REF!)","v":{"$error":"#REF!"}},{"$f":"IF('Наш прайс'!#REF!=0,\"\",'Наш прайс'!#REF!)","v":{"$error":"#REF!"}},{"$f":"IF('Наш прайс'!#REF!=0,\"\",'Наш прайс'!#REF!)","v":{"$error":"#REF!"}},{"$f":"IF('Наш прайс'!#REF!=0,\"\",'Наш прайс'!#REF!)","v":{"$error":"#REF!"}},{"$f":"IF('Наш прайс'!#REF!=0,\"\",'Наш прайс'!#REF!)","v":{"$error":"#REF!"}},{"$f":"IF('Наш прайс'!#REF!=0,\"\",'Наш прайс'!#REF!)","v":{"$error":"#REF!"}}]
[{"$f":"IF('Наш прайс'!#REF!=0,\"\",'Наш прайс'!#REF!)","v":{"$error":"#REF!"}},{"$f":"IF('Наш прайс'!#REF!=0,\"\",'Наш прайс'!#REF!)","v":{"$error":"#REF!"}},{"$f":"IF('Наш прайс'!#REF!=0,\"\",'Наш прайс'!#REF!)","v":{"$error":"#REF!"}},{"$error":"#REF!"},null,null,{"$f":"IF('Наш прайс'!#REF!=0,\"\",'Наш прайс'!#REF!)","v":{"$error":"#REF!"}},{"$f":"IF('Наш прайс'!#REF!=0,\"\",'Наш прайс'!#REF!)","v":{"$error":"#REF!"}},{"$f":"IF('Наш прайс'!#REF!=0,\"\",'Наш прайс'!#REF!)","v":{"$error":"#REF!"}},{"$f":"IF('Наш прайс'!#REF!=0,\"\",'Наш прайс'!#REF!)","v":{"$error":"#REF!"}},{"$f":"IF('Наш прайс'!#REF!=0,\"\",'Наш прайс'!#REF!)","v":{"$error":"#REF!"}},{"$f":"IF('Наш прайс'!#REF!=0,\"\",'Наш прайс'!#REF!)","v":{"$error":"#REF!"}},{"$f":"IF('Наш прайс'!#REF!=0,\"\",'Наш прайс'!#REF!)","v":{"$error":"#REF!"}}]
[{"$f":"IF('Наш прайс'!#REF!=0,\"\",'Наш прайс'!#REF!)","v":{"$error":"#REF!"}},{"$f":"IF('Наш прайс'!#REF!=0,\"\",'Наш прайс'!#REF!)","v":{"$error":"#REF!"}},{"$f":"IF('Наш прайс'!#REF!=0,\"\",'Наш прайс'!#REF!)","v":{"$error":"#REF!"}},{"$error":"#REF!"},null,null,{"$f":"IF('Наш прайс'!#REF!=0,\"\",'Наш прайс'!#REF!)","v":{"$error":"#REF!"}},{"$f":"IF('Наш прайс'!#REF!=0,\"\",'Наш прайс'!#REF!)","v":{"$error":"#REF!"}},{"$f":"IF('Наш прайс'!#REF!=0,\"\",'Наш прайс'!#REF!)","v":{"$error":"#REF!"}},{"$f":"IF('Наш прайс'!#REF!=0,\"\",'Наш прайс'!#REF!)","v":{"$error":"#REF!"}},{"$f":"IF('Наш прайс'!#REF!=0,\"\",'Наш прайс'!#REF!)","v":{"$error":"#REF!"}},{"$f":"IF('Наш прайс'!#REF!=0,\"\",'Наш прайс'!#REF!)","v":{"$error":"#REF!"}},{"$f":"IF('Наш прайс'!#REF!=0,\"\",'Наш прайс'!#REF!)","v":{"$error":"#REF!"}}]
[{"$f":"IF('Наш прайс'!#REF!=0,\"\",'Наш прайс'!#REF!)","v":{"$error":"#REF!"}},{"$f":"IF('Наш прайс'!#REF!=0,\"\",'Наш прайс'!#REF!)","v":{"$error":"#REF!"}},{"$f":"IF('Наш прайс'!#REF!=0,\"\",'Наш прайс'!#REF!)","v":{"$error":"#REF!"}},{"$error":"#REF!"},null,null,{"$f":"IF('Наш прайс'!#REF!=0,\"\",'Наш прайс'!#REF!)","v":{"$error":"#REF!"}},{"$f":"IF('Наш прайс'!#REF!=0,\"\",'Наш прайс'!#REF!)","v":{"$error":"#REF!"}},{"$f":"IF('Наш прайс'!#REF!=0,\"\",'Наш прайс'!#REF!)","v":{"$error":"#REF!"}},{"$f":"IF('Наш прайс'!#REF!=0,\"\",'Наш прайс'!#REF!)","v":{"$error":"#REF!"}},{"$f":"IF('Наш прайс'!#REF!=0,\"\",'Наш прайс'!#REF!)","v":{"$error":"#REF!"}},{"$f":"IF('Наш прайс'!#REF!=0,\"\",'Наш прайс'!#REF!)","v":{"$error":"#REF!"}},{"$f":"IF('Наш прайс'!#REF!=0,\"\",'Наш прайс'!#REF!)","v":{"$error":"#REF!"}}]
[{"$f":"IF('Наш прайс'!#REF!=0,\"\",'Наш прайс'!#REF!)","v":{"$error":"#REF!"}},{"$f":"IF('Наш прайс'!#REF!=0,\"\",'Наш прайс'!#REF!)","v":{"$error":"#REF!"}},{"$f":"IF('Наш прайс'!#REF!=0,\"\",'Наш прайс'!#REF!)","v":{"$error":"#REF!"}},{"$error":"#REF!"},null,null,{"$f":"IF('Наш прайс'!#REF!=0,\"\",'Наш прайс'!#REF!)","v":{"$error":"#REF!"}},{"$f":"IF('Наш прайс'!#REF!=0,\"\",'Наш прайс'!#REF!)","v":{"$error":"#REF!"}},{"$f":"IF('Наш прайс'!#REF!=0,\"\",'Наш прайс'!#REF!)","v":{"$error":"#REF!"}},{"$f":"IF('Наш прайс'!#REF!=0,\"\",'Наш прайс'!#REF!)","v":{"$error":"#REF!"}},{"$f":"IF('Наш прайс'!#REF!=0,\"\",'Наш прайс'!#REF!)","v":{"$error":"#REF!"}},{"$f":"IF('Наш прайс'!#REF!=0,\"\",'Наш прайс'!#REF!)","v":{"$error":"#REF!"}},{"$f":"IF('Наш прайс'!#REF!=0,\"\",'Наш прайс'!#REF!)","v":{"$error":"#REF!"}}]
[{"$f":"IF('Наш прайс'!#REF!=0,\"\",'Наш прайс'!#REF!)","v":{"$error":"#REF!"}},{"$f":"IF('Наш прайс'!#REF!=0,\"\",'Наш прайс'!#REF!)","v":{"$error":"#REF!"}},{"$f":"IF('Наш прайс'!#REF!=0,\"\",'Наш прайс'!#REF!)","v":{"$error":"#REF!"}},{"$error":"#REF!"},null,null,{"$f":"IF('Наш прайс'!#REF!=0,\"\",'Наш прайс'!#REF!)","v":{"$error":"#REF!"}},{"$f":"IF('Наш прайс'!#REF!=0,\"\",'Наш прайс'!#REF!)","v":{"$error":"#REF!"}},{"$f":"IF('Наш прайс'!#REF!=0,\"\",'Наш прайс'!#REF!)","v":{"$error":"#REF!"}},{"$f":"IF('Наш прайс'!#REF!=0,\"\",'Наш прайс'!#REF!)","v":{"$error":"#REF!"}},{"$f":"IF('Наш прайс'!#REF!=0,\"\",'Наш прайс'!#REF!)","v":{"$error":"#REF!"}},{"$f":"IF('Наш прайс'!#REF!=0,\"\",'Наш прайс'!#REF!)","v":{"$error":"#REF!"}},{"$f":"IF('Наш прайс'!#REF!=0,\"\",'Наш прайс'!#REF!)","v":{"$error":"#REF!"}}]
[{"$f":"IF('Наш прайс'!#REF!=0,\"\",'Наш прайс'!#REF!)","v":{"$error":"#REF!"}},{"$f":"IF('Наш прайс'!#REF!=0,\"\",'Наш прайс'!#REF!)","v":{"$error":"#REF!"}},{"$f":"IF('Наш прайс'!#REF!=0,\"\",'Наш прайс'!#REF!)","v":{"$error":"#REF!"}},{"$error":"#REF!"},null,null,{"$f":"IF('Наш прайс'!#REF!=0,\"\",'Наш прайс'!#REF!)","v":{"$error":"#REF!"}},{"$f":"IF('Наш прайс'!#REF!=0,\"\",'Наш прайс'!#REF!)","v":{"$error":"#REF!"}},{"$f":"IF('Наш прайс'!#REF!=0,\"\",'Наш прайс'!#REF!)","v":{"$error":"#REF!"}},{"$f":"IF('Наш прайс'!#REF!=0,\"\",'Наш прайс'!#REF!)","v":{"$error":"#REF!"}},{"$f":"IF('Наш прайс'!#REF!=0,\"\",'Наш прайс'!#REF!)","v":{"$error":"#REF!"}},{"$f":"IF('Наш прайс'!#REF!=0,\"\",'Наш прайс'!#REF!)","v":{"$error":"#REF!"}},{"$f":"IF('Наш прайс'!#REF!=0,\"\",'Наш прайс'!#REF!)","v":{"$error":"#REF!"}}]
[{"$f":"IF('Наш прайс'!#REF!=0,\"\",'Наш прайс'!#REF!)","v":{"$error":"#REF!"}},{"$f":"IF('Наш прайс'!#REF!=0,\"\",'Наш прайс'!#REF!)","v":{"$error":"#REF!"}},{"$f":"IF('Наш прайс'!#REF!=0,\"\",'Наш прайс'!#REF!)","v":{"$error":"#REF!"}},{"$error":"#REF!"},null,null,{"$f":"IF('Наш прайс'!#REF!=0,\"\",'Наш прайс'!#REF!)","v":{"$error":"#REF!"}},{"$f":"IF('Наш прайс'!#REF!=0,\"\",'Наш прайс'!#REF!)","v":{"$error":"#REF!"}},{"$f":"IF('Наш прайс'!#REF!=0,\"\",'Наш прайс'!#REF!)","v":{"$error":"#REF!"}},{"$f":"IF('Наш прайс'!#REF!=0,\"\",'Наш прайс'!#REF!)","v":{"$error":"#REF!"}},{"$f":"IF('Наш прайс'!#REF!=0,\"\",'Наш прайс'!#REF!)","v":{"$error":"#REF!"}},{"$f":"IF('Наш прайс'!#REF!=0,\"\",'Наш прайс'!#REF!)","v":{"$error":"#REF!"}},{"$f":"IF('Наш прайс'!#REF!=0,\"\",'Наш прайс'!#REF!)","v":{"$error":"#REF!"}}]
[{"$f":"IF('Наш прайс'!#REF!=0,\"\",'Наш прайс'!#REF!)","v":{"$error":"#REF!"}},{"$f":"IF('Наш прайс'!#REF!=0,\"\",'Наш прайс'!#REF!)","v":{"$error":"#REF!"}},{"$f":"IF('Наш прайс'!#REF!=0,\"\",'Наш прайс'!#REF!)","v":{"$error":"#REF!"}},{"$error":"#REF!"},null,null,{"$f":"IF('Наш прайс'!#REF!=0,\"\",'Наш прайс'!#REF!)","v":{"$error":"#REF!"}},{"$f":"IF('Наш прайс'!#REF!=0,\"\",'Наш прайс'!#REF!)","v":{"$error":"#REF!"}},{"$f":"IF('Наш прайс'!#REF!=0,\"\",'Наш прайс'!#REF!)","v":{"$error":"#REF!"}},{"$f":"IF('Наш прайс'!#REF!=0,\"\",'Наш прайс'!#REF!)","v":{"$error":"#REF!"}},{"$f":"IF('Наш прайс'!#REF!=0,\"\",'Наш прайс'!#REF!)","v":{"$error":"#REF!"}},{"$f":"IF('Наш прайс'!#REF!=0,\"\",'Наш прайс'!#REF!)","v":{"$error":"#REF!"}},{"$f":"IF('Наш прайс'!#REF!=0,\"\",'Наш прайс'!#REF!)","v":{"$error":"#REF!"}}]
[{"$f":"IF('Наш прайс'!#REF!=0,\"\",'Наш прайс'!#REF!)","v":{"$error":"#REF!"}},{"$f":"IF('Наш прайс'!#REF!=0,\"\",'Наш прайс'!#REF!)","v":{"$error":"#REF!"}},{"$f":"IF('Наш прайс'!#REF!=0,\"\",'Наш прайс'!#REF!)","v":{"$error":"#REF!"}},{"$error":"#REF!"},null,null,{"$f":"IF('Наш прайс'!#REF!=0,\"\",'Наш прайс'!#REF!)","v":{"$error":"#REF!"}},{"$f":"IF('Наш прайс'!#REF!=0,\"\",'Наш прайс'!#REF!)","v":{"$error":"#REF!"}},{"$f":"IF('Наш прайс'!#REF!=0,\"\",'Наш прайс'!#REF!)","v":{"$error":"#REF!"}},{"$f":"IF('Наш прайс'!#REF!=0,\"\",'Наш прайс'!#REF!)","v":{"$error":"#REF!"}},{"$f":"IF('Наш прайс'!#REF!=0,\"\",'Наш прайс'!#REF!)","v":{"$error":"#REF!"}},{"$f":"IF('Наш прайс'!#REF!=0,\"\",'Наш прайс'!#REF!)","v":{"$error":"#REF!"}},{"$f":"IF('Наш прайс'!#REF!=0,\"\",'Наш прайс'!#REF!)","v":{"$error":"#REF!"}}]
[{"$f":"IF('Наш прайс'!#REF!=0,\"\",'Наш прайс'!#REF!)","v":{"$error":"#REF!"}},{"$f":"IF('Наш прайс'!#REF!=0,\"\",'Наш прайс'!#REF!)","v":{"$error":"#REF!"}},{"$f":"IF('Наш прайс'!#REF!=0,\"\",'Наш прайс'!#REF!)","v":{"$error":"#REF!"}},{"$error":"#REF!"},null,null,{"$f":"IF('Наш прайс'!#REF!=0,\"\",'Наш прайс'!#REF!)","v":{"$error":"#REF!"}},{"$f":"IF('Наш прайс'!#REF!=0,\"\",'Наш прайс'!#REF!)","v":{"$error":"#REF!"}},{"$f":"IF('Наш прайс'!#REF!=0,\"\",'Наш прайс'!#REF!)","v":{"$error":"#REF!"}},{"$f":"IF('Наш прайс'!#REF!=0,\"\",'Наш прайс'!#REF!)","v":{"$error":"#REF!"}},{"$f":"IF('Наш прайс'!#REF!=0,\"\",'Наш прайс'!#REF!)","v":{"$error":"#REF!"}},{"$f":"IF('Наш прайс'!#REF!=0,\"\",'Наш прайс'!#REF!)","v":{"$error":"#REF!"}},{"$f":"IF('Наш прайс'!#REF!=0,\"\",'Наш прайс'!#REF!)","v":{"$error":"#REF!"}}]
[{"$f":"IF('Наш прайс'!#REF!=0,\"\",'Наш прайс'!#REF!)","v":{"$error":"#REF!"}},{"$f":"IF('Наш прайс'!#REF!=0,\"\",'Наш прайс'!#REF!)","v":{"$error":"#REF!"}},{"$f":"IF('Наш прайс'!#REF!=0,\"\",'Наш прайс'!#REF!)","v":{"$error":"#REF!"}},{"$error":"#REF!"},null,null,{"$f":"IF('Наш прайс'!#REF!=0,\"\",'Наш прайс'!#REF!)","v":{"$error":"#REF!"}},{"$f":"IF('Наш прайс'!#REF!=0,\"\",'Наш прайс'!#REF!)","v":{"$error":"#REF!"}},{"$f":"IF('Наш прайс'!#REF!=0,\"\",'Наш прайс'!#REF!)","v":{"$error":"#REF!"}},{"$f":"IF('Наш прайс'!#REF!=0,\"\",'Наш прайс'!#REF!)","v":{"$error":"#REF!"}},{"$f":"IF('Наш прайс'!#REF!=0,\"\",'Наш прайс'!#REF!)","v":{"$error":"#REF!"}},{"$f":"IF('Наш прайс'!#REF!=0,\"\",'Наш прайс'!#REF!)","v":{"$error":"#REF!"}},{"$f":"IF('Наш прайс'!#REF!=0,\"\",'Наш прайс'!#REF!)","v":{"$error":"#REF!"}}]
[{"$f":"IF('Наш прайс'!#REF!=0,\"\",'Наш прайс'!#REF!)","v":{"$error":"#REF!"}},{"$f":"IF('Наш прайс'!#REF!=0,\"\",'Наш прайс'!#REF!)","v":{"$error":"#REF!"}},{"$f":"IF('Наш прайс'!#REF!=0,\"\",'Наш прайс'!#REF!)","v":{"$error":"#REF!"}},{"$error":"#REF!"},null,null,{"$f":"IF('Наш прайс'!#REF!=0,\"\",'Наш прайс'!#REF!)","v":{"$error":"#REF!"}},{"$f":"IF('Наш прайс'!#REF!=0,\"\",'Наш прайс'!#REF!)","v":{"$error":"#REF!"}},{"$f":"IF('Наш прайс'!#REF!=0,\"\",'Наш прайс'!#REF!)","v":{"$error":"#REF!"}},{"$f":"IF('Наш прайс'!#REF!=0,\"\",'Наш прайс'!#REF!)","v":{"$error":"#REF!"}},{"$f":"IF('Наш прайс'!#REF!=0,\"\",'Наш прайс'!#REF!)","v":{"$error":"#REF!"}},{"$f":"IF('Наш прайс'!#REF!=0,\"\",'Наш прайс'!#REF!)","v":{"$error":"#REF!"}},{"$f":"IF('Наш прайс'!#REF!=0,\"\",'Наш прайс'!#REF!)","v":{"$error":"#REF!"}}]
[{"$f":"IF('Наш прайс'!#REF!=0,\"\",'Наш прайс'!#REF!)","v":{"$error":"#REF!"}},{"$f":"IF('Наш прайс'!#REF!=0,\"\",'Наш прайс'!#REF!)","v":{"$error":"#REF!"}},{"$f":"IF('Наш прайс'!#REF!=0,\"\",'Наш прайс'!#REF!)","v":{"$error":"#REF!"}},{"$error":"#REF!"},null,null,{"$f":"IF('Наш прайс'!#REF!=0,\"\",'Наш прайс'!#REF!)","v":{"$error":"#REF!"}},{"$f":"IF('Наш прайс'!#REF!=0,\"\",'Наш прайс'!#REF!)","v":{"$error":"#REF!"}},{"$f":"IF('Наш прайс'!#REF!=0,\"\",'Наш прайс'!#REF!)","v":{"$error":"#REF!"}},{"$f":"IF('Наш прайс'!#REF!=0,\"\",'Наш прайс'!#REF!)","v":{"$error":"#REF!"}},{"$f":"IF('Наш прайс'!#REF!=0,\"\",'Наш прайс'!#REF!)","v":{"$error":"#REF!"}},{"$f":"IF('Наш прайс'!#REF!=0,\"\",'Наш прайс'!#REF!)","v":{"$error":"#REF!"}},{"$f":"IF('Наш прайс'!#REF!=0,\"\",'Наш прайс'!#REF!)","v":{"$error":"#REF!"}}]
[{"$f":"IF('Наш прайс'!#REF!=0,\"\",'Наш прайс'!#REF!)","v":{"$error":"#REF!"}},{"$f":"IF('Наш прайс'!#REF!=0,\"\",'Наш прайс'!#REF!)","v":{"$error":"#REF!"}},{"$f":"IF('Наш прайс'!#REF!=0,\"\",'Наш прайс'!#REF!)","v":{"$error":"#REF!"}},{"$error":"#REF!"},null,null,{"$f":"IF('Наш прайс'!#REF!=0,\"\",'Наш прайс'!#REF!)","v":{"$error":"#REF!"}},{"$f":"IF('Наш прайс'!#REF!=0,\"\",'Наш прайс'!#REF!)","v":{"$error":"#REF!"}},{"$f":"IF('Наш прайс'!#REF!=0,\"\",'Наш прайс'!#REF!)","v":{"$error":"#REF!"}},{"$f":"IF('Наш прайс'!#REF!=0,\"\",'Наш прайс'!#REF!)","v":{"$error":"#REF!"}},{"$f":"IF('Наш прайс'!#REF!=0,\"\",'Наш прайс'!#REF!)","v":{"$error":"#REF!"}},{"$f":"IF('Наш прайс'!#REF!=0,\"\",'Наш прайс'!#REF!)","v":{"$error":"#REF!"}},{"$f":"IF('Наш прайс'!#REF!=0,\"\",'Наш прайс'!#REF!)","v":{"$error":"#REF!"}}]
[{"$f":"IF('Наш прайс'!#REF!=0,\"\",'Наш прайс'!#REF!)","v":{"$error":"#REF!"}},{"$f":"IF('Наш прайс'!#REF!=0,\"\",'Наш прайс'!#REF!)","v":{"$error":"#REF!"}},{"$f":"IF('Наш прайс'!#REF!=0,\"\",'Наш прайс'!#REF!)","v":{"$error":"#REF!"}},{"$error":"#REF!"},null,null,{"$f":"IF('Наш прайс'!#REF!=0,\"\",'Наш прайс'!#REF!)","v":{"$error":"#REF!"}},{"$f":"IF('Наш прайс'!#REF!=0,\"\",'Наш прайс'!#REF!)","v":{"$error":"#REF!"}},{"$f":"IF('Наш прайс'!#REF!=0,\"\",'Наш прайс'!#REF!)","v":{"$error":"#REF!"}},{"$f":"IF('Наш прайс'!#REF!=0,\"\",'Наш прайс'!#REF!)","v":{"$error":"#REF!"}},{"$f":"IF('Наш прайс'!#REF!=0,\"\",'Наш прайс'!#REF!)","v":{"$error":"#REF!"}},{"$f":"IF('Наш прайс'!#REF!=0,\"\",'Наш прайс'!#REF!)","v":{"$error":"#REF!"}},{"$f":"IF('Наш прайс'!#REF!=0,\"\",'Наш прайс'!#REF!)","v":{"$error":"#REF!"}}]
[{"$f":"IF('Наш прайс'!#REF!=0,\"\",'Наш прайс'!#REF!)","v":{"$error":"#REF!"}},{"$f":"IF('Наш прайс'!#REF!=0,\"\",'Наш прайс'!#REF!)","v":{"$error":"#REF!"}},{"$f":"IF('Наш прайс'!#REF!=0,\"\",'Наш прайс'!#REF!)","v":{"$error":"#REF!"}},{"$error":"#REF!"},null,null,{"$f":"IF('Наш прайс'!#REF!=0,\"\",'Наш прайс'!#REF!)","v":{"$error":"#REF!"}},{"$f":"IF('Наш прайс'!#REF!=0,\"\",'Наш прайс'!#REF!)","v":{"$error":"#REF!"}},{"$f":"IF('Наш прайс'!#REF!=0,\"\",'Наш прайс'!#REF!)","v":{"$error":"#REF!"}},{"$f":"IF('Наш прайс'!#REF!=0,\"\",'Наш прайс'!#REF!)","v":{"$error":"#REF!"}},{"$f":"IF('Наш прайс'!#REF!=0,\"\",'Наш прайс'!#REF!)","v":{"$error":"#REF!"}},{"$f":"IF('Наш прайс'!#REF!=0,\"\",'Наш прайс'!#REF!)","v":{"$error":"#REF!"}},{"$f":"IF('Наш прайс'!#REF!=0,\"\",'Наш прайс'!#REF!)","v":{"$error":"#REF!"}}]
[{"$f":"IF('Наш прайс'!#REF!=0,\"\",'Наш прайс'!#REF!)","v":{"$error":"#REF!"}},{"$f":"IF('Наш прайс'!#REF!=0,\"\",'Наш прайс'!#REF!)","v":{"$error":"#REF!"}},{"$f":"IF('Наш прайс'!#REF!=0,\"\",'Наш прайс'!#REF!)","v":{"$error":"#REF!"}},{"$error":"#REF!"},null,null,{"$f":"IF('Наш прайс'!#REF!=0,\"\",'Наш прайс'!#REF!)","v":{"$error":"#REF!"}},{"$f":"IF('Наш прайс'!#REF!=0,\"\",'Наш прайс'!#REF!)","v":{"$error":"#REF!"}},{"$f":"IF('Наш прайс'!#REF!=0,\"\",'Наш прайс'!#REF!)","v":{"$error":"#REF!"}},{"$f":"IF('Наш прайс'!#REF!=0,\"\",'Наш прайс'!#REF!)","v":{"$error":"#REF!"}},{"$f":"IF('Наш прайс'!#REF!=0,\"\",'Наш прайс'!#REF!)","v":{"$error":"#REF!"}},{"$f":"IF('Наш прайс'!#REF!=0,\"\",'Наш прайс'!#REF!)","v":{"$error":"#REF!"}},{"$f":"IF('Наш прайс'!#REF!=0,\"\",'Наш прайс'!#REF!)","v":{"$error":"#REF!"}}]
[{"$f":"IF('Наш прайс'!#REF!=0,\"\",'Наш прайс'!#REF!)","v":{"$error":"#REF!"}},{"$f":"IF('Наш прайс'!#REF!=0,\"\",'Наш прайс'!#REF!)","v":{"$error":"#REF!"}},{"$f":"IF('Наш прайс'!#REF!=0,\"\",'Наш прайс'!#REF!)","v":{"$error":"#REF!"}},{"$error":"#REF!"},null,null,{"$f":"IF('Наш прайс'!#REF!=0,\"\",'Наш прайс'!#REF!)","v":{"$error":"#REF!"}},{"$f":"IF('Наш прайс'!#REF!=0,\"\",'Наш прайс'!#REF!)","v":{"$error":"#REF!"}},{"$f":"IF('Наш прайс'!#REF!=0,\"\",'Наш прайс'!#REF!)","v":{"$error":"#REF!"}},{"$f":"IF('Наш прайс'!#REF!=0,\"\",'Наш прайс'!#REF!)","v":{"$error":"#REF!"}},{"$f":"IF('Наш прайс'!#REF!=0,\"\",'Наш прайс'!#REF!)","v":{"$error":"#REF!"}},{"$f":"IF('Наш прайс'!#REF!=0,\"\",'Наш прайс'!#REF!)","v":{"$error":"#REF!"}},{"$f":"IF('Наш прайс'!#REF!=0,\"\",'Наш прайс'!#REF!)","v":{"$error":"#REF!"}}]
[{"$f":"IF('Наш прайс'!#REF!=0,\"\",'Наш прайс'!#REF!)","v":{"$error":"#REF!"}},{"$f":"IF('Наш прайс'!#REF!=0,\"\",'Наш прайс'!#REF!)","v":{"$error":"#REF!"}},{"$f":"IF('Наш прайс'!#REF!=0,\"\",'Наш прайс'!#REF!)","v":{"$error":"#REF!"}},{"$error":"#REF!"},null,null,{"$f":"IF('Наш прайс'!#REF!=0,\"\",'Наш прайс'!#REF!)","v":{"$error":"#REF!"}},{"$f":"IF('Наш прайс'!#REF!=0,\"\",'Наш прайс'!#REF!)","v":{"$error":"#REF!"}},{"$f":"IF('Наш прайс'!#REF!=0,\"\",'Наш прайс'!#REF!)","v":{"$error":"#REF!"}},{"$f":"IF('Наш прайс'!#REF!=0,\"\",'Наш прайс'!#REF!)","v":{"$error":"#REF!"}},{"$f":"IF('Наш прайс'!#REF!=0,\"\",'Наш прайс'!#REF!)","v":{"$error":"#REF!"}},{"$f":"IF('Наш прайс'!#REF!=0,\"\",'Наш прайс'!#REF!)","v":{"$error":"#REF!"}},{"$f":"IF('Наш прайс'!#REF!=0,\"\",'Наш прайс'!#REF!)","v":{"$error":"#REF!"}}]
[{"$f":"IF('Наш прайс'!#REF!=0,\"\",'Наш прайс'!#REF!)","v":{"$error":"#REF!"}},{"$f":"IF('Наш прайс'!#REF!=0,\"\",'Наш прайс'!#REF!)","v":{"$error":"#REF!"}},{"$f":"IF('Наш прайс'!#REF!=0,\"\",'Наш прайс'!#REF!)","v":{"$error":"#REF!"}},{"$error":"#REF!"},null,null,{"$f":"IF('Наш прайс'!#REF!=0,\"\",'Наш прайс'!#REF!)","v":{"$error":"#REF!"}},{"$f":"IF('Наш прайс'!#REF!=0,\"\",'Наш прайс'!#REF!)","v":{"$error":"#REF!"}},{"$f":"IF('Наш прайс'!#REF!=0,\"\",'Наш прайс'!#REF!)","v":{"$error":"#REF!"}},{"$f":"IF('Наш прайс'!#REF!=0,\"\",'Наш прайс'!#REF!)","v":{"$error":"#REF!"}},{"$f":"IF('Наш прайс'!#REF!=0,\"\",'Наш прайс'!#REF!)","v":{"$error":"#REF!"}},{"$f":"IF('Наш прайс'!#REF!=0,\"\",'Наш прайс'!#REF!)","v":{"$error":"#REF!"}},{"$f":"IF('Наш прайс'!#REF!=0,\"\",'Наш прайс'!#REF!)","v":{"$error":"#REF!"}}]
[{"$f":"IF('Наш прайс'!#REF!=0,\"\",'Наш прайс'!#REF!)","v":{"$error":"#REF!"}},{"$f":"IF('Наш прайс'!#REF!=0,\"\",'Наш прайс'!#REF!)","v":{"$error":"#REF!"}},{"$f":"IF('Наш прайс'!#REF!=0,\"\",'Наш прайс'!#REF!)","v":{"$error":"#REF!"}},{"$error":"#REF!"},null,null,{"$f":"IF('Наш прайс'!#REF!=0,\"\",'Наш прайс'!#REF!)","v":{"$error":"#REF!"}},{"$f":"IF('Наш прайс'!#REF!=0,\"\",'Наш прайс'!#REF!)","v":{"$error":"#REF!"}},{"$f":"IF('Наш прайс'!#REF!=0,\"\",'Наш прайс'!#REF!)","v":{"$error":"#REF!"}},{"$f":"IF('Наш прайс'!#REF!=0,\"\",'Наш прайс'!#REF!)","v":{"$error":"#REF!"}},{"$f":"IF('Наш прайс'!#REF!=0,\"\",'Наш прайс'!#REF!)","v":{"$error":"#REF!"}},{"$f":"IF('Наш прайс'!#REF!=0,\"\",'Наш прайс'!#REF!)","v":{"$error":"#REF!"}},{"$f":"IF('Наш прайс'!#REF!=0,\"\",'Наш прайс'!#REF!)","v":{"$error":"#REF!"}}]
[{"$f":"IF('Наш прайс'!#REF!=0,\"\",'Наш прайс'!#REF!)","v":{"$error":"#REF!"}},{"$f":"IF('Наш прайс'!#REF!=0,\"\",'Наш прайс'!#REF!)","v":{"$error":"#REF!"}},{"$f":"IF('Наш прайс'!#REF!=0,\"\",'Наш прайс'!#REF!)","v":{"$error":"#REF!"}},{"$error":"#REF!"},null,null,{"$f":"IF('Наш прайс'!#REF!=0,\"\",'Наш прайс'!#REF!)","v":{"$error":"#REF!"}},{"$f":"IF('Наш прайс'!#REF!=0,\"\",'Наш прайс'!#REF!)","v":{"$error":"#REF!"}},{"$f":"IF('Наш прайс'!#REF!=0,\"\",'Наш прайс'!#REF!)","v":{"$error":"#REF!"}},{"$f":"IF('Наш прайс'!#REF!=0,\"\",'Наш прайс'!#REF!)","v":{"$error":"#REF!"}},{"$f":"IF('Наш прайс'!#REF!=0,\"\",'Наш прайс'!#REF!)","v":{"$error":"#REF!"}},{"$f":"IF('Наш прайс'!#REF!=0,\"\",'Наш прайс'!#REF!)","v":{"$error":"#REF!"}},{"$f":"IF('Наш прайс'!#REF!=0,\"\",'Наш прайс'!#REF!)","v":{"$error":"#REF!"}}]
[{"$f":"IF('Наш прайс'!#REF!=0,\"\",'Наш прайс'!#REF!)","v":{"$error":"#REF!"}},{"$f":"IF('Наш прайс'!#REF!=0,\"\",'Наш прайс'!#REF!)","v":{"$error":"#REF!"}},{"$f":"IF('Наш прайс'!#REF!=0,\"\",'Наш прайс'!#REF!)","v":{"$error":"#REF!"}},{"$error":"#REF!"},null,null,{"$f":"IF('Наш прайс'!#REF!=0,\"\",'Наш прайс'!#REF!)","v":{"$error":"#REF!"}},{"$f":"IF('Наш прайс'!#REF!=0,\"\",'Наш прайс'!#REF!)","v":{"$error":"#REF!"}},{"$f":"IF('Наш прайс'!#REF!=0,\"\",'Наш прайс'!#REF!)","v":{"$error":"#REF!"}},{"$f":"IF('Наш прайс'!#REF!=0,\"\",'Наш прайс'!#REF!)","v":{"$error":"#REF!"}},{"$f":"IF('Наш прайс'!#REF!=0,\"\",'Наш прайс'!#REF!)","v":{"$error":"#REF!"}},{"$f":"IF('Наш прайс'!#REF!=0,\"\",'Наш прайс'!#REF!)","v":{"$error":"#REF!"}},{"$f":"IF('Наш прайс'!#REF!=0,\"\",'Наш прайс'!#REF!)","v":{"$error":"#REF!"}}]
[{"$f":"IF('Наш прайс'!#REF!=0,\"\",'Наш прайс'!#REF!)","v":{"$error":"#REF!"}},{"$f":"IF('Наш прайс'!#REF!=0,\"\",'Наш прайс'!#REF!)","v":{"$error":"#REF!"}},{"$f":"IF('Наш прайс'!#REF!=0,\"\",'Наш прайс'!#REF!)","v":{"$error":"#REF!"}},{"$error":"#REF!"},null,null,{"$f":"IF('Наш прайс'!#REF!=0,\"\",'Наш прайс'!#REF!)","v":{"$error":"#REF!"}},{"$f":"IF('Наш прайс'!#REF!=0,\"\",'Наш прайс'!#REF!)","v":{"$error":"#REF!"}},{"$f":"IF('Наш прайс'!#REF!=0,\"\",'Наш прайс'!#REF!)","v":{"$error":"#REF!"}},{"$f":"IF('Наш прайс'!#REF!=0,\"\",'Наш прайс'!#REF!)","v":{"$error":"#REF!"}},{"$f":"IF('Наш прайс'!#REF!=0,\"\",'Наш прайс'!#REF!)","v":{"$error":"#REF!"}},{"$f":"IF('Наш прайс'!#REF!=0,\"\",'Наш прайс'!#REF!)","v":{"$error":"#REF!"}},{"$f":"IF('Наш прайс'!#REF!=0,\"\",'Наш прайс'!#REF!)","v":{"$error":"#REF!"}}]
[{"$f":"IF('Наш прайс'!#REF!=0,\"\",'Наш прайс'!#REF!)","v":{"$error":"#REF!"}},{"$f":"IF('Наш прайс'!#REF!=0,\"\",'Наш прайс'!#REF!)","v":{"$error":"#REF!"}},{"$f":"IF('Наш прайс'!#REF!=0,\"\",'Наш прайс'!#REF!)","v":{"$error":"#REF!"}},{"$error":"#REF!"},null,null,{"$f":"IF('Наш прайс'!#REF!=0,\"\",'Наш прайс'!#REF!)","v":{"$error":"#REF!"}},{"$f":"IF('Наш прайс'!#REF!=0,\"\",'Наш прайс'!#REF!)","v":{"$error":"#REF!"}},{"$f":"IF('Наш прайс'!#REF!=0,\"\",'Наш прайс'!#REF!)","v":{"$error":"#REF!"}},{"$f":"IF('Наш прайс'!#REF!=0,\"\",'Наш прайс'!#REF!)","v":{"$error":"#REF!"}},{"$f":"IF('Наш прайс'!#REF!=0,\"\",'Наш прайс'!#REF!)","v":{"$error":"#REF!"}},{"$f":"IF('Наш прайс'!#REF!=0,\"\",'Наш прайс'!#REF!)","v":{"$error":"#REF!"}},{"$f":"IF('Наш прайс'!#REF!=0,\"\",'Наш прайс'!#REF!)","v":{"$error":"#REF!"}}]
[{"$f":"IF('Наш прайс'!#REF!=0,\"\",'Наш прайс'!#REF!)","v":{"$error":"#REF!"}},{"$f":"IF('Наш прайс'!#REF!=0,\"\",'Наш прайс'!#REF!)","v":{"$error":"#REF!"}},{"$f":"IF('Наш прайс'!#REF!=0,\"\",'Наш прайс'!#REF!)","v":{"$error":"#REF!"}},{"$error":"#REF!"},null,null,{"$f":"IF('Наш прайс'!#REF!=0,\"\",'Наш прайс'!#REF!)","v":{"$error":"#REF!"}},{"$f":"IF('Наш прайс'!#REF!=0,\"\",'Наш прайс'!#REF!)","v":{"$error":"#REF!"}},{"$f":"IF('Наш прайс'!#REF!=0,\"\",'Наш прайс'!#REF!)","v":{"$error":"#REF!"}},{"$f":"IF('Наш прайс'!#REF!=0,\"\",'Наш прайс'!#REF!)","v":{"$error":"#REF!"}},{"$f":"IF('Наш прайс'!#REF!=0,\"\",'Наш прайс'!#REF!)","v":{"$error":"#REF!"}},{"$f":"IF('Наш прайс'!#REF!=0,\"\",'Наш прайс'!#REF!)","v":{"$error":"#REF!"}},{"$f":"IF('Наш прайс'!#REF!=0,\"\",'Наш прайс'!#REF!)","v":{"$error":"#REF!"}}]
[{"$f":"IF('Наш прайс'!#REF!=0,\"\",'Наш прайс'!#REF!)","v":{"$error":"#REF!"}},{"$f":"IF('Наш прайс'!#REF!=0,\"\",'Наш прайс'!#REF!)","v":{"$error":"#REF!"}},{"$f":"IF('Наш прайс'!#REF!=0,\"\",'Наш прайс'!#REF!)","v":{"$error":"#REF!"}},{"$error":"#REF!"},null,null,{"$f":"IF('Наш прайс'!#REF!=0,\"\",'Наш прайс'!#REF!)","v":{"$error":"#REF!"}},{"$f":"IF('Наш прайс'!#REF!=0,\"\",'Наш прайс'!#REF!)","v":{"$error":"#REF!"}},{"$f":"IF('Наш прайс'!#REF!=0,\"\",'Наш прайс'!#REF!)","v":{"$error":"#REF!"}},{"$f":"IF('Наш прайс'!#REF!=0,\"\",'Наш прайс'!#REF!)","v":{"$error":"#REF!"}},{"$f":"IF('Наш прайс'!#REF!=0,\"\",'Наш прайс'!#REF!)","v":{"$error":"#REF!"}},{"$f":"IF('Наш прайс'!#REF!=0,\"\",'Наш прайс'!#REF!)","v":{"$error":"#REF!"}},{"$f":"IF('Наш прайс'!#REF!=0,\"\",'Наш прайс'!#REF!)","v":{"$error":"#REF!"}}]
[{"$f":"IF('Наш прайс'!#REF!=0,\"\",'Наш прайс'!#REF!)","v":{"$error":"#REF!"}},{"$f":"IF('Наш прайс'!#REF!=0,\"\",'Наш прайс'!#REF!)","v":{"$error":"#REF!"}},{"$f":"IF('Наш прайс'!#REF!=0,\"\",'Наш прайс'!#REF!)","v":{"$error":"#REF!"}},{"$error":"#REF!"},null,null,{"$f":"IF('Наш прайс'!#REF!=0,\"\",'Наш прайс'!#REF!)","v":{"$error":"#REF!"}},{"$f":"IF('Наш прайс'!#REF!=0,\"\",'Наш прайс'!#REF!)","v":{"$error":"#REF!"}},{"$f":"IF('Наш прайс'!#REF!=0,\"\",'Наш прайс'!#REF!)","v":{"$error":"#REF!"}},{"$f":"IF('Наш прайс'!#REF!=0,\"\",'Наш прайс'!#REF!)","v":{"$error":"#REF!"}},{"$f":"IF('Наш прайс'!#REF!=0,\"\",'Наш прайс'!#REF!)","v":{"$error":"#REF!"}},{"$f":"IF('Наш прайс'!#REF!=0,\"\",'Наш прайс'!#REF!)","v":{"$error":"#REF!"}},{"$f":"IF('Наш прайс'!#REF!=0,\"\",'Наш прайс'!#REF!)","v":{"$error":"#REF!"}}]
[{"$f":"IF('Наш прайс'!#REF!=0,\"\",'Наш прайс'!#REF!)","v":{"$error":"#REF!"}},{"$f":"IF('Наш прайс'!#REF!=0,\"\",'Наш прайс'!#REF!)","v":{"$error":"#REF!"}},{"$f":"IF('Наш прайс'!#REF!=0,\"\",'Наш прайс'!#REF!)","v":{"$error":"#REF!"}},{"$error":"#REF!"},null,null,{"$f":"IF('Наш прайс'!#REF!=0,\"\",'Наш прайс'!#REF!)","v":{"$error":"#REF!"}},{"$f":"IF('Наш прайс'!#REF!=0,\"\",'Наш прайс'!#REF!)","v":{"$error":"#REF!"}},{"$f":"IF('Наш прайс'!#REF!=0,\"\",'Наш прайс'!#REF!)","v":{"$error":"#REF!"}},{"$f":"IF('Наш прайс'!#REF!=0,\"\",'Наш прайс'!#REF!)","v":{"$error":"#REF!"}},{"$f":"IF('Наш прайс'!#REF!=0,\"\",'Наш прайс'!#REF!)","v":{"$error":"#REF!"}},{"$f":"IF('Наш прайс'!#REF!=0,\"\",'Наш прайс'!#REF!)","v":{"$error":"#REF!"}},{"$f":"IF('Наш прайс'!#REF!=0,\"\",'Наш прайс'!#REF!)","v":{"$error":"#REF!"}}]
[{"$f":"IF('Наш прайс'!#REF!=0,\"\",'Наш прайс'!#REF!)","v":{"$error":"#REF!"}},{"$f":"IF('Наш прайс'!#REF!=0,\"\",'Наш прайс'!#REF!)","v":{"$error":"#REF!"}},{"$f":"IF('Наш прайс'!#REF!=0,\"\",'Наш прайс'!#REF!)","v":{"$error":"#REF!"}},{"$error":"#REF!"},null,null,{"$f":"IF('Наш прайс'!#REF!=0,\"\",'Наш прайс'!#REF!)","v":{"$error":"#REF!"}},{"$f":"IF('Наш прайс'!#REF!=0,\"\",'Наш прайс'!#REF!)","v":{"$error":"#REF!"}},{"$f":"IF('Наш прайс'!#REF!=0,\"\",'Наш прайс'!#REF!)","v":{"$error":"#REF!"}},{"$f":"IF('Наш прайс'!#REF!=0,\"\",'Наш прайс'!#REF!)","v":{"$error":"#REF!"}},{"$f":"IF('Наш прайс'!#REF!=0,\"\",'Наш прайс'!#REF!)","v":{"$error":"#REF!"}},{"$f":"IF('Наш прайс'!#REF!=0,\"\",'Наш прайс'!#REF!)","v":{"$error":"#REF!"}},{"$f":"IF('Наш прайс'!#REF!=0,\"\",'Наш прайс'!#REF!)","v":{"$error":"#REF!"}}]
[{"$f":"IF('Наш прайс'!#REF!=0,\"\",'Наш прайс'!#REF!)","v":{"$error":"#REF!"}},{"$f":"IF('Наш прайс'!#REF!=0,\"\",'Наш прайс'!#REF!)","v":{"$error":"#REF!"}},{"$f":"IF('Наш прайс'!#REF!=0,\"\",'Наш прайс'!#REF!)","v":{"$error":"#REF!"}},{"$error":"#REF!"},null,null,{"$f":"IF('Наш прайс'!#REF!=0,\"\",'Наш прайс'!#REF!)","v":{"$error":"#REF!"}},{"$f":"IF('Наш прайс'!#REF!=0,\"\",'Наш прайс'!#REF!)","v":{"$error":"#REF!"}},{"$f":"IF('Наш прайс'!#REF!=0,\"\",'Наш прайс'!#REF!)","v":{"$error":"#REF!"}},{"$f":"IF('Наш прайс'!#REF!=0,\"\",'Наш прайс'!#REF!)","v":{"$error":"#REF!"}},{"$f":"IF('Наш прайс'!#REF!=0,\"\",'Наш прайс'!#REF!)","v":{"$error":"#REF!"}},{"$f":"IF('Наш прайс'!#REF!=0,\"\",'Наш прайс'!#REF!)","v":{"$error":"#REF!"}},{"$f":"IF('Наш прайс'!#REF!=0,\"\",'Наш прайс'!#REF!)","v":{"$error":"#REF!"}}]
[{"$f":"IF('Наш прайс'!#REF!=0,\"\",'Наш прайс'!#REF!)","v":{"$error":"#REF!"}},{"$f":"IF('Наш прайс'!#REF!=0,\"\",'Наш прайс'!#REF!)","v":{"$error":"#REF!"}},{"$f":"IF('Наш прайс'!#REF!=0,\"\",'Наш прайс'!#REF!)","v":{"$error":"#REF!"}},{"$error":"#REF!"},null,null,{"$f":"IF('Наш прайс'!#REF!=0,\"\",'Наш прайс'!#REF!)","v":{"$error":"#REF!"}},{"$f":"IF('Наш прайс'!#REF!=0,\"\",'Наш прайс'!#REF!)","v":{"$error":"#REF!"}},{"$f":"IF('Наш прайс'!#REF!=0,\"\",'Наш прайс'!#REF!)","v":{"$error":"#REF!"}},{"$f":"IF('Наш прайс'!#REF!=0,\"\",'Наш прайс'!#REF!)","v":{"$error":"#REF!"}},{"$f":"IF('Наш прайс'!#REF!=0,\"\",'Наш прайс'!#REF!)","v":{"$error":"#REF!"}},{"$f":"IF('Наш прайс'!#REF!=0,\"\",'Наш прайс'!#REF!)","v":{"$error":"#REF!"}},{"$f":"IF('Наш прайс'!#REF!=0,\"\",'Наш прайс'!#REF!)","v":{"$error":"#REF!"}}]
[{"$f":"IF('Наш прайс'!#REF!=0,\"\",'Наш прайс'!#REF!)","v":{"$error":"#REF!"}},{"$f":"IF('Наш прайс'!#REF!=0,\"\",'Наш прайс'!#REF!)","v":{"$error":"#REF!"}},{"$f":"IF('Наш прайс'!#REF!=0,\"\",'Наш прайс'!#REF!)","v":{"$error":"#REF!"}},{"$error":"#REF!"},null,null,{"$f":"IF('Наш прайс'!#REF!=0,\"\",'Наш прайс'!#REF!)","v":{"$error":"#REF!"}},{"$f":"IF('Наш прайс'!#REF!=0,\"\",'Наш прайс'!#REF!)","v":{"$error":"#REF!"}},{"$f":"IF('Наш прайс'!#REF!=0,\"\",'Наш прайс'!#REF!)","v":{"$error":"#REF!"}},{"$f":"IF('Наш прайс'!#REF!=0,\"\",'Наш прайс'!#REF!)","v":{"$error":"#REF!"}},{"$f":"IF('Наш прайс'!#REF!=0,\"\",'Наш прайс'!#REF!)","v":{"$error":"#REF!"}},{"$f":"IF('Наш прайс'!#REF!=0,\"\",'Наш прайс'!#REF!)","v":{"$error":"#REF!"}},{"$f":"IF('Наш прайс'!#REF!=0,\"\",'Наш прайс'!#REF!)","v":{"$error":"#REF!"}}]
[{"$f":"IF('Наш прайс'!#REF!=0,\"\",'Наш прайс'!#REF!)","v":{"$error":"#REF!"}},{"$f":"IF('Наш прайс'!#REF!=0,\"\",'Наш прайс'!#REF!)","v":{"$error":"#REF!"}},{"$f":"IF('Наш прайс'!#REF!=0,\"\",'Наш прайс'!#REF!)","v":{"$error":"#REF!"}},{"$error":"#REF!"},null,null,{"$f":"IF('Наш прайс'!#REF!=0,\"\",'Наш прайс'!#REF!)","v":{"$error":"#REF!"}},{"$f":"IF('Наш прайс'!#REF!=0,\"\",'Наш прайс'!#REF!)","v":{"$error":"#REF!"}},{"$f":"IF('Наш прайс'!#REF!=0,\"\",'Наш прайс'!#REF!)","v":{"$error":"#REF!"}},{"$f":"IF('Наш прайс'!#REF!=0,\"\",'Наш прайс'!#REF!)","v":{"$error":"#REF!"}},{"$f":"IF('Наш прайс'!#REF!=0,\"\",'Наш прайс'!#REF!)","v":{"$error":"#REF!"}},{"$f":"IF('Наш прайс'!#REF!=0,\"\",'Наш прайс'!#REF!)","v":{"$error":"#REF!"}},{"$f":"IF('Наш прайс'!#REF!=0,\"\",'Наш прайс'!#REF!)","v":{"$error":"#REF!"}}]
[{"$f":"IF('Наш прайс'!#REF!=0,\"\",'Наш прайс'!#REF!)","v":{"$error":"#REF!"}},{"$f":"IF('Наш прайс'!#REF!=0,\"\",'Наш прайс'!#REF!)","v":{"$error":"#REF!"}},{"$f":"IF('Наш прайс'!#REF!=0,\"\",'Наш прайс'!#REF!)","v":{"$error":"#REF!"}},{"$f":"L126","v":{"$error":"#REF!"}},null,null,{"$f":"IF('Наш прайс'!#REF!=0,\"\",'Наш прайс'!#REF!)","v":{"$error":"#REF!"}},{"$f":"IF('Наш прайс'!#REF!=0,\"\",'Наш прайс'!#REF!)","v":{"$error":"#REF!"}},{"$f":"IF('Наш прайс'!#REF!=0,\"\",'Наш прайс'!#REF!)","v":{"$error":"#REF!"}},{"$f":"IF('Наш прайс'!#REF!=0,\"\",'Наш прайс'!#REF!)","v":{"$error":"#REF!"}},{"$f":"IF('Наш прайс'!#REF!=0,\"\",'Наш прайс'!#REF!)","v":{"$error":"#REF!"}},{"$f":"IF('Наш прайс'!#REF!=0,\"\",'Наш прайс'!#REF!)","v":{"$error":"#REF!"}},{"$f":"IF('Наш прайс'!#REF!=0,\"\",'Наш прайс'!#REF!)","v":{"$error":"#REF!"}}]
[{"$f":"IF('Наш прайс'!#REF!=0,\"\",'Наш прайс'!#REF!)","v":{"$error":"#REF!"}},{"$f":"IF('Наш прайс'!#REF!=0,\"\",'Наш прайс'!#REF!)","v":{"$error":"#REF!"}},{"$f":"IF('Наш прайс'!#REF!=0,\"\",'Наш прайс'!#REF!)","v":{"$error":"#REF!"}},{"$f":"L127","v":{"$error":"#REF!"}},null,null,{"$f":"IF('Наш прайс'!#REF!=0,\"\",'Наш прайс'!#REF!)","v":{"$error":"#REF!"}},{"$f":"IF('Наш прайс'!#REF!=0,\"\",'Наш прайс'!#REF!)","v":{"$error":"#REF!"}},{"$f":"IF('Наш прайс'!#REF!=0,\"\",'Наш прайс'!#REF!)","v":{"$error":"#REF!"}},{"$f":"IF('Наш прайс'!#REF!=0,\"\",'Наш прайс'!#REF!)","v":{"$error":"#REF!"}},{"$f":"IF('Наш прайс'!#REF!=0,\"\",'Наш прайс'!#REF!)","v":{"$error":"#REF!"}},{"$f":"IF('Наш прайс'!#REF!=0,\"\",'Наш прайс'!#REF!)","v":{"$error":"#REF!"}},{"$f":"IF('Наш прайс'!#REF!=0,\"\",'Наш прайс'!#REF!)","v":{"$error":"#REF!"}}]
[{"$f":"IF('Наш прайс'!#REF!=0,\"\",'Наш прайс'!#REF!)","v":{"$error":"#REF!"}},{"$f":"IF('Наш прайс'!#REF!=0,\"\",'Наш прайс'!#REF!)","v":{"$error":"#REF!"}},{"$f":"IF('Наш прайс'!#REF!=0,\"\",'Наш прайс'!#REF!)","v":{"$error":"#REF!"}},{"$f":"L128","v":{"$error":"#REF!"}},null,null,{"$f":"IF('Наш прайс'!#REF!=0,\"\",'Наш прайс'!#REF!)","v":{"$error":"#REF!"}},{"$f":"IF('Наш прайс'!#REF!=0,\"\",'Наш прайс'!#REF!)","v":{"$error":"#REF!"}},{"$f":"IF('Наш прайс'!#REF!=0,\"\",'Наш прайс'!#REF!)","v":{"$error":"#REF!"}},{"$f":"IF('Наш прайс'!#REF!=0,\"\",'Наш прайс'!#REF!)","v":{"$error":"#REF!"}},{"$f":"IF('Наш прайс'!#REF!=0,\"\",'Наш прайс'!#REF!)","v":{"$error":"#REF!"}},{"$f":"IF('Наш прайс'!#REF!=0,\"\",'Наш прайс'!#REF!)","v":{"$error":"#REF!"}},{"$f":"IF('Наш прайс'!#REF!=0,\"\",'Наш прайс'!#REF!)","v":{"$error":"#REF!"}}]
[{"$f":"IF('Наш прайс'!#REF!=0,\"\",'Наш прайс'!#REF!)","v":{"$error":"#REF!"}},{"$f":"IF('Наш прайс'!#REF!=0,\"\",'Наш прайс'!#REF!)","v":{"$error":"#REF!"}},{"$f":"IF('Наш прайс'!#REF!=0,\"\",'Наш прайс'!#REF!)","v":{"$error":"#REF!"}},{"$f":"L129","v":{"$error":"#REF!"}},null,null,{"$f":"IF('Наш прайс'!#REF!=0,\"\",'Наш прайс'!#REF!)","v":{"$error":"#REF!"}},{"$f":"IF('Наш прайс'!#REF!=0,\"\",'Наш прайс'!#REF!)","v":{"$error":"#REF!"}},{"$f":"IF('Наш прайс'!#REF!=0,\"\",'Наш прайс'!#REF!)","v":{"$error":"#REF!"}},{"$f":"IF('Наш прайс'!#REF!=0,\"\",'Наш прайс'!#REF!)","v":{"$error":"#REF!"}},{"$f":"IF('Наш прайс'!#REF!=0,\"\",'Наш прайс'!#REF!)","v":{"$error":"#REF!"}},{"$f":"IF('Наш прайс'!#REF!=0,\"\",'Наш прайс'!#REF!)","v":{"$error":"#REF!"}},{"$f":"IF('Наш прайс'!#REF!=0,\"\",'Наш прайс'!#REF!)","v":{"$error":"#REF!"}}]
[{"$f":"IF('Наш прайс'!#REF!=0,\"\",'Наш прайс'!#REF!)","v":{"$error":"#REF!"}},{"$f":"IF('Наш прайс'!#REF!=0,\"\",'Наш прайс'!#REF!)","v":{"$error":"#REF!"}},{"$f":"IF('Наш прайс'!#REF!=0,\"\",'Наш прайс'!#REF!)","v":{"$error":"#REF!"}},{"$error":"#REF!"},null,null,{"$f":"IF('Наш прайс'!#REF!=0,\"\",'Наш прайс'!#REF!)","v":{"$error":"#REF!"}},{"$f":"IF('Наш прайс'!#REF!=0,\"\",'Наш прайс'!#REF!)","v":{"$error":"#REF!"}},{"$f":"IF('Наш прайс'!#REF!=0,\"\",'Наш прайс'!#REF!)","v":{"$error":"#REF!"}},{"$f":"IF('Наш прайс'!#REF!=0,\"\",'Наш прайс'!#REF!)","v":{"$error":"#REF!"}},{"$f":"IF('Наш прайс'!#REF!=0,\"\",'Наш прайс'!#REF!)","v":{"$error":"#REF!"}},{"$f":"IF('Наш прайс'!#REF!=0,\"\",'Наш прайс'!#REF!)","v":{"$error":"#REF!"}},{"$f":"IF('Наш прайс'!#REF!=0,\"\",'Наш прайс'!#REF!)","v":{"$error":"#REF!"}}]
[{"$f":"IF('Наш прайс'!#REF!=0,\"\",'Наш прайс'!#REF!)","v":{"$error":"#REF!"}},{"$f":"IF('Наш прайс'!#REF!=0,\"\",'Наш прайс'!#REF!)","v":{"$error":"#REF!"}},{"$f":"IF('Наш прайс'!#REF!=0,\"\",'Наш прайс'!#REF!)","v":{"$error":"#REF!"}},{"$error":"#REF!"},null,null,{"$f":"IF('Наш прайс'!#REF!=0,\"\",'Наш прайс'!#REF!)","v":{"$error":"#REF!"}},{"$f":"IF('Наш прайс'!#REF!=0,\"\",'Наш прайс'!#REF!)","v":{"$error":"#REF!"}},{"$f":"IF('Наш прайс'!#REF!=0,\"\",'Наш прайс'!#REF!)","v":{"$error":"#REF!"}},{"$f":"IF('Наш прайс'!#REF!=0,\"\",'Наш прайс'!#REF!)","v":{"$error":"#REF!"}},{"$f":"IF('Наш прайс'!#REF!=0,\"\",'Наш прайс'!#REF!)","v":{"$error":"#REF!"}},{"$f":"IF('Наш прайс'!#REF!=0,\"\",'Наш прайс'!#REF!)","v":{"$error":"#REF!"}},{"$f":"IF('Наш прайс'!#REF!=0,\"\",'Наш прайс'!#REF!)","v":{"$error":"#REF!"}}]
[{"$f":"IF('Наш прайс'!#REF!=0,\"\",'Наш прайс'!#REF!)","v":{"$error":"#REF!"}},{"$f":"IF('Наш прайс'!#REF!=0,\"\",'Наш прайс'!#REF!)","v":{"$error":"#REF!"}},{"$f":"IF('Наш прайс'!#REF!=0,\"\",'Наш прайс'!#REF!)","v":{"$error":"#REF!"}},{"$error":"#REF!"},null,null,{"$f":"IF('Наш прайс'!#REF!=0,\"\",'Наш прайс'!#REF!)","v":{"$error":"#REF!"}},{"$f":"IF('Наш прайс'!#REF!=0,\"\",'Наш прайс'!#REF!)","v":{"$error":"#REF!"}},{"$f":"IF('Наш прайс'!#REF!=0,\"\",'Наш прайс'!#REF!)","v":{"$error":"#REF!"}},{"$f":"IF('Наш прайс'!#REF!=0,\"\",'Наш прайс'!#REF!)","v":{"$error":"#REF!"}},{"$f":"IF('Наш прайс'!#REF!=0,\"\",'Наш прайс'!#REF!)","v":{"$error":"#REF!"}},{"$f":"IF('Наш прайс'!#REF!=0,\"\",'Наш прайс'!#REF!)","v":{"$error":"#REF!"}},{"$f":"IF('Наш прайс'!#REF!=0,\"\",'Наш прайс'!#REF!)","v":{"$error":"#REF!"}}]
[{"$f":"IF('Наш прайс'!#REF!=0,\"\",'Наш прайс'!#REF!)","v":{"$error":"#REF!"}},{"$f":"IF('Наш прайс'!#REF!=0,\"\",'Наш прайс'!#REF!)","v":{"$error":"#REF!"}},{"$f":"IF('Наш прайс'!#REF!=0,\"\",'Наш прайс'!#REF!)","v":{"$error":"#REF!"}},{"$error":"#REF!"},null,null,{"$f":"IF('Наш прайс'!#REF!=0,\"\",'Наш прайс'!#REF!)","v":{"$error":"#REF!"}},{"$f":"IF('Наш прайс'!#REF!=0,\"\",'Наш прайс'!#REF!)","v":{"$error":"#REF!"}},{"$f":"IF('Наш прайс'!#REF!=0,\"\",'Наш прайс'!#REF!)","v":{"$error":"#REF!"}},{"$f":"IF('Наш прайс'!#REF!=0,\"\",'Наш прайс'!#REF!)","v":{"$error":"#REF!"}},{"$f":"IF('Наш прайс'!#REF!=0,\"\",'Наш прайс'!#REF!)","v":{"$error":"#REF!"}},{"$f":"IF('Наш прайс'!#REF!=0,\"\",'Наш прайс'!#REF!)","v":{"$error":"#REF!"}},{"$f":"IF('Наш прайс'!#REF!=0,\"\",'Наш прайс'!#REF!)","v":{"$error":"#REF!"}}]
[{"$f":"IF('Наш прайс'!#REF!=0,\"\",'Наш прайс'!#REF!)","v":{"$error":"#REF!"}},{"$f":"IF('Наш прайс'!#REF!=0,\"\",'Наш прайс'!#REF!)","v":{"$error":"#REF!"}},{"$f":"IF('Наш прайс'!#REF!=0,\"\",'Наш прайс'!#REF!)","v":{"$error":"#REF!"}},{"$error":"#REF!"},null,null,{"$f":"IF('Наш прайс'!#REF!=0,\"\",'Наш прайс'!#REF!)","v":{"$error":"#REF!"}},{"$f":"IF('Наш прайс'!#REF!=0,\"\",'Наш прайс'!#REF!)","v":{"$error":"#REF!"}},{"$f":"IF('Наш прайс'!#REF!=0,\"\",'Наш прайс'!#REF!)","v":{"$error":"#REF!"}},{"$f":"IF('Наш прайс'!#REF!=0,\"\",'Наш прайс'!#REF!)","v":{"$error":"#REF!"}},{"$f":"IF('Наш прайс'!#REF!=0,\"\",'Наш прайс'!#REF!)","v":{"$error":"#REF!"}},{"$f":"IF('Наш прайс'!#REF!=0,\"\",'Наш прайс'!#REF!)","v":{"$error":"#REF!"}},{"$f":"IF('Наш прайс'!#REF!=0,\"\",'Наш прайс'!#REF!)","v":{"$error":"#REF!"}}]
[{"$f":"IF('Наш прайс'!#REF!=0,\"\",'Наш прайс'!#REF!)","v":{"$error":"#REF!"}},{"$f":"IF('Наш прайс'!#REF!=0,\"\",'Наш прайс'!#REF!)","v":{"$error":"#REF!"}},{"$f":"IF('Наш прайс'!#REF!=0,\"\",'Наш прайс'!#REF!)","v":{"$error":"#REF!"}},{"$error":"#REF!"},null,null,{"$f":"IF('Наш прайс'!#REF!=0,\"\",'Наш прайс'!#REF!)","v":{"$error":"#REF!"}},{"$f":"IF('Наш прайс'!#REF!=0,\"\",'Наш прайс'!#REF!)","v":{"$error":"#REF!"}},{"$f":"IF('Наш прайс'!#REF!=0,\"\",'Наш прайс'!#REF!)","v":{"$error":"#REF!"}},{"$f":"IF('Наш прайс'!#REF!=0,\"\",'Наш прайс'!#REF!)","v":{"$error":"#REF!"}},{"$f":"IF('Наш прайс'!#REF!=0,\"\",'Наш прайс'!#REF!)","v":{"$error":"#REF!"}},{"$f":"IF('Наш прайс'!#REF!=0,\"\",'Наш прайс'!#REF!)","v":{"$error":"#REF!"}},{"$f":"IF('Наш прайс'!#REF!=0,\"\",'Наш прайс'!#REF!)","v":{"$error":"#REF!"}}]
[{"$f":"IF('Наш прайс'!#REF!=0,\"\",'Наш прайс'!#REF!)","v":{"$error":"#REF!"}},{"$f":"IF('Наш прайс'!#REF!=0,\"\",'Наш прайс'!#REF!)","v":{"$error":"#REF!"}},{"$f":"IF('Наш прайс'!#REF!=0,\"\",'Наш прайс'!#REF!)","v":{"$error":"#REF!"}},{"$error":"#REF!"},null,null,{"$f":"IF('Наш прайс'!#REF!=0,\"\",'Наш прайс'!#REF!)","v":{"$error":"#REF!"}},{"$f":"IF('Наш прайс'!#REF!=0,\"\",'Наш прайс'!#REF!)","v":{"$error":"#REF!"}},{"$f":"IF('Наш прайс'!#REF!=0,\"\",'Наш прайс'!#REF!)","v":{"$error":"#REF!"}},{"$f":"IF('Наш прайс'!#REF!=0,\"\",'Наш прайс'!#REF!)","v":{"$error":"#REF!"}},{"$f":"IF('Наш прайс'!#REF!=0,\"\",'Наш прайс'!#REF!)","v":{"$error":"#REF!"}},{"$f":"IF('Наш прайс'!#REF!=0,\"\",'Наш прайс'!#REF!)","v":{"$error":"#REF!"}},{"$f":"IF('Наш прайс'!#REF!=0,\"\",'Наш прайс'!#REF!)","v":{"$error":"#REF!"}}]
[{"$f":"IF('Наш прайс'!#REF!=0,\"\",'Наш прайс'!#REF!)","v":{"$error":"#REF!"}},{"$f":"IF('Наш прайс'!#REF!=0,\"\",'Наш прайс'!#REF!)","v":{"$error":"#REF!"}},{"$f":"IF('Наш прайс'!#REF!=0,\"\",'Наш прайс'!#REF!)","v":{"$error":"#REF!"}},{"$error":"#REF!"},null,null,{"$f":"IF('Наш прайс'!#REF!=0,\"\",'Наш прайс'!#REF!)","v":{"$error":"#REF!"}},{"$f":"IF('Наш прайс'!#REF!=0,\"\",'Наш прайс'!#REF!)","v":{"$error":"#REF!"}},{"$f":"IF('Наш прайс'!#REF!=0,\"\",'Наш прайс'!#REF!)","v":{"$error":"#REF!"}},{"$f":"IF('Наш прайс'!#REF!=0,\"\",'Наш прайс'!#REF!)","v":{"$error":"#REF!"}},{"$f":"IF('Наш прайс'!#REF!=0,\"\",'Наш прайс'!#REF!)","v":{"$error":"#REF!"}},{"$f":"IF('Наш прайс'!#REF!=0,\"\",'Наш прайс'!#REF!)","v":{"$error":"#REF!"}},{"$f":"IF('Наш прайс'!#REF!=0,\"\",'Наш прайс'!#REF!)","v":{"$error":"#REF!"}}]
[{"$f":"IF('Наш прайс'!#REF!=0,\"\",'Наш прайс'!#REF!)","v":{"$error":"#REF!"}},{"$f":"IF('Наш прайс'!#REF!=0,\"\",'Наш прайс'!#REF!)","v":{"$error":"#REF!"}},{"$f":"IF('Наш прайс'!#REF!=0,\"\",'Наш прайс'!#REF!)","v":{"$error":"#REF!"}},{"$error":"#REF!"},null,null,{"$f":"IF('Наш прайс'!#REF!=0,\"\",'Наш прайс'!#REF!)","v":{"$error":"#REF!"}},{"$f":"IF('Наш прайс'!#REF!=0,\"\",'Наш прайс'!#REF!)","v":{"$error":"#REF!"}},{"$f":"IF('Наш прайс'!#REF!=0,\"\",'Наш прайс'!#REF!)","v":{"$error":"#REF!"}},{"$f":"IF('Наш прайс'!#REF!=0,\"\",'Наш прайс'!#REF!)","v":{"$error":"#REF!"}},{"$f":"IF('Наш прайс'!#REF!=0,\"\",'Наш прайс'!#REF!)","v":{"$error":"#REF!"}},{"$f":"IF('Наш прайс'!#REF!=0,\"\",'Наш прайс'!#REF!)","v":{"$error":"#REF!"}},{"$f":"IF('Наш прайс'!#REF!=0,\"\",'Наш прайс'!#REF!)","v":{"$error":"#REF!"}}]
[{"$f":"IF('Наш прайс'!#REF!=0,\"\",'Наш прайс'!#REF!)","v":{"$error":"#REF!"}},{"$f":"IF('Наш прайс'!#REF!=0,\"\",'Наш прайс'!#REF!)","v":{"$error":"#REF!"}},{"$f":"IF('Наш прайс'!#REF!=0,\"\",'Наш прайс'!#REF!)","v":{"$error":"#REF!"}},{"$error":"#REF!"},null,null,{"$f":"IF('Наш прайс'!#REF!=0,\"\",'Наш прайс'!#REF!)","v":{"$error":"#REF!"}},{"$f":"IF('Наш прайс'!#REF!=0,\"\",'Наш прайс'!#REF!)","v":{"$error":"#REF!"}},{"$f":"IF('Наш прайс'!#REF!=0,\"\",'Наш прайс'!#REF!)","v":{"$error":"#REF!"}},{"$f":"IF('Наш прайс'!#REF!=0,\"\",'Наш прайс'!#REF!)","v":{"$error":"#REF!"}},{"$f":"IF('Наш прайс'!#REF!=0,\"\",'Наш прайс'!#REF!)","v":{"$error":"#REF!"}},{"$f":"IF('Наш прайс'!#REF!=0,\"\",'Наш прайс'!#REF!)","v":{"$error":"#REF!"}},{"$f":"IF('Наш прайс'!#REF!=0,\"\",'Наш прайс'!#REF!)","v":{"$error":"#REF!"}}]
[{"$f":"IF('Наш прайс'!#REF!=0,\"\",'Наш прайс'!#REF!)","v":{"$error":"#REF!"}},{"$f":"IF('Наш прайс'!#REF!=0,\"\",'Наш прайс'!#REF!)","v":{"$error":"#REF!"}},{"$f":"IF('Наш прайс'!#REF!=0,\"\",'Наш прайс'!#REF!)","v":{"$error":"#REF!"}},{"$error":"#REF!"},null,null,{"$f":"IF('Наш прайс'!#REF!=0,\"\",'Наш прайс'!#REF!)","v":{"$error":"#REF!"}},{"$f":"IF('Наш прайс'!#REF!=0,\"\",'Наш прайс'!#REF!)","v":{"$error":"#REF!"}},{"$f":"IF('Наш прайс'!#REF!=0,\"\",'Наш прайс'!#REF!)","v":{"$error":"#REF!"}},{"$f":"IF('Наш прайс'!#REF!=0,\"\",'Наш прайс'!#REF!)","v":{"$error":"#REF!"}},{"$f":"IF('Наш прайс'!#REF!=0,\"\",'Наш прайс'!#REF!)","v":{"$error":"#REF!"}},{"$f":"IF('Наш прайс'!#REF!=0,\"\",'Наш прайс'!#REF!)","v":{"$error":"#REF!"}},{"$f":"IF('Наш прайс'!#REF!=0,\"\",'Наш прайс'!#REF!)","v":{"$error":"#REF!"}}]
[{"$f":"IF('Наш прайс'!#REF!=0,\"\",'Наш прайс'!#REF!)","v":{"$error":"#REF!"}},{"$f":"IF('Наш прайс'!#REF!=0,\"\",'Наш прайс'!#REF!)","v":{"$error":"#REF!"}},{"$f":"IF('Наш прайс'!#REF!=0,\"\",'Наш прайс'!#REF!)","v":{"$error":"#REF!"}},{"$error":"#REF!"},null,null,{"$f":"IF('Наш прайс'!#REF!=0,\"\",'Наш прайс'!#REF!)","v":{"$error":"#REF!"}},{"$f":"IF('Наш прайс'!#REF!=0,\"\",'Наш прайс'!#REF!)","v":{"$error":"#REF!"}},{"$f":"IF('Наш прайс'!#REF!=0,\"\",'Наш прайс'!#REF!)","v":{"$error":"#REF!"}},{"$f":"IF('Наш прайс'!#REF!=0,\"\",'Наш прайс'!#REF!)","v":{"$error":"#REF!"}},{"$f":"IF('Наш прайс'!#REF!=0,\"\",'Наш прайс'!#REF!)","v":{"$error":"#REF!"}},{"$f":"IF('Наш прайс'!#REF!=0,\"\",'Наш прайс'!#REF!)","v":{"$error":"#REF!"}},{"$f":"IF('Наш прайс'!#REF!=0,\"\",'Наш прайс'!#REF!)","v":{"$error":"#REF!"}}]
[{"$f":"IF('Наш прайс'!#REF!=0,\"\",'Наш прайс'!#REF!)","v":{"$error":"#REF!"}},{"$f":"IF('Наш прайс'!#REF!=0,\"\",'Наш прайс'!#REF!)","v":{"$error":"#REF!"}},{"$f":"IF('Наш прайс'!#REF!=0,\"\",'Наш прайс'!#REF!)","v":{"$error":"#REF!"}},{"$error":"#REF!"},null,null,{"$f":"IF('Наш прайс'!#REF!=0,\"\",'Наш прайс'!#REF!)","v":{"$error":"#REF!"}},{"$f":"IF('Наш прайс'!#REF!=0,\"\",'Наш прайс'!#REF!)","v":{"$error":"#REF!"}},{"$f":"IF('Наш прайс'!#REF!=0,\"\",'Наш прайс'!#REF!)","v":{"$error":"#REF!"}},{"$f":"IF('Наш прайс'!#REF!=0,\"\",'Наш прайс'!#REF!)","v":{"$error":"#REF!"}},{"$f":"IF('Наш прайс'!#REF!=0,\"\",'Наш прайс'!#REF!)","v":{"$error":"#REF!"}},{"$f":"IF('Наш прайс'!#REF!=0,\"\",'Наш прайс'!#REF!)","v":{"$error":"#REF!"}},{"$f":"IF('Наш прайс'!#REF!=0,\"\",'Наш прайс'!#REF!)","v":{"$error":"#REF!"}}]
[{"$f":"IF('Наш прайс'!#REF!=0,\"\",'Наш прайс'!#REF!)","v":{"$error":"#REF!"}},{"$f":"IF('Наш прайс'!#REF!=0,\"\",'Наш прайс'!#REF!)","v":{"$error":"#REF!"}},{"$f":"IF('Наш прайс'!#REF!=0,\"\",'Наш прайс'!#REF!)","v":{"$error":"#REF!"}},{"$error":"#REF!"},null,null,{"$f":"IF('Наш прайс'!#REF!=0,\"\",'Наш прайс'!#REF!)","v":{"$error":"#REF!"}},{"$f":"IF('Наш прайс'!#REF!=0,\"\",'Наш прайс'!#REF!)","v":{"$error":"#REF!"}},{"$f":"IF('Наш прайс'!#REF!=0,\"\",'Наш прайс'!#REF!)","v":{"$error":"#REF!"}},{"$f":"IF('Наш прайс'!#REF!=0,\"\",'Наш прайс'!#REF!)","v":{"$error":"#REF!"}},{"$f":"IF('Наш прайс'!#REF!=0,\"\",'Наш прайс'!#REF!)","v":{"$error":"#REF!"}},{"$f":"IF('Наш прайс'!#REF!=0,\"\",'Наш прайс'!#REF!)","v":{"$error":"#REF!"}},{"$f":"IF('Наш прайс'!#REF!=0,\"\",'Наш прайс'!#REF!)","v":{"$error":"#REF!"}}]
[{"$f":"IF('Наш прайс'!#REF!=0,\"\",'Наш прайс'!#REF!)","v":{"$error":"#REF!"}},{"$f":"IF('Наш прайс'!#REF!=0,\"\",'Наш прайс'!#REF!)","v":{"$error":"#REF!"}},{"$f":"IF('Наш прайс'!#REF!=0,\"\",'Наш прайс'!#REF!)","v":{"$error":"#REF!"}},{"$error":"#REF!"},null,null,{"$f":"IF('Наш прайс'!#REF!=0,\"\",'Наш прайс'!#REF!)","v":{"$error":"#REF!"}},{"$f":"IF('Наш прайс'!#REF!=0,\"\",'Наш прайс'!#REF!)","v":{"$error":"#REF!"}},{"$f":"IF('Наш прайс'!#REF!=0,\"\",'Наш прайс'!#REF!)","v":{"$error":"#REF!"}},{"$f":"IF('Наш прайс'!#REF!=0,\"\",'Наш прайс'!#REF!)","v":{"$error":"#REF!"}},{"$f":"IF('Наш прайс'!#REF!=0,\"\",'Наш прайс'!#REF!)","v":{"$error":"#REF!"}},{"$f":"IF('Наш прайс'!#REF!=0,\"\",'Наш прайс'!#REF!)","v":{"$error":"#REF!"}},{"$f":"IF('Наш прайс'!#REF!=0,\"\",'Наш прайс'!#REF!)","v":{"$error":"#REF!"}}]
[{"$f":"IF('Наш прайс'!#REF!=0,\"\",'Наш прайс'!#REF!)","v":{"$error":"#REF!"}},{"$f":"IF('Наш прайс'!#REF!=0,\"\",'Наш прайс'!#REF!)","v":{"$error":"#REF!"}},{"$f":"IF('Наш прайс'!#REF!=0,\"\",'Наш прайс'!#REF!)","v":{"$error":"#REF!"}},{"$error":"#REF!"},null,null,{"$f":"IF('Наш прайс'!#REF!=0,\"\",'Наш прайс'!#REF!)","v":{"$error":"#REF!"}},{"$f":"IF('Наш прайс'!#REF!=0,\"\",'Наш прайс'!#REF!)","v":{"$error":"#REF!"}},{"$f":"IF('Наш прайс'!#REF!=0,\"\",'Наш прайс'!#REF!)","v":{"$error":"#REF!"}},{"$f":"IF('Наш прайс'!#REF!=0,\"\",'Наш прайс'!#REF!)","v":{"$error":"#REF!"}},{"$f":"IF('Наш прайс'!#REF!=0,\"\",'Наш прайс'!#REF!)","v":{"$error":"#REF!"}},{"$f":"IF('Наш прайс'!#REF!=0,\"\",'Наш прайс'!#REF!)","v":{"$error":"#REF!"}},{"$f":"IF('Наш прайс'!#REF!=0,\"\",'Наш прайс'!#REF!)","v":{"$error":"#REF!"}}]
[{"$f":"IF('Наш прайс'!#REF!=0,\"\",'Наш прайс'!#REF!)","v":{"$error":"#REF!"}},{"$f":"IF('Наш прайс'!#REF!=0,\"\",'Наш прайс'!#REF!)","v":{"$error":"#REF!"}},{"$f":"IF('Наш прайс'!#REF!=0,\"\",'Наш прайс'!#REF!)","v":{"$error":"#REF!"}},{"$error":"#REF!"},null,null,{"$f":"IF('Наш прайс'!#REF!=0,\"\",'Наш прайс'!#REF!)","v":{"$error":"#REF!"}},{"$f":"IF('Наш прайс'!#REF!=0,\"\",'Наш прайс'!#REF!)","v":{"$error":"#REF!"}},{"$f":"IF('Наш прайс'!#REF!=0,\"\",'Наш прайс'!#REF!)","v":{"$error":"#REF!"}},{"$f":"IF('Наш прайс'!#REF!=0,\"\",'Наш прайс'!#REF!)","v":{"$error":"#REF!"}},{"$f":"IF('Наш прайс'!#REF!=0,\"\",'Наш прайс'!#REF!)","v":{"$error":"#REF!"}},{"$f":"IF('Наш прайс'!#REF!=0,\"\",'Наш прайс'!#REF!)","v":{"$error":"#REF!"}},{"$f":"IF('Наш прайс'!#REF!=0,\"\",'Наш прайс'!#REF!)","v":{"$error":"#REF!"}}]
[{"$f":"IF('Наш прайс'!#REF!=0,\"\",'Наш прайс'!#REF!)","v":{"$error":"#REF!"}},{"$f":"IF('Наш прайс'!#REF!=0,\"\",'Наш прайс'!#REF!)","v":{"$error":"#REF!"}},{"$f":"IF('Наш прайс'!#REF!=0,\"\",'Наш прайс'!#REF!)","v":{"$error":"#REF!"}},{"$error":"#REF!"},null,null,{"$f":"IF('Наш прайс'!#REF!=0,\"\",'Наш прайс'!#REF!)","v":{"$error":"#REF!"}},{"$f":"IF('Наш прайс'!#REF!=0,\"\",'Наш прайс'!#REF!)","v":{"$error":"#REF!"}},{"$f":"IF('Наш прайс'!#REF!=0,\"\",'Наш прайс'!#REF!)","v":{"$error":"#REF!"}},{"$f":"IF('Наш прайс'!#REF!=0,\"\",'Наш прайс'!#REF!)","v":{"$error":"#REF!"}},{"$f":"IF('Наш прайс'!#REF!=0,\"\",'Наш прайс'!#REF!)","v":{"$error":"#REF!"}},{"$f":"IF('Наш прайс'!#REF!=0,\"\",'Наш прайс'!#REF!)","v":{"$error":"#REF!"}},{"$f":"IF('Наш прайс'!#REF!=0,\"\",'Наш прайс'!#REF!)","v":{"$error":"#REF!"}}]
[{"$f":"IF('Наш прайс'!#REF!=0,\"\",'Наш прайс'!#REF!)","v":{"$error":"#REF!"}},{"$f":"IF('Наш прайс'!#REF!=0,\"\",'Наш прайс'!#REF!)","v":{"$error":"#REF!"}},{"$f":"IF('Наш прайс'!#REF!=0,\"\",'Наш прайс'!#REF!)","v":{"$error":"#REF!"}},{"$error":"#REF!"},null,null,{"$f":"IF('Наш прайс'!#REF!=0,\"\",'Наш прайс'!#REF!)","v":{"$error":"#REF!"}},{"$f":"IF('Наш прайс'!#REF!=0,\"\",'Наш прайс'!#REF!)","v":{"$error":"#REF!"}},{"$f":"IF('Наш прайс'!#REF!=0,\"\",'Наш прайс'!#REF!)","v":{"$error":"#REF!"}},{"$f":"IF('Наш прайс'!#REF!=0,\"\",'Наш прайс'!#REF!)","v":{"$error":"#REF!"}},{"$f":"IF('Наш прайс'!#REF!=0,\"\",'Наш прайс'!#REF!)","v":{"$error":"#REF!"}},{"$f":"IF('Наш прайс'!#REF!=0,\"\",'Наш прайс'!#REF!)","v":{"$error":"#REF!"}},{"$f":"IF('Наш прайс'!#REF!=0,\"\",'Наш прайс'!#REF!)","v":{"$error":"#REF!"}}]
[{"$f":"IF('Наш прайс'!#REF!=0,\"\",'Наш прайс'!#REF!)","v":{"$error":"#REF!"}},{"$f":"IF('Наш прайс'!#REF!=0,\"\",'Наш прайс'!#REF!)","v":{"$error":"#REF!"}},{"$f":"IF('Наш прайс'!#REF!=0,\"\",'Наш прайс'!#REF!)","v":{"$error":"#REF!"}},{"$error":"#REF!"},null,null,{"$f":"IF('Наш прайс'!#REF!=0,\"\",'Наш прайс'!#REF!)","v":{"$error":"#REF!"}},{"$f":"IF('Наш прайс'!#REF!=0,\"\",'Наш прайс'!#REF!)","v":{"$error":"#REF!"}},{"$f":"IF('Наш прайс'!#REF!=0,\"\",'Наш прайс'!#REF!)","v":{"$error":"#REF!"}},{"$f":"IF('Наш прайс'!#REF!=0,\"\",'Наш прайс'!#REF!)","v":{"$error":"#REF!"}},{"$f":"IF('Наш прайс'!#REF!=0,\"\",'Наш прайс'!#REF!)","v":{"$error":"#REF!"}},{"$f":"IF('Наш прайс'!#REF!=0,\"\",'Наш прайс'!#REF!)","v":{"$error":"#REF!"}},{"$f":"IF('Наш прайс'!#REF!=0,\"\",'Наш прайс'!#REF!)","v":{"$error":"#REF!"}}]
[{"$f":"IF('Наш прайс'!#REF!=0,\"\",'Наш прайс'!#REF!)","v":{"$error":"#REF!"}},{"$f":"IF('Наш прайс'!#REF!=0,\"\",'Наш прайс'!#REF!)","v":{"$error":"#REF!"}},{"$f":"IF('Наш прайс'!#REF!=0,\"\",'Наш прайс'!#REF!)","v":{"$error":"#REF!"}},{"$error":"#REF!"},null,null,{"$f":"IF('Наш прайс'!#REF!=0,\"\",'Наш прайс'!#REF!)","v":{"$error":"#REF!"}},{"$f":"IF('Наш прайс'!#REF!=0,\"\",'Наш прайс'!#REF!)","v":{"$error":"#REF!"}},{"$f":"IF('Наш прайс'!#REF!=0,\"\",'Наш прайс'!#REF!)","v":{"$error":"#REF!"}},{"$f":"IF('Наш прайс'!#REF!=0,\"\",'Наш прайс'!#REF!)","v":{"$error":"#REF!"}},{"$f":"IF('Наш прайс'!#REF!=0,\"\",'Наш прайс'!#REF!)","v":{"$error":"#REF!"}},{"$f":"IF('Наш прайс'!#REF!=0,\"\",'Наш прайс'!#REF!)","v":{"$error":"#REF!"}},{"$f":"IF('Наш прайс'!#REF!=0,\"\",'Наш прайс'!#REF!)","v":{"$error":"#REF!"}}]
[{"$f":"IF('Наш прайс'!#REF!=0,\"\",'Наш прайс'!#REF!)","v":{"$error":"#REF!"}},{"$f":"IF('Наш прайс'!#REF!=0,\"\",'Наш прайс'!#REF!)","v":{"$error":"#REF!"}},{"$f":"IF('Наш прайс'!#REF!=0,\"\",'Наш прайс'!#REF!)","v":{"$error":"#REF!"}},{"$error":"#REF!"},null,null,{"$f":"IF('Наш прайс'!#REF!=0,\"\",'Наш прайс'!#REF!)","v":{"$error":"#REF!"}},{"$f":"IF('Наш прайс'!#REF!=0,\"\",'Наш прайс'!#REF!)","v":{"$error":"#REF!"}},{"$f":"IF('Наш прайс'!#REF!=0,\"\",'Наш прайс'!#REF!)","v":{"$error":"#REF!"}},{"$f":"IF('Наш прайс'!#REF!=0,\"\",'Наш прайс'!#REF!)","v":{"$error":"#REF!"}},{"$f":"IF('Наш прайс'!#REF!=0,\"\",'Наш прайс'!#REF!)","v":{"$error":"#REF!"}},{"$f":"IF('Наш прайс'!#REF!=0,\"\",'Наш прайс'!#REF!)","v":{"$error":"#REF!"}},{"$f":"IF('Наш прайс'!#REF!=0,\"\",'Наш прайс'!#REF!)","v":{"$error":"#REF!"}}]
[{"$f":"IF('Наш прайс'!#REF!=0,\"\",'Наш прайс'!#REF!)","v":{"$error":"#REF!"}},{"$f":"IF('Наш прайс'!#REF!=0,\"\",'Наш прайс'!#REF!)","v":{"$error":"#REF!"}},{"$f":"IF('Наш прайс'!#REF!=0,\"\",'Наш прайс'!#REF!)","v":{"$error":"#REF!"}},{"$error":"#REF!"},null,null,{"$f":"IF('Наш прайс'!#REF!=0,\"\",'Наш прайс'!#REF!)","v":{"$error":"#REF!"}},{"$f":"IF('Наш прайс'!#REF!=0,\"\",'Наш прайс'!#REF!)","v":{"$error":"#REF!"}},{"$f":"IF('Наш прайс'!#REF!=0,\"\",'Наш прайс'!#REF!)","v":{"$error":"#REF!"}},{"$f":"IF('Наш прайс'!#REF!=0,\"\",'Наш прайс'!#REF!)","v":{"$error":"#REF!"}},{"$f":"IF('Наш прайс'!#REF!=0,\"\",'Наш прайс'!#REF!)","v":{"$error":"#REF!"}},{"$f":"IF('Наш прайс'!#REF!=0,\"\",'Наш прайс'!#REF!)","v":{"$error":"#REF!"}},{"$f":"IF('Наш прайс'!#REF!=0,\"\",'Наш прайс'!#REF!)","v":{"$error":"#REF!"}}]
[{"$f":"IF('Наш прайс'!#REF!=0,\"\",'Наш прайс'!#REF!)","v":{"$error":"#REF!"}},{"$f":"IF('Наш прайс'!#REF!=0,\"\",'Наш прайс'!#REF!)","v":{"$error":"#REF!"}},{"$f":"IF('Наш прайс'!#REF!=0,\"\",'Наш прайс'!#REF!)","v":{"$error":"#REF!"}},{"$error":"#REF!"},null,null,{"$f":"IF('Наш прайс'!#REF!=0,\"\",'Наш прайс'!#REF!)","v":{"$error":"#REF!"}},{"$f":"IF('Наш прайс'!#REF!=0,\"\",'Наш прайс'!#REF!)","v":{"$error":"#REF!"}},{"$f":"IF('Наш прайс'!#REF!=0,\"\",'Наш прайс'!#REF!)","v":{"$error":"#REF!"}},{"$f":"IF('Наш прайс'!#REF!=0,\"\",'Наш прайс'!#REF!)","v":{"$error":"#REF!"}},{"$f":"IF('Наш прайс'!#REF!=0,\"\",'Наш прайс'!#REF!)","v":{"$error":"#REF!"}},{"$f":"IF('Наш прайс'!#REF!=0,\"\",'Наш прайс'!#REF!)","v":{"$error":"#REF!"}},{"$f":"IF('Наш прайс'!#REF!=0,\"\",'Наш прайс'!#REF!)","v":{"$error":"#REF!"}}]
[{"$f":"IF('Наш прайс'!#REF!=0,\"\",'Наш прайс'!#REF!)","v":{"$error":"#REF!"}},{"$f":"IF('Наш прайс'!#REF!=0,\"\",'Наш прайс'!#REF!)","v":{"$error":"#REF!"}},{"$f":"IF('Наш прайс'!#REF!=0,\"\",'Наш прайс'!#REF!)","v":{"$error":"#REF!"}},{"$error":"#REF!"},null,null,{"$f":"IF('Наш прайс'!#REF!=0,\"\",'Наш прайс'!#REF!)","v":{"$error":"#REF!"}},{"$f":"IF('Наш прайс'!#REF!=0,\"\",'Наш прайс'!#REF!)","v":{"$error":"#REF!"}},{"$f":"IF('Наш прайс'!#REF!=0,\"\",'Наш прайс'!#REF!)","v":{"$error":"#REF!"}},{"$f":"IF('Наш прайс'!#REF!=0,\"\",'Наш прайс'!#REF!)","v":{"$error":"#REF!"}},{"$f":"IF('Наш прайс'!#REF!=0,\"\",'Наш прайс'!#REF!)","v":{"$error":"#REF!"}},{"$f":"IF('Наш прайс'!#REF!=0,\"\",'Наш прайс'!#REF!)","v":{"$error":"#REF!"}},{"$f":"IF('Наш прайс'!#REF!=0,\"\",'Наш прайс'!#REF!)","v":{"$error":"#REF!"}}]
[{"$f":"IF('Наш прайс'!#REF!=0,\"\",'Наш прайс'!#REF!)","v":{"$error":"#REF!"}},{"$f":"IF('Наш прайс'!#REF!=0,\"\",'Наш прайс'!#REF!)","v":{"$error":"#REF!"}},{"$f":"IF('Наш прайс'!#REF!=0,\"\",'Наш прайс'!#REF!)","v":{"$error":"#REF!"}},{"$error":"#REF!"},null,null,{"$f":"IF('Наш прайс'!#REF!=0,\"\",'Наш прайс'!#REF!)","v":{"$error":"#REF!"}},{"$f":"IF('Наш прайс'!#REF!=0,\"\",'Наш прайс'!#REF!)","v":{"$error":"#REF!"}},{"$f":"IF('Наш прайс'!#REF!=0,\"\",'Наш прайс'!#REF!)","v":{"$error":"#REF!"}},{"$f":"IF('Наш прайс'!#REF!=0,\"\",'Наш прайс'!#REF!)","v":{"$error":"#REF!"}},{"$f":"IF('Наш прайс'!#REF!=0,\"\",'Наш прайс'!#REF!)","v":{"$error":"#REF!"}},{"$f":"IF('Наш прайс'!#REF!=0,\"\",'Наш прайс'!#REF!)","v":{"$error":"#REF!"}},{"$f":"IF('Наш прайс'!#REF!=0,\"\",'Наш прайс'!#REF!)","v":{"$error":"#REF!"}}]
[{"$f":"IF('Наш прайс'!#REF!=0,\"\",'Наш прайс'!#REF!)","v":{"$error":"#REF!"}},{"$f":"IF('Наш прайс'!#REF!=0,\"\",'Наш прайс'!#REF!)","v":{"$error":"#REF!"}},{"$f":"IF('Наш прайс'!#REF!=0,\"\",'Наш прайс'!#REF!)","v":{"$error":"#REF!"}},{"$error":"#REF!"},null,null,{"$f":"IF('Наш прайс'!#REF!=0,\"\",'Наш прайс'!#REF!)","v":{"$error":"#REF!"}},{"$f":"IF('Наш прайс'!#REF!=0,\"\",'Наш прайс'!#REF!)","v":{"$error":"#REF!"}},{"$f":"IF('Наш прайс'!#REF!=0,\"\",'Наш прайс'!#REF!)","v":{"$error":"#REF!"}},{"$f":"IF('Наш прайс'!#REF!=0,\"\",'Наш прайс'!#REF!)","v":{"$error":"#REF!"}},{"$f":"IF('Наш прайс'!#REF!=0,\"\",'Наш прайс'!#REF!)","v":{"$error":"#REF!"}},{"$f":"IF('Наш прайс'!#REF!=0,\"\",'Наш прайс'!#REF!)","v":{"$error":"#REF!"}},{"$f":"IF('Наш прайс'!#REF!=0,\"\",'Наш прайс'!#REF!)","v":{"$error":"#REF!"}}]
[{"$f":"IF('Наш прайс'!#REF!=0,\"\",'Наш прайс'!#REF!)","v":{"$error":"#REF!"}},{"$f":"IF('Наш прайс'!#REF!=0,\"\",'Наш прайс'!#REF!)","v":{"$error":"#REF!"}},{"$f":"IF('Наш прайс'!#REF!=0,\"\",'Наш прайс'!#REF!)","v":{"$error":"#REF!"}},{"$error":"#REF!"},null,null,{"$f":"IF('Наш прайс'!#REF!=0,\"\",'Наш прайс'!#REF!)","v":{"$error":"#REF!"}},{"$f":"IF('Наш прайс'!#REF!=0,\"\",'Наш прайс'!#REF!)","v":{"$error":"#REF!"}},{"$f":"IF('Наш прайс'!#REF!=0,\"\",'Наш прайс'!#REF!)","v":{"$error":"#REF!"}},{"$f":"IF('Наш прайс'!#REF!=0,\"\",'Наш прайс'!#REF!)","v":{"$error":"#REF!"}},{"$f":"IF('Наш прайс'!#REF!=0,\"\",'Наш прайс'!#REF!)","v":{"$error":"#REF!"}},{"$f":"IF('Наш прайс'!#REF!=0,\"\",'Наш прайс'!#REF!)","v":{"$error":"#REF!"}},{"$f":"IF('Наш прайс'!#REF!=0,\"\",'Наш прайс'!#REF!)","v":{"$error":"#REF!"}}]
[{"$f":"IF('Наш прайс'!#REF!=0,\"\",'Наш прайс'!#REF!)","v":{"$error":"#REF!"}},{"$f":"IF('Наш прайс'!#REF!=0,\"\",'Наш прайс'!#REF!)","v":{"$error":"#REF!"}},{"$f":"IF('Наш прайс'!#REF!=0,\"\",'Наш прайс'!#REF!)","v":{"$error":"#REF!"}},{"$error":"#REF!"},null,null,{"$f":"IF('Наш прайс'!#REF!=0,\"\",'Наш прайс'!#REF!)","v":{"$error":"#REF!"}},{"$f":"IF('Наш прайс'!#REF!=0,\"\",'Наш прайс'!#REF!)","v":{"$error":"#REF!"}},{"$f":"IF('Наш прайс'!#REF!=0,\"\",'Наш прайс'!#REF!)","v":{"$error":"#REF!"}},{"$f":"IF('Наш прайс'!#REF!=0,\"\",'Наш прайс'!#REF!)","v":{"$error":"#REF!"}},{"$f":"IF('Наш прайс'!#REF!=0,\"\",'Наш прайс'!#REF!)","v":{"$error":"#REF!"}},{"$f":"IF('Наш прайс'!#REF!=0,\"\",'Наш прайс'!#REF!)","v":{"$error":"#REF!"}},{"$f":"IF('Наш прайс'!#REF!=0,\"\",'Наш прайс'!#REF!)","v":{"$error":"#REF!"}}]
[{"$f":"IF('Наш прайс'!#REF!=0,\"\",'Наш прайс'!#REF!)","v":{"$error":"#REF!"}},{"$f":"IF('Наш прайс'!#REF!=0,\"\",'Наш прайс'!#REF!)","v":{"$error":"#REF!"}},{"$f":"IF('Наш прайс'!#REF!=0,\"\",'Наш прайс'!#REF!)","v":{"$error":"#REF!"}},{"$error":"#REF!"},null,null,{"$f":"IF('Наш прайс'!#REF!=0,\"\",'Наш прайс'!#REF!)","v":{"$error":"#REF!"}},{"$f":"IF('Наш прайс'!#REF!=0,\"\",'Наш прайс'!#REF!)","v":{"$error":"#REF!"}},{"$f":"IF('Наш прайс'!#REF!=0,\"\",'Наш прайс'!#REF!)","v":{"$error":"#REF!"}},{"$f":"IF('Наш прайс'!#REF!=0,\"\",'Наш прайс'!#REF!)","v":{"$error":"#REF!"}},{"$f":"IF('Наш прайс'!#REF!=0,\"\",'Наш прайс'!#REF!)","v":{"$error":"#REF!"}},{"$f":"IF('Наш прайс'!#REF!=0,\"\",'Наш прайс'!#REF!)","v":{"$error":"#REF!"}},{"$f":"IF('Наш прайс'!#REF!=0,\"\",'Наш прайс'!#REF!)","v":{"$error":"#REF!"}}]
[{"$f":"IF('Наш прайс'!#REF!=0,\"\",'Наш прайс'!#REF!)","v":{"$error":"#REF!"}},{"$f":"IF('Наш прайс'!#REF!=0,\"\",'Наш прайс'!#REF!)","v":{"$error":"#REF!"}},{"$f":"IF('Наш прайс'!#REF!=0,\"\",'Наш прайс'!#REF!)","v":{"$error":"#REF!"}},{"$error":"#REF!"},null,null,{"$f":"IF('Наш прайс'!#REF!=0,\"\",'Наш прайс'!#REF!)","v":{"$error":"#REF!"}},{"$f":"IF('Наш прайс'!#REF!=0,\"\",'Наш прайс'!#REF!)","v":{"$error":"#REF!"}},{"$f":"IF('Наш прайс'!#REF!=0,\"\",'Наш прайс'!#REF!)","v":{"$error":"#REF!"}},{"$f":"IF('Наш прайс'!#REF!=0,\"\",'Наш прайс'!#REF!)","v":{"$error":"#REF!"}},{"$f":"IF('Наш прайс'!#REF!=0,\"\",'Наш прайс'!#REF!)","v":{"$error":"#REF!"}},{"$f":"IF('Наш прайс'!#REF!=0,\"\",'Наш прайс'!#REF!)","v":{"$error":"#REF!"}},{"$f":"IF('Наш прайс'!#REF!=0,\"\",'Наш прайс'!#REF!)","v":{"$error":"#REF!"}}]
[{"$f":"IF('Наш прайс'!#REF!=0,\"\",'Наш прайс'!#REF!)","v":{"$error":"#REF!"}},{"$f":"IF('Наш прайс'!#REF!=0,\"\",'Наш прайс'!#REF!)","v":{"$error":"#REF!"}},{"$f":"IF('Наш прайс'!#REF!=0,\"\",'Наш прайс'!#REF!)","v":{"$error":"#REF!"}},{"$error":"#REF!"},null,null,{"$f":"IF('Наш прайс'!#REF!=0,\"\",'Наш прайс'!#REF!)","v":{"$error":"#REF!"}},{"$f":"IF('Наш прайс'!#REF!=0,\"\",'Наш прайс'!#REF!)","v":{"$error":"#REF!"}},{"$f":"IF('Наш прайс'!#REF!=0,\"\",'Наш прайс'!#REF!)","v":{"$error":"#REF!"}},{"$f":"IF('Наш прайс'!#REF!=0,\"\",'Наш прайс'!#REF!)","v":{"$error":"#REF!"}},{"$f":"IF('Наш прайс'!#REF!=0,\"\",'Наш прайс'!#REF!)","v":{"$error":"#REF!"}},{"$f":"IF('Наш прайс'!#REF!=0,\"\",'Наш прайс'!#REF!)","v":{"$error":"#REF!"}},{"$f":"IF('Наш прайс'!#REF!=0,\"\",'Наш прайс'!#REF!)","v":{"$error":"#REF!"}}]
[{"$f":"IF('Наш прайс'!#REF!=0,\"\",'Наш прайс'!#REF!)","v":{"$error":"#REF!"}},{"$f":"IF('Наш прайс'!#REF!=0,\"\",'Наш прайс'!#REF!)","v":{"$error":"#REF!"}},{"$f":"IF('Наш прайс'!#REF!=0,\"\",'Наш прайс'!#REF!)","v":{"$error":"#REF!"}},{"$error":"#REF!"},null,null,{"$f":"IF('Наш прайс'!#REF!=0,\"\",'Наш прайс'!#REF!)","v":{"$error":"#REF!"}},{"$f":"IF('Наш прайс'!#REF!=0,\"\",'Наш прайс'!#REF!)","v":{"$error":"#REF!"}},{"$f":"IF('Наш прайс'!#REF!=0,\"\",'Наш прайс'!#REF!)","v":{"$error":"#REF!"}},{"$f":"IF('Наш прайс'!#REF!=0,\"\",'Наш прайс'!#REF!)","v":{"$error":"#REF!"}},{"$f":"IF('Наш прайс'!#REF!=0,\"\",'Наш прайс'!#REF!)","v":{"$error":"#REF!"}},{"$f":"IF('Наш прайс'!#REF!=0,\"\",'Наш прайс'!#REF!)","v":{"$error":"#REF!"}},{"$f":"IF('Наш прайс'!#REF!=0,\"\",'Наш прайс'!#REF!)","v":{"$error":"#REF!"}}]
[{"$f":"IF('Наш прайс'!#REF!=0,\"\",'Наш прайс'!#REF!)","v":{"$error":"#REF!"}},{"$f":"IF('Наш прайс'!#REF!=0,\"\",'Наш прайс'!#REF!)","v":{"$error":"#REF!"}},{"$f":"IF('Наш прайс'!#REF!=0,\"\",'Наш прайс'!#REF!)","v":{"$error":"#REF!"}},{"$error":"#REF!"},null,null,{"$f":"IF('Наш прайс'!#REF!=0,\"\",'Наш прайс'!#REF!)","v":{"$error":"#REF!"}},{"$f":"IF('Наш прайс'!#REF!=0,\"\",'Наш прайс'!#REF!)","v":{"$error":"#REF!"}},{"$f":"IF('Наш прайс'!#REF!=0,\"\",'Наш прайс'!#REF!)","v":{"$error":"#REF!"}},{"$f":"IF('Наш прайс'!#REF!=0,\"\",'Наш прайс'!#REF!)","v":{"$error":"#REF!"}},{"$f":"IF('Наш прайс'!#REF!=0,\"\",'Наш прайс'!#REF!)","v":{"$error":"#REF!"}},{"$f":"IF('Наш прайс'!#REF!=0,\"\",'Наш прайс'!#REF!)","v":{"$error":"#REF!"}},{"$f":"IF('Наш прайс'!#REF!=0,\"\",'Наш прайс'!#REF!)","v":{"$error":"#REF!"}}]
[{"$f":"IF('Наш прайс'!#REF!=0,\"\",'Наш прайс'!#REF!)","v":{"$error":"#REF!"}},{"$f":"IF('Наш прайс'!#REF!=0,\"\",'Наш прайс'!#REF!)","v":{"$error":"#REF!"}},{"$f":"IF('Наш прайс'!#REF!=0,\"\",'Наш прайс'!#REF!)","v":{"$error":"#REF!"}},{"$error":"#REF!"},null,null,{"$f":"IF('Наш прайс'!#REF!=0,\"\",'Наш прайс'!#REF!)","v":{"$error":"#REF!"}},{"$f":"IF('Наш прайс'!#REF!=0,\"\",'Наш прайс'!#REF!)","v":{"$error":"#REF!"}},{"$f":"IF('Наш прайс'!#REF!=0,\"\",'Наш прайс'!#REF!)","v":{"$error":"#REF!"}},{"$f":"IF('Наш прайс'!#REF!=0,\"\",'Наш прайс'!#REF!)","v":{"$error":"#REF!"}},{"$f":"IF('Наш прайс'!#REF!=0,\"\",'Наш прайс'!#REF!)","v":{"$error":"#REF!"}},{"$f":"IF('Наш прайс'!#REF!=0,\"\",'Наш прайс'!#REF!)","v":{"$error":"#REF!"}},{"$f":"IF('Наш прайс'!#REF!=0,\"\",'Наш прайс'!#REF!)","v":{"$error":"#REF!"}}]
[{"$f":"IF('Наш прайс'!#REF!=0,\"\",'Наш прайс'!#REF!)","v":{"$error":"#REF!"}},{"$f":"IF('Наш прайс'!#REF!=0,\"\",'Наш прайс'!#REF!)","v":{"$error":"#REF!"}},{"$f":"IF('Наш прайс'!#REF!=0,\"\",'Наш прайс'!#REF!)","v":{"$error":"#REF!"}},{"$error":"#REF!"},null,null,{"$f":"IF('Наш прайс'!#REF!=0,\"\",'Наш прайс'!#REF!)","v":{"$error":"#REF!"}},{"$f":"IF('Наш прайс'!#REF!=0,\"\",'Наш прайс'!#REF!)","v":{"$error":"#REF!"}},{"$f":"IF('Наш прайс'!#REF!=0,\"\",'Наш прайс'!#REF!)","v":{"$error":"#REF!"}},{"$f":"IF('Наш прайс'!#REF!=0,\"\",'Наш прайс'!#REF!)","v":{"$error":"#REF!"}},{"$f":"IF('Наш прайс'!#REF!=0,\"\",'Наш прайс'!#REF!)","v":{"$error":"#REF!"}},{"$f":"IF('Наш прайс'!#REF!=0,\"\",'Наш прайс'!#REF!)","v":{"$error":"#REF!"}},{"$f":"IF('Наш прайс'!#REF!=0,\"\",'Наш прайс'!#REF!)","v":{"$error":"#REF!"}}]
[{"$f":"IF('Наш прайс'!#REF!=0,\"\",'Наш прайс'!#REF!)","v":{"$error":"#REF!"}},{"$f":"IF('Наш прайс'!#REF!=0,\"\",'Наш прайс'!#REF!)","v":{"$error":"#REF!"}},{"$f":"IF('Наш прайс'!#REF!=0,\"\",'Наш прайс'!#REF!)","v":{"$error":"#REF!"}},{"$error":"#REF!"},null,null,{"$f":"IF('Наш прайс'!#REF!=0,\"\",'Наш прайс'!#REF!)","v":{"$error":"#REF!"}},{"$f":"IF('Наш прайс'!#REF!=0,\"\",'Наш прайс'!#REF!)","v":{"$error":"#REF!"}},{"$f":"IF('Наш прайс'!#REF!=0,\"\",'Наш прайс'!#REF!)","v":{"$error":"#REF!"}},{"$f":"IF('Наш прайс'!#REF!=0,\"\",'Наш прайс'!#REF!)","v":{"$error":"#REF!"}},{"$f":"IF('Наш прайс'!#REF!=0,\"\",'Наш прайс'!#REF!)","v":{"$error":"#REF!"}},{"$f":"IF('Наш прайс'!#REF!=0,\"\",'Наш прайс'!#REF!)","v":{"$error":"#REF!"}},{"$f":"IF('Наш прайс'!#REF!=0,\"\",'Наш прайс'!#REF!)","v":{"$error":"#REF!"}}]
[{"$f":"IF('Наш прайс'!#REF!=0,\"\",'Наш прайс'!#REF!)","v":{"$error":"#REF!"}},{"$f":"IF('Наш прайс'!#REF!=0,\"\",'Наш прайс'!#REF!)","v":{"$error":"#REF!"}},{"$f":"IF('Наш прайс'!#REF!=0,\"\",'Наш прайс'!#REF!)","v":{"$error":"#REF!"}},{"$error":"#REF!"},null,null,{"$f":"IF('Наш прайс'!#REF!=0,\"\",'Наш прайс'!#REF!)","v":{"$error":"#REF!"}},{"$f":"IF('Наш прайс'!#REF!=0,\"\",'Наш прайс'!#REF!)","v":{"$error":"#REF!"}},{"$f":"IF('Наш прайс'!#REF!=0,\"\",'Наш прайс'!#REF!)","v":{"$error":"#REF!"}},{"$f":"IF('Наш прайс'!#REF!=0,\"\",'Наш прайс'!#REF!)","v":{"$error":"#REF!"}},{"$f":"IF('Наш прайс'!#REF!=0,\"\",'Наш прайс'!#REF!)","v":{"$error":"#REF!"}},{"$f":"IF('Наш прайс'!#REF!=0,\"\",'Наш прайс'!#REF!)","v":{"$error":"#REF!"}},{"$f":"IF('Наш прайс'!#REF!=0,\"\",'Наш прайс'!#REF!)","v":{"$error":"#REF!"}}]
[{"$f":"IF('Наш прайс'!#REF!=0,\"\",'Наш прайс'!#REF!)","v":{"$error":"#REF!"}},{"$f":"IF('Наш прайс'!#REF!=0,\"\",'Наш прайс'!#REF!)","v":{"$error":"#REF!"}},{"$f":"IF('Наш прайс'!#REF!=0,\"\",'Наш прайс'!#REF!)","v":{"$error":"#REF!"}},{"$error":"#REF!"},null,null,{"$f":"IF('Наш прайс'!#REF!=0,\"\",'Наш прайс'!#REF!)","v":{"$error":"#REF!"}},{"$f":"IF('Наш прайс'!#REF!=0,\"\",'Наш прайс'!#REF!)","v":{"$error":"#REF!"}},{"$f":"IF('Наш прайс'!#REF!=0,\"\",'Наш прайс'!#REF!)","v":{"$error":"#REF!"}},{"$f":"IF('Наш прайс'!#REF!=0,\"\",'Наш прайс'!#REF!)","v":{"$error":"#REF!"}},{"$f":"IF('Наш прайс'!#REF!=0,\"\",'Наш прайс'!#REF!)","v":{"$error":"#REF!"}},{"$f":"IF('Наш прайс'!#REF!=0,\"\",'Наш прайс'!#REF!)","v":{"$error":"#REF!"}},{"$f":"IF('Наш прайс'!#REF!=0,\"\",'Наш прайс'!#REF!)","v":{"$error":"#REF!"}}]
[{"$f":"IF('Наш прайс'!#REF!=0,\"\",'Наш прайс'!#REF!)","v":{"$error":"#REF!"}},{"$f":"IF('Наш прайс'!#REF!=0,\"\",'Наш прайс'!#REF!)","v":{"$error":"#REF!"}},{"$f":"IF('Наш прайс'!#REF!=0,\"\",'Наш прайс'!#REF!)","v":{"$error":"#REF!"}},{"$error":"#REF!"},null,null,{"$f":"IF('Наш прайс'!#REF!=0,\"\",'Наш прайс'!#REF!)","v":{"$error":"#REF!"}},{"$f":"IF('Наш прайс'!#REF!=0,\"\",'Наш прайс'!#REF!)","v":{"$error":"#REF!"}},{"$f":"IF('Наш прайс'!#REF!=0,\"\",'Наш прайс'!#REF!)","v":{"$error":"#REF!"}},{"$f":"IF('Наш прайс'!#REF!=0,\"\",'Наш прайс'!#REF!)","v":{"$error":"#REF!"}},{"$f":"IF('Наш прайс'!#REF!=0,\"\",'Наш прайс'!#REF!)","v":{"$error":"#REF!"}},{"$f":"IF('Наш прайс'!#REF!=0,\"\",'Наш прайс'!#REF!)","v":{"$error":"#REF!"}},{"$f":"IF('Наш прайс'!#REF!=0,\"\",'Наш прайс'!#REF!)","v":{"$error":"#REF!"}}]
[{"$f":"IF('Наш прайс'!#REF!=0,\"\",'Наш прайс'!#REF!)","v":{"$error":"#REF!"}},{"$f":"IF('Наш прайс'!#REF!=0,\"\",'Наш прайс'!#REF!)","v":{"$error":"#REF!"}},{"$f":"IF('Наш прайс'!#REF!=0,\"\",'Наш прайс'!#REF!)","v":{"$error":"#REF!"}},{"$error":"#REF!"},null,null,{"$f":"IF('Наш прайс'!#REF!=0,\"\",'Наш прайс'!#REF!)","v":{"$error":"#REF!"}},{"$f":"IF('Наш прайс'!#REF!=0,\"\",'Наш прайс'!#REF!)","v":{"$error":"#REF!"}},{"$f":"IF('Наш прайс'!#REF!=0,\"\",'Наш прайс'!#REF!)","v":{"$error":"#REF!"}},{"$f":"IF('Наш прайс'!#REF!=0,\"\",'Наш прайс'!#REF!)","v":{"$error":"#REF!"}},{"$f":"IF('Наш прайс'!#REF!=0,\"\",'Наш прайс'!#REF!)","v":{"$error":"#REF!"}},{"$f":"IF('Наш прайс'!#REF!=0,\"\",'Наш прайс'!#REF!)","v":{"$error":"#REF!"}},{"$f":"IF('Наш прайс'!#REF!=0,\"\",'Наш прайс'!#REF!)","v":{"$error":"#REF!"}}]
[{"$f":"IF('Наш прайс'!#REF!=0,\"\",'Наш прайс'!#REF!)","v":{"$error":"#REF!"}},{"$f":"IF('Наш прайс'!#REF!=0,\"\",'Наш прайс'!#REF!)","v":{"$error":"#REF!"}},{"$f":"IF('Наш прайс'!#REF!=0,\"\",'Наш прайс'!#REF!)","v":{"$error":"#REF!"}},{"$error":"#REF!"},null,null,{"$f":"IF('Наш прайс'!#REF!=0,\"\",'Наш прайс'!#REF!)","v":{"$error":"#REF!"}},{"$f":"IF('Наш прайс'!#REF!=0,\"\",'Наш прайс'!#REF!)","v":{"$error":"#REF!"}},{"$f":"IF('Наш прайс'!#REF!=0,\"\",'Наш прайс'!#REF!)","v":{"$error":"#REF!"}},{"$f":"IF('Наш прайс'!#REF!=0,\"\",'Наш прайс'!#REF!)","v":{"$error":"#REF!"}},{"$f":"IF('Наш прайс'!#REF!=0,\"\",'Наш прайс'!#REF!)","v":{"$error":"#REF!"}},{"$f":"IF('Наш прайс'!#REF!=0,\"\",'Наш прайс'!#REF!)","v":{"$error":"#REF!"}},{"$f":"IF('Наш прайс'!#REF!=0,\"\",'Наш прайс'!#REF!)","v":{"$error":"#REF!"}}]
[{"$f":"IF('Наш прайс'!#REF!=0,\"\",'Наш прайс'!#REF!)","v":{"$error":"#REF!"}},{"$f":"IF('Наш прайс'!#REF!=0,\"\",'Наш прайс'!#REF!)","v":{"$error":"#REF!"}},{"$f":"IF('Наш прайс'!#REF!=0,\"\",'Наш прайс'!#REF!)","v":{"$error":"#REF!"}},{"$error":"#REF!"},null,null,{"$f":"IF('Наш прайс'!#REF!=0,\"\",'Наш прайс'!#REF!)","v":{"$error":"#REF!"}},{"$f":"IF('Наш прайс'!#REF!=0,\"\",'Наш прайс'!#REF!)","v":{"$error":"#REF!"}},{"$f":"IF('Наш прайс'!#REF!=0,\"\",'Наш прайс'!#REF!)","v":{"$error":"#REF!"}},{"$f":"IF('Наш прайс'!#REF!=0,\"\",'Наш прайс'!#REF!)","v":{"$error":"#REF!"}},{"$f":"IF('Наш прайс'!#REF!=0,\"\",'Наш прайс'!#REF!)","v":{"$error":"#REF!"}},{"$f":"IF('Наш прайс'!#REF!=0,\"\",'Наш прайс'!#REF!)","v":{"$error":"#REF!"}},{"$f":"IF('Наш прайс'!#REF!=0,\"\",'Наш прайс'!#REF!)","v":{"$error":"#REF!"}}]
[{"$f":"IF('Наш прайс'!#REF!=0,\"\",'Наш прайс'!#REF!)","v":{"$error":"#REF!"}},{"$f":"IF('Наш прайс'!#REF!=0,\"\",'Наш прайс'!#REF!)","v":{"$error":"#REF!"}},{"$f":"IF('Наш прайс'!#REF!=0,\"\",'Наш прайс'!#REF!)","v":{"$error":"#REF!"}},{"$error":"#REF!"},null,null,{"$f":"IF('Наш прайс'!#REF!=0,\"\",'Наш прайс'!#REF!)","v":{"$error":"#REF!"}},{"$f":"IF('Наш прайс'!#REF!=0,\"\",'Наш прайс'!#REF!)","v":{"$error":"#REF!"}},{"$f":"IF('Наш прайс'!#REF!=0,\"\",'Наш прайс'!#REF!)","v":{"$error":"#REF!"}},{"$f":"IF('Наш прайс'!#REF!=0,\"\",'Наш прайс'!#REF!)","v":{"$error":"#REF!"}},{"$f":"IF('Наш прайс'!#REF!=0,\"\",'Наш прайс'!#REF!)","v":{"$error":"#REF!"}},{"$f":"IF('Наш прайс'!#REF!=0,\"\",'Наш прайс'!#REF!)","v":{"$error":"#REF!"}},{"$f":"IF('Наш прайс'!#REF!=0,\"\",'Наш прайс'!#REF!)","v":{"$error":"#REF!"}}]
[{"$f":"IF('Наш прайс'!#REF!=0,\"\",'Наш прайс'!#REF!)","v":{"$error":"#REF!"}},{"$f":"IF('Наш прайс'!#REF!=0,\"\",'Наш прайс'!#REF!)","v":{"$error":"#REF!"}},{"$f":"IF('Наш прайс'!#REF!=0,\"\",'Наш прайс'!#REF!)","v":{"$error":"#REF!"}},{"$error":"#REF!"},null,null,{"$f":"IF('Наш прайс'!#REF!=0,\"\",'Наш прайс'!#REF!)","v":{"$error":"#REF!"}},{"$f":"IF('Наш прайс'!#REF!=0,\"\",'Наш прайс'!#REF!)","v":{"$error":"#REF!"}},{"$f":"IF('Наш прайс'!#REF!=0,\"\",'Наш прайс'!#REF!)","v":{"$error":"#REF!"}},{"$f":"IF('Наш прайс'!#REF!=0,\"\",'Наш прайс'!#REF!)","v":{"$error":"#REF!"}},{"$f":"IF('Наш прайс'!#REF!=0,\"\",'Наш прайс'!#REF!)","v":{"$error":"#REF!"}},{"$f":"IF('Наш прайс'!#REF!=0,\"\",'Наш прайс'!#REF!)","v":{"$error":"#REF!"}},{"$f":"IF('Наш прайс'!#REF!=0,\"\",'Наш прайс'!#REF!)","v":{"$error":"#REF!"}}]
[{"$f":"IF('Наш прайс'!#REF!=0,\"\",'Наш прайс'!#REF!)","v":{"$error":"#REF!"}},{"$f":"IF('Наш прайс'!#REF!=0,\"\",'Наш прайс'!#REF!)","v":{"$error":"#REF!"}},{"$f":"IF('Наш прайс'!#REF!=0,\"\",'Наш прайс'!#REF!)","v":{"$error":"#REF!"}},{"$error":"#REF!"},null,null,{"$f":"IF('Наш прайс'!#REF!=0,\"\",'Наш прайс'!#REF!)","v":{"$error":"#REF!"}},{"$f":"IF('Наш прайс'!#REF!=0,\"\",'Наш прайс'!#REF!)","v":{"$error":"#REF!"}},{"$f":"IF('Наш прайс'!#REF!=0,\"\",'Наш прайс'!#REF!)","v":{"$error":"#REF!"}},{"$f":"IF('Наш прайс'!#REF!=0,\"\",'Наш прайс'!#REF!)","v":{"$error":"#REF!"}},{"$f":"IF('Наш прайс'!#REF!=0,\"\",'Наш прайс'!#REF!)","v":{"$error":"#REF!"}},{"$f":"IF('Наш прайс'!#REF!=0,\"\",'Наш прайс'!#REF!)","v":{"$error":"#REF!"}},{"$f":"IF('Наш прайс'!#REF!=0,\"\",'Наш прайс'!#REF!)","v":{"$error":"#REF!"}}]
[{"$f":"IF('Наш прайс'!#REF!=0,\"\",'Наш прайс'!#REF!)","v":{"$error":"#REF!"}},{"$f":"IF('Наш прайс'!#REF!=0,\"\",'Наш прайс'!#REF!)","v":{"$error":"#REF!"}},{"$f":"IF('Наш прайс'!#REF!=0,\"\",'Наш прайс'!#REF!)","v":{"$error":"#REF!"}},{"$error":"#REF!"},null,null,{"$f":"IF('Наш прайс'!#REF!=0,\"\",'Наш прайс'!#REF!)","v":{"$error":"#REF!"}},{"$f":"IF('Наш прайс'!#REF!=0,\"\",'Наш прайс'!#REF!)","v":{"$error":"#REF!"}},{"$f":"IF('Наш прайс'!#REF!=0,\"\",'Наш прайс'!#REF!)","v":{"$error":"#REF!"}},{"$f":"IF('Наш прайс'!#REF!=0,\"\",'Наш прайс'!#REF!)","v":{"$error":"#REF!"}},{"$f":"IF('Наш прайс'!#REF!=0,\"\",'Наш прайс'!#REF!)","v":{"$error":"#REF!"}},{"$f":"IF('Наш прайс'!#REF!=0,\"\",'Наш прайс'!#REF!)","v":{"$error":"#REF!"}},{"$f":"IF('Наш прайс'!#REF!=0,\"\",'Наш прайс'!#REF!)","v":{"$error":"#REF!"}}]
[{"$f":"IF('Наш прайс'!#REF!=0,\"\",'Наш прайс'!#REF!)","v":{"$error":"#REF!"}},{"$f":"IF('Наш прайс'!#REF!=0,\"\",'Наш прайс'!#REF!)","v":{"$error":"#REF!"}},{"$f":"IF('Наш прайс'!#REF!=0,\"\",'Наш прайс'!#REF!)","v":{"$error":"#REF!"}},{"$error":"#REF!"},null,null,{"$f":"IF('Наш прайс'!#REF!=0,\"\",'Наш прайс'!#REF!)","v":{"$error":"#REF!"}},{"$f":"IF('Наш прайс'!#REF!=0,\"\",'Наш прайс'!#REF!)","v":{"$error":"#REF!"}},{"$f":"IF('Наш прайс'!#REF!=0,\"\",'Наш прайс'!#REF!)","v":{"$error":"#REF!"}},{"$f":"IF('Наш прайс'!#REF!=0,\"\",'Наш прайс'!#REF!)","v":{"$error":"#REF!"}},{"$f":"IF('Наш прайс'!#REF!=0,\"\",'Наш прайс'!#REF!)","v":{"$error":"#REF!"}},{"$f":"IF('Наш прайс'!#REF!=0,\"\",'Наш прайс'!#REF!)","v":{"$error":"#REF!"}},{"$f":"IF('Наш прайс'!#REF!=0,\"\",'Наш прайс'!#REF!)","v":{"$error":"#REF!"}}]
[{"$f":"IF('Наш прайс'!#REF!=0,\"\",'Наш прайс'!#REF!)","v":{"$error":"#REF!"}},{"$f":"IF('Наш прайс'!#REF!=0,\"\",'Наш прайс'!#REF!)","v":{"$error":"#REF!"}},{"$f":"IF('Наш прайс'!#REF!=0,\"\",'Наш прайс'!#REF!)","v":{"$error":"#REF!"}},{"$error":"#REF!"},null,null,{"$f":"IF('Наш прайс'!#REF!=0,\"\",'Наш прайс'!#REF!)","v":{"$error":"#REF!"}},{"$f":"IF('Наш прайс'!#REF!=0,\"\",'Наш прайс'!#REF!)","v":{"$error":"#REF!"}},{"$f":"IF('Наш прайс'!#REF!=0,\"\",'Наш прайс'!#REF!)","v":{"$error":"#REF!"}},{"$f":"IF('Наш прайс'!#REF!=0,\"\",'Наш прайс'!#REF!)","v":{"$error":"#REF!"}},{"$f":"IF('Наш прайс'!#REF!=0,\"\",'Наш прайс'!#REF!)","v":{"$error":"#REF!"}},{"$f":"IF('Наш прайс'!#REF!=0,\"\",'Наш прайс'!#REF!)","v":{"$error":"#REF!"}},{"$f":"IF('Наш прайс'!#REF!=0,\"\",'Наш прайс'!#REF!)","v":{"$error":"#REF!"}}]
[{"$f":"IF('Наш прайс'!#REF!=0,\"\",'Наш прайс'!#REF!)","v":{"$error":"#REF!"}},{"$f":"IF('Наш прайс'!#REF!=0,\"\",'Наш прайс'!#REF!)","v":{"$error":"#REF!"}},{"$f":"IF('Наш прайс'!#REF!=0,\"\",'Наш прайс'!#REF!)","v":{"$error":"#REF!"}},{"$error":"#REF!"},null,null,{"$f":"IF('Наш прайс'!#REF!=0,\"\",'Наш прайс'!#REF!)","v":{"$error":"#REF!"}},{"$f":"IF('Наш прайс'!#REF!=0,\"\",'Наш прайс'!#REF!)","v":{"$error":"#REF!"}},{"$f":"IF('Наш прайс'!#REF!=0,\"\",'Наш прайс'!#REF!)","v":{"$error":"#REF!"}},{"$f":"IF('Наш прайс'!#REF!=0,\"\",'Наш прайс'!#REF!)","v":{"$error":"#REF!"}},{"$f":"IF('Наш прайс'!#REF!=0,\"\",'Наш прайс'!#REF!)","v":{"$error":"#REF!"}},{"$f":"IF('Наш прайс'!#REF!=0,\"\",'Наш прайс'!#REF!)","v":{"$error":"#REF!"}},{"$f":"IF('Наш прайс'!#REF!=0,\"\",'Наш прайс'!#REF!)","v":{"$error":"#REF!"}}]
[{"$f":"IF('Наш прайс'!#REF!=0,\"\",'Наш прайс'!#REF!)","v":{"$error":"#REF!"}},{"$f":"IF('Наш прайс'!#REF!=0,\"\",'Наш прайс'!#REF!)","v":{"$error":"#REF!"}},{"$f":"IF('Наш прайс'!#REF!=0,\"\",'Наш прайс'!#REF!)","v":{"$error":"#REF!"}},{"$error":"#REF!"},null,null,{"$f":"IF('Наш прайс'!#REF!=0,\"\",'Наш прайс'!#REF!)","v":{"$error":"#REF!"}},{"$f":"IF('Наш прайс'!#REF!=0,\"\",'Наш прайс'!#REF!)","v":{"$error":"#REF!"}},{"$f":"IF('Наш прайс'!#REF!=0,\"\",'Наш прайс'!#REF!)","v":{"$error":"#REF!"}},{"$f":"IF('Наш прайс'!#REF!=0,\"\",'Наш прайс'!#REF!)","v":{"$error":"#REF!"}},{"$f":"IF('Наш прайс'!#REF!=0,\"\",'Наш прайс'!#REF!)","v":{"$error":"#REF!"}},{"$f":"IF('Наш прайс'!#REF!=0,\"\",'Наш прайс'!#REF!)","v":{"$error":"#REF!"}},{"$f":"IF('Наш прайс'!#REF!=0,\"\",'Наш прайс'!#REF!)","v":{"$error":"#REF!"}}]
[{"$f":"IF('Наш прайс'!#REF!=0,\"\",'Наш прайс'!#REF!)","v":{"$error":"#REF!"}},{"$f":"IF('Наш прайс'!#REF!=0,\"\",'Наш прайс'!#REF!)","v":{"$error":"#REF!"}},{"$f":"IF('Наш прайс'!#REF!=0,\"\",'Наш прайс'!#REF!)","v":{"$error":"#REF!"}},{"$error":"#REF!"},null,null,{"$f":"IF('Наш прайс'!#REF!=0,\"\",'Наш прайс'!#REF!)","v":{"$error":"#REF!"}},{"$f":"IF('Наш прайс'!#REF!=0,\"\",'Наш прайс'!#REF!)","v":{"$error":"#REF!"}},{"$f":"IF('Наш прайс'!#REF!=0,\"\",'Наш прайс'!#REF!)","v":{"$error":"#REF!"}},{"$f":"IF('Наш прайс'!#REF!=0,\"\",'Наш прайс'!#REF!)","v":{"$error":"#REF!"}},{"$f":"IF('Наш прайс'!#REF!=0,\"\",'Наш прайс'!#REF!)","v":{"$error":"#REF!"}},{"$f":"IF('Наш прайс'!#REF!=0,\"\",'Наш прайс'!#REF!)","v":{"$error":"#REF!"}},{"$f":"IF('Наш прайс'!#REF!=0,\"\",'Наш прайс'!#REF!)","v":{"$error":"#REF!"}}]
[{"$f":"IF('Наш прайс'!#REF!=0,\"\",'Наш прайс'!#REF!)","v":{"$error":"#REF!"}},{"$f":"IF('Наш прайс'!#REF!=0,\"\",'Наш прайс'!#REF!)","v":{"$error":"#REF!"}},{"$f":"IF('Наш прайс'!#REF!=0,\"\",'Наш прайс'!#REF!)","v":{"$error":"#REF!"}},{"$error":"#REF!"},null,null,{"$f":"IF('Наш прайс'!#REF!=0,\"\",'Наш прайс'!#REF!)","v":{"$error":"#REF!"}},{"$f":"IF('Наш прайс'!#REF!=0,\"\",'Наш прайс'!#REF!)","v":{"$error":"#REF!"}},{"$f":"IF('Наш прайс'!#REF!=0,\"\",'Наш прайс'!#REF!)","v":{"$error":"#REF!"}},{"$f":"IF('Наш прайс'!#REF!=0,\"\",'Наш прайс'!#REF!)","v":{"$error":"#REF!"}},{"$f":"IF('Наш прайс'!#REF!=0,\"\",'Наш прайс'!#REF!)","v":{"$error":"#REF!"}},{"$f":"IF('Наш прайс'!#REF!=0,\"\",'Наш прайс'!#REF!)","v":{"$error":"#REF!"}},{"$f":"IF('Наш прайс'!#REF!=0,\"\",'Наш прайс'!#REF!)","v":{"$error":"#REF!"}}]
[{"$f":"IF('Наш прайс'!#REF!=0,\"\",'Наш прайс'!#REF!)","v":{"$error":"#REF!"}},{"$f":"IF('Наш прайс'!#REF!=0,\"\",'Наш прайс'!#REF!)","v":{"$error":"#REF!"}},{"$f":"IF('Наш прайс'!#REF!=0,\"\",'Наш прайс'!#REF!)","v":{"$error":"#REF!"}},{"$error":"#REF!"},null,null,{"$f":"IF('Наш прайс'!#REF!=0,\"\",'Наш прайс'!#REF!)","v":{"$error":"#REF!"}},{"$f":"IF('Наш прайс'!#REF!=0,\"\",'Наш прайс'!#REF!)","v":{"$error":"#REF!"}},{"$f":"IF('Наш прайс'!#REF!=0,\"\",'Наш прайс'!#REF!)","v":{"$error":"#REF!"}},{"$f":"IF('Наш прайс'!#REF!=0,\"\",'Наш прайс'!#REF!)","v":{"$error":"#REF!"}},{"$f":"IF('Наш прайс'!#REF!=0,\"\",'Наш прайс'!#REF!)","v":{"$error":"#REF!"}},{"$f":"IF('Наш прайс'!#REF!=0,\"\",'Наш прайс'!#REF!)","v":{"$error":"#REF!"}},{"$f":"IF('Наш прайс'!#REF!=0,\"\",'Наш прайс'!#REF!)","v":{"$error":"#REF!"}}]
[{"$f":"IF('Наш прайс'!#REF!=0,\"\",'Наш прайс'!#REF!)","v":{"$error":"#REF!"}},{"$f":"IF('Наш прайс'!#REF!=0,\"\",'Наш прайс'!#REF!)","v":{"$error":"#REF!"}},{"$f":"IF('Наш прайс'!#REF!=0,\"\",'Наш прайс'!#REF!)","v":{"$error":"#REF!"}},{"$error":"#REF!"},null,null,{"$f":"IF('Наш прайс'!#REF!=0,\"\",'Наш прайс'!#REF!)","v":{"$error":"#REF!"}},{"$f":"IF('Наш прайс'!#REF!=0,\"\",'Наш прайс'!#REF!)","v":{"$error":"#REF!"}},{"$f":"IF('Наш прайс'!#REF!=0,\"\",'Наш прайс'!#REF!)","v":{"$error":"#REF!"}},{"$f":"IF('Наш прайс'!#REF!=0,\"\",'Наш прайс'!#REF!)","v":{"$error":"#REF!"}},{"$f":"IF('Наш прайс'!#REF!=0,\"\",'Наш прайс'!#REF!)","v":{"$error":"#REF!"}},{"$f":"IF('Наш прайс'!#REF!=0,\"\",'Наш прайс'!#REF!)","v":{"$error":"#REF!"}},{"$f":"IF('Наш прайс'!#REF!=0,\"\",'Наш прайс'!#REF!)","v":{"$error":"#REF!"}}]
[{"$f":"IF('Наш прайс'!#REF!=0,\"\",'Наш прайс'!#REF!)","v":{"$error":"#REF!"}},{"$f":"IF('Наш прайс'!#REF!=0,\"\",'Наш прайс'!#REF!)","v":{"$error":"#REF!"}},{"$f":"IF('Наш прайс'!#REF!=0,\"\",'Наш прайс'!#REF!)","v":{"$error":"#REF!"}},{"$error":"#REF!"},null,null,{"$f":"IF('Наш прайс'!#REF!=0,\"\",'Наш прайс'!#REF!)","v":{"$error":"#REF!"}},{"$f":"IF('Наш прайс'!#REF!=0,\"\",'Наш прайс'!#REF!)","v":{"$error":"#REF!"}},{"$f":"IF('Наш прайс'!#REF!=0,\"\",'Наш прайс'!#REF!)","v":{"$error":"#REF!"}},{"$f":"IF('Наш прайс'!#REF!=0,\"\",'Наш прайс'!#REF!)","v":{"$error":"#REF!"}},{"$f":"IF('Наш прайс'!#REF!=0,\"\",'Наш прайс'!#REF!)","v":{"$error":"#REF!"}},{"$f":"IF('Наш прайс'!#REF!=0,\"\",'Наш прайс'!#REF!)","v":{"$error":"#REF!"}},{"$f":"IF('Наш прайс'!#REF!=0,\"\",'Наш прайс'!#REF!)","v":{"$error":"#REF!"}}]
[{"$f":"IF('Наш прайс'!#REF!=0,\"\",'Наш прайс'!#REF!)","v":{"$error":"#REF!"}},{"$f":"IF('Наш прайс'!#REF!=0,\"\",'Наш прайс'!#REF!)","v":{"$error":"#REF!"}},{"$f":"IF('Наш прайс'!#REF!=0,\"\",'Наш прайс'!#REF!)","v":{"$error":"#REF!"}},{"$error":"#REF!"},null,null,{"$f":"IF('Наш прайс'!#REF!=0,\"\",'Наш прайс'!#REF!)","v":{"$error":"#REF!"}},{"$f":"IF('Наш прайс'!#REF!=0,\"\",'Наш прайс'!#REF!)","v":{"$error":"#REF!"}},{"$f":"IF('Наш прайс'!#REF!=0,\"\",'Наш прайс'!#REF!)","v":{"$error":"#REF!"}},{"$f":"IF('Наш прайс'!#REF!=0,\"\",'Наш прайс'!#REF!)","v":{"$error":"#REF!"}},{"$f":"IF('Наш прайс'!#REF!=0,\"\",'Наш прайс'!#REF!)","v":{"$error":"#REF!"}},{"$f":"IF('Наш прайс'!#REF!=0,\"\",'Наш прайс'!#REF!)","v":{"$error":"#REF!"}},{"$f":"IF('Наш прайс'!#REF!=0,\"\",'Наш прайс'!#REF!)","v":{"$error":"#REF!"}}]
[{"$f":"IF('Наш прайс'!#REF!=0,\"\",'Наш прайс'!#REF!)","v":{"$error":"#REF!"}},{"$f":"IF('Наш прайс'!#REF!=0,\"\",'Наш прайс'!#REF!)","v":{"$error":"#REF!"}},{"$f":"IF('Наш прайс'!#REF!=0,\"\",'Наш прайс'!#REF!)","v":{"$error":"#REF!"}},{"$error":"#REF!"},null,null,{"$f":"IF('Наш прайс'!#REF!=0,\"\",'Наш прайс'!#REF!)","v":{"$error":"#REF!"}},{"$f":"IF('Наш прайс'!#REF!=0,\"\",'Наш прайс'!#REF!)","v":{"$error":"#REF!"}},{"$f":"IF('Наш прайс'!#REF!=0,\"\",'Наш прайс'!#REF!)","v":{"$error":"#REF!"}},{"$f":"IF('Наш прайс'!#REF!=0,\"\",'Наш прайс'!#REF!)","v":{"$error":"#REF!"}},{"$f":"IF('Наш прайс'!#REF!=0,\"\",'Наш прайс'!#REF!)","v":{"$error":"#REF!"}},{"$f":"IF('Наш прайс'!#REF!=0,\"\",'Наш прайс'!#REF!)","v":{"$error":"#REF!"}},{"$f":"IF('Наш прайс'!#REF!=0,\"\",'Наш прайс'!#REF!)","v":{"$error":"#REF!"}}]
[{"$f":"IF('Наш прайс'!#REF!=0,\"\",'Наш прайс'!#REF!)","v":{"$error":"#REF!"}},{"$f":"IF('Наш прайс'!#REF!=0,\"\",'Наш прайс'!#REF!)","v":{"$error":"#REF!"}},{"$f":"IF('Наш прайс'!#REF!=0,\"\",'Наш прайс'!#REF!)","v":{"$error":"#REF!"}},{"$error":"#REF!"},null,null,{"$f":"IF('Наш прайс'!#REF!=0,\"\",'Наш прайс'!#REF!)","v":{"$error":"#REF!"}},{"$f":"IF('Наш прайс'!#REF!=0,\"\",'Наш прайс'!#REF!)","v":{"$error":"#REF!"}},{"$f":"IF('Наш прайс'!#REF!=0,\"\",'Наш прайс'!#REF!)","v":{"$error":"#REF!"}},{"$f":"IF('Наш прайс'!#REF!=0,\"\",'Наш прайс'!#REF!)","v":{"$error":"#REF!"}},{"$f":"IF('Наш прайс'!#REF!=0,\"\",'Наш прайс'!#REF!)","v":{"$error":"#REF!"}},{"$f":"IF('Наш прайс'!#REF!=0,\"\",'Наш прайс'!#REF!)","v":{"$error":"#REF!"}},{"$f":"IF('Наш прайс'!#REF!=0,\"\",'Наш прайс'!#REF!)","v":{"$error":"#REF!"}}]
[{"$f":"IF('Наш прайс'!#REF!=0,\"\",'Наш прайс'!#REF!)","v":{"$error":"#REF!"}},{"$f":"IF('Наш прайс'!#REF!=0,\"\",'Наш прайс'!#REF!)","v":{"$error":"#REF!"}},{"$f":"IF('Наш прайс'!#REF!=0,\"\",'Наш прайс'!#REF!)","v":{"$error":"#REF!"}},{"$error":"#REF!"},null,null,{"$f":"IF('Наш прайс'!#REF!=0,\"\",'Наш прайс'!#REF!)","v":{"$error":"#REF!"}},{"$f":"IF('Наш прайс'!#REF!=0,\"\",'Наш прайс'!#REF!)","v":{"$error":"#REF!"}},{"$f":"IF('Наш прайс'!#REF!=0,\"\",'Наш прайс'!#REF!)","v":{"$error":"#REF!"}},{"$f":"IF('Наш прайс'!#REF!=0,\"\",'Наш прайс'!#REF!)","v":{"$error":"#REF!"}},{"$f":"IF('Наш прайс'!#REF!=0,\"\",'Наш прайс'!#REF!)","v":{"$error":"#REF!"}},{"$f":"IF('Наш прайс'!#REF!=0,\"\",'Наш прайс'!#REF!)","v":{"$error":"#REF!"}},{"$f":"IF('Наш прайс'!#REF!=0,\"\",'Наш прайс'!#REF!)","v":{"$error":"#REF!"}}]
[{"$f":"IF('Наш прайс'!#REF!=0,\"\",'Наш прайс'!#REF!)","v":{"$error":"#REF!"}},{"$f":"IF('Наш прайс'!#REF!=0,\"\",'Наш прайс'!#REF!)","v":{"$error":"#REF!"}},{"$f":"IF('Наш прайс'!#REF!=0,\"\",'Наш прайс'!#REF!)","v":{"$error":"#REF!"}},{"$error":"#REF!"},null,null,{"$f":"IF('Наш прайс'!#REF!=0,\"\",'Наш прайс'!#REF!)","v":{"$error":"#REF!"}},{"$f":"IF('Наш прайс'!#REF!=0,\"\",'Наш прайс'!#REF!)","v":{"$error":"#REF!"}},{"$f":"IF('Наш прайс'!#REF!=0,\"\",'Наш прайс'!#REF!)","v":{"$error":"#REF!"}},{"$f":"IF('Наш прайс'!#REF!=0,\"\",'Наш прайс'!#REF!)","v":{"$error":"#REF!"}},{"$f":"IF('Наш прайс'!#REF!=0,\"\",'Наш прайс'!#REF!)","v":{"$error":"#REF!"}},{"$f":"IF('Наш прайс'!#REF!=0,\"\",'Наш прайс'!#REF!)","v":{"$error":"#REF!"}},{"$f":"IF('Наш прайс'!#REF!=0,\"\",'Наш прайс'!#REF!)","v":{"$error":"#REF!"}}]
[{"$f":"IF('Наш прайс'!#REF!=0,\"\",'Наш прайс'!#REF!)","v":{"$error":"#REF!"}},{"$f":"IF('Наш прайс'!#REF!=0,\"\",'Наш прайс'!#REF!)","v":{"$error":"#REF!"}},{"$f":"IF('Наш прайс'!#REF!=0,\"\",'Наш прайс'!#REF!)","v":{"$error":"#REF!"}},{"$error":"#REF!"},null,null,{"$f":"IF('Наш прайс'!#REF!=0,\"\",'Наш прайс'!#REF!)","v":{"$error":"#REF!"}},{"$f":"IF('Наш прайс'!#REF!=0,\"\",'Наш прайс'!#REF!)","v":{"$error":"#REF!"}},{"$f":"IF('Наш прайс'!#REF!=0,\"\",'Наш прайс'!#REF!)","v":{"$error":"#REF!"}},{"$f":"IF('Наш прайс'!#REF!=0,\"\",'Наш прайс'!#REF!)","v":{"$error":"#REF!"}},{"$f":"IF('Наш прайс'!#REF!=0,\"\",'Наш прайс'!#REF!)","v":{"$error":"#REF!"}},{"$f":"IF('Наш прайс'!#REF!=0,\"\",'Наш прайс'!#REF!)","v":{"$error":"#REF!"}},{"$f":"IF('Наш прайс'!#REF!=0,\"\",'Наш прайс'!#REF!)","v":{"$error":"#REF!"}}]
[{"$f":"IF('Наш прайс'!#REF!=0,\"\",'Наш прайс'!#REF!)","v":{"$error":"#REF!"}},{"$f":"IF('Наш прайс'!#REF!=0,\"\",'Наш прайс'!#REF!)","v":{"$error":"#REF!"}},{"$f":"IF('Наш прайс'!#REF!=0,\"\",'Наш прайс'!#REF!)","v":{"$error":"#REF!"}},{"$error":"#REF!"},null,null,{"$f":"IF('Наш прайс'!#REF!=0,\"\",'Наш прайс'!#REF!)","v":{"$error":"#REF!"}},{"$f":"IF('Наш прайс'!#REF!=0,\"\",'Наш прайс'!#REF!)","v":{"$error":"#REF!"}},{"$f":"IF('Наш прайс'!#REF!=0,\"\",'Наш прайс'!#REF!)","v":{"$error":"#REF!"}},{"$f":"IF('Наш прайс'!#REF!=0,\"\",'Наш прайс'!#REF!)","v":{"$error":"#REF!"}},{"$f":"IF('Наш прайс'!#REF!=0,\"\",'Наш прайс'!#REF!)","v":{"$error":"#REF!"}},{"$f":"IF('Наш прайс'!#REF!=0,\"\",'Наш прайс'!#REF!)","v":{"$error":"#REF!"}},{"$f":"IF('Наш прайс'!#REF!=0,\"\",'Наш прайс'!#REF!)","v":{"$error":"#REF!"}}]
[{"$f":"IF('Наш прайс'!#REF!=0,\"\",'Наш прайс'!#REF!)","v":{"$error":"#REF!"}},{"$f":"IF('Наш прайс'!#REF!=0,\"\",'Наш прайс'!#REF!)","v":{"$error":"#REF!"}},{"$f":"IF('Наш прайс'!#REF!=0,\"\",'Наш прайс'!#REF!)","v":{"$error":"#REF!"}},{"$f":"L193","v":{"$error":"#REF!"}},null,null,{"$f":"IF('Наш прайс'!#REF!=0,\"\",'Наш прайс'!#REF!)","v":{"$error":"#REF!"}},{"$f":"IF('Наш прайс'!#REF!=0,\"\",'Наш прайс'!#REF!)","v":{"$error":"#REF!"}},{"$f":"IF('Наш прайс'!#REF!=0,\"\",'Наш прайс'!#REF!)","v":{"$error":"#REF!"}},{"$f":"IF('Наш прайс'!#REF!=0,\"\",'Наш прайс'!#REF!)","v":{"$error":"#REF!"}},{"$f":"IF('Наш прайс'!#REF!=0,\"\",'Наш прайс'!#REF!)","v":{"$error":"#REF!"}},{"$f":"IF('Наш прайс'!#REF!=0,\"\",'Наш прайс'!#REF!)","v":{"$error":"#REF!"}},{"$f":"IF('Наш прайс'!#REF!=0,\"\",'Наш прайс'!#REF!)","v":{"$error":"#REF!"}}]
[{"$f":"IF('Наш прайс'!#REF!=0,\"\",'Наш прайс'!#REF!)","v":{"$error":"#REF!"}},{"$f":"IF('Наш прайс'!#REF!=0,\"\",'Наш прайс'!#REF!)","v":{"$error":"#REF!"}},{"$f":"IF('Наш прайс'!#REF!=0,\"\",'Наш прайс'!#REF!)","v":{"$error":"#REF!"}},{"$error":"#REF!"},null,null,{"$f":"IF('Наш прайс'!#REF!=0,\"\",'Наш прайс'!#REF!)","v":{"$error":"#REF!"}},{"$f":"IF('Наш прайс'!#REF!=0,\"\",'Наш прайс'!#REF!)","v":{"$error":"#REF!"}},{"$f":"IF('Наш прайс'!#REF!=0,\"\",'Наш прайс'!#REF!)","v":{"$error":"#REF!"}},{"$f":"IF('Наш прайс'!#REF!=0,\"\",'Наш прайс'!#REF!)","v":{"$error":"#REF!"}},{"$f":"IF('Наш прайс'!#REF!=0,\"\",'Наш прайс'!#REF!)","v":{"$error":"#REF!"}},{"$f":"IF('Наш прайс'!#REF!=0,\"\",'Наш прайс'!#REF!)","v":{"$error":"#REF!"}},{"$f":"IF('Наш прайс'!#REF!=0,\"\",'Наш прайс'!#REF!)","v":{"$error":"#REF!"}}]
[{"$f":"IF('Наш прайс'!#REF!=0,\"\",'Наш прайс'!#REF!)","v":{"$error":"#REF!"}},{"$f":"IF('Наш прайс'!#REF!=0,\"\",'Наш прайс'!#REF!)","v":{"$error":"#REF!"}},{"$f":"IF('Наш прайс'!#REF!=0,\"\",'Наш прайс'!#REF!)","v":{"$error":"#REF!"}},{"$error":"#REF!"},null,null,{"$f":"IF('Наш прайс'!#REF!=0,\"\",'Наш прайс'!#REF!)","v":{"$error":"#REF!"}},{"$f":"IF('Наш прайс'!#REF!=0,\"\",'Наш прайс'!#REF!)","v":{"$error":"#REF!"}},{"$f":"IF('Наш прайс'!#REF!=0,\"\",'Наш прайс'!#REF!)","v":{"$error":"#REF!"}},{"$f":"IF('Наш прайс'!#REF!=0,\"\",'Наш прайс'!#REF!)","v":{"$error":"#REF!"}},{"$f":"IF('Наш прайс'!#REF!=0,\"\",'Наш прайс'!#REF!)","v":{"$error":"#REF!"}},{"$f":"IF('Наш прайс'!#REF!=0,\"\",'Наш прайс'!#REF!)","v":{"$error":"#REF!"}},{"$f":"IF('Наш прайс'!#REF!=0,\"\",'Наш прайс'!#REF!)","v":{"$error":"#REF!"}}]
[{"$f":"IF('Наш прайс'!#REF!=0,\"\",'Наш прайс'!#REF!)","v":{"$error":"#REF!"}},{"$f":"IF('Наш прайс'!#REF!=0,\"\",'Наш прайс'!#REF!)","v":{"$error":"#REF!"}},{"$f":"IF('Наш прайс'!#REF!=0,\"\",'Наш прайс'!#REF!)","v":{"$error":"#REF!"}},{"$error":"#REF!"},null,null,{"$f":"IF('Наш прайс'!#REF!=0,\"\",'Наш прайс'!#REF!)","v":{"$error":"#REF!"}},{"$f":"IF('Наш прайс'!#REF!=0,\"\",'Наш прайс'!#REF!)","v":{"$error":"#REF!"}},{"$f":"IF('Наш прайс'!#REF!=0,\"\",'Наш прайс'!#REF!)","v":{"$error":"#REF!"}},{"$f":"IF('Наш прайс'!#REF!=0,\"\",'Наш прайс'!#REF!)","v":{"$error":"#REF!"}},{"$f":"IF('Наш прайс'!#REF!=0,\"\",'Наш прайс'!#REF!)","v":{"$error":"#REF!"}},{"$f":"IF('Наш прайс'!#REF!=0,\"\",'Наш прайс'!#REF!)","v":{"$error":"#REF!"}},{"$f":"IF('Наш прайс'!#REF!=0,\"\",'Наш прайс'!#REF!)","v":{"$error":"#REF!"}}]
[{"$f":"IF('Наш прайс'!#REF!=0,\"\",'Наш прайс'!#REF!)","v":{"$error":"#REF!"}},{"$f":"IF('Наш прайс'!#REF!=0,\"\",'Наш прайс'!#REF!)","v":{"$error":"#REF!"}},{"$f":"IF('Наш прайс'!#REF!=0,\"\",'Наш прайс'!#REF!)","v":{"$error":"#REF!"}},{"$error":"#REF!"},null,null,{"$f":"IF('Наш прайс'!#REF!=0,\"\",'Наш прайс'!#REF!)","v":{"$error":"#REF!"}},{"$f":"IF('Наш прайс'!#REF!=0,\"\",'Наш прайс'!#REF!)","v":{"$error":"#REF!"}},{"$f":"IF('Наш прайс'!#REF!=0,\"\",'Наш прайс'!#REF!)","v":{"$error":"#REF!"}},{"$f":"IF('Наш прайс'!#REF!=0,\"\",'Наш прайс'!#REF!)","v":{"$error":"#REF!"}},{"$f":"IF('Наш прайс'!#REF!=0,\"\",'Наш прайс'!#REF!)","v":{"$error":"#REF!"}},{"$f":"IF('Наш прайс'!#REF!=0,\"\",'Наш прайс'!#REF!)","v":{"$error":"#REF!"}},{"$f":"IF('Наш прайс'!#REF!=0,\"\",'Наш прайс'!#REF!)","v":{"$error":"#REF!"}}]
[{"$f":"IF('Наш прайс'!#REF!=0,\"\",'Наш прайс'!#REF!)","v":{"$error":"#REF!"}},{"$f":"IF('Наш прайс'!#REF!=0,\"\",'Наш прайс'!#REF!)","v":{"$error":"#REF!"}},{"$f":"IF('Наш прайс'!#REF!=0,\"\",'Наш прайс'!#REF!)","v":{"$error":"#REF!"}},{"$error":"#REF!"},null,null,{"$f":"IF('Наш прайс'!#REF!=0,\"\",'Наш прайс'!#REF!)","v":{"$error":"#REF!"}},{"$f":"IF('Наш прайс'!#REF!=0,\"\",'Наш прайс'!#REF!)","v":{"$error":"#REF!"}},{"$f":"IF('Наш прайс'!#REF!=0,\"\",'Наш прайс'!#REF!)","v":{"$error":"#REF!"}},{"$f":"IF('Наш прайс'!#REF!=0,\"\",'Наш прайс'!#REF!)","v":{"$error":"#REF!"}},{"$f":"IF('Наш прайс'!#REF!=0,\"\",'Наш прайс'!#REF!)","v":{"$error":"#REF!"}},{"$f":"IF('Наш прайс'!#REF!=0,\"\",'Наш прайс'!#REF!)","v":{"$error":"#REF!"}},{"$f":"IF('Наш прайс'!#REF!=0,\"\",'Наш прайс'!#REF!)","v":{"$error":"#REF!"}}]
[{"$f":"IF('Наш прайс'!B2=0,\"\",'Наш прайс'!B2)","v":"Paraframe II Tanto"},{"$f":"IF('Наш прайс'!#REF!=0,\"\",'Наш прайс'!#REF!)","v":{"$error":"#REF!"}},{"$f":"IF('Наш прайс'!#REF!=0,\"\",'Наш прайс'!#REF!)","v":{"$error":"#REF!"}},"",null,null,{"$f":"IF('Наш прайс'!#REF!=0,\"\",'Наш прайс'!#REF!)","v":{"$error":"#REF!"}},{"$f":"IF('Наш прайс'!#REF!=0,\"\",'Наш прайс'!#REF!)","v":{"$error":"#REF!"}},{"$f":"IF('Наш прайс'!#REF!=0,\"\",'Наш прайс'!#REF!)","v":{"$error":"#REF!"}},{"$f":"IF('Наш прайс'!#REF!=0,\"\",'Наш прайс'!#REF!)","v":{"$error":"#REF!"}},{"$f":"IF('Наш прайс'!#REF!=0,\"\",'Наш прайс'!#REF!)","v":{"$error":"#REF!"}},{"$f":"IF('Наш прайс'!J2=0,\"\",'Наш прайс'!J2)","v":""},{"$f":"IF('Наш прайс'!#REF!=0,\"\",'Наш прайс'!#REF!)","v":{"$error":"#REF!"}}]
[{"$f":"IF('Наш прайс'!B3=0,\"\",'Наш прайс'!B3)","v":"Paraframe II Fine"},{"$f":"IF('Наш прайс'!#REF!=0,\"\",'Наш прайс'!#REF!)","v":{"$error":"#REF!"}},{"$f":"IF('Наш прайс'!#REF!=0,\"\",'Наш прайс'!#REF!)","v":{"$error":"#REF!"}},"",null,null,{"$f":"IF('Наш прайс'!#REF!=0,\"\",'Наш прайс'!#REF!)","v":{"$error":"#REF!"}},{"$f":"IF('Наш прайс'!#REF!=0,\"\",'Наш прайс'!#REF!)","v":{"$error":"#REF!"}},{"$f":"IF('Наш прайс'!#REF!=0,\"\",'Наш прайс'!#REF!)","v":{"$error":"#REF!"}},{"$f":"IF('Наш прайс'!#REF!=0,\"\",'Наш прайс'!#REF!)","v":{"$error":"#REF!"}},{"$f":"IF('Наш прайс'!#REF!=0,\"\",'Наш прайс'!#REF!)","v":{"$error":"#REF!"}},{"$f":"IF('Наш прайс'!J3=0,\"\",'Наш прайс'!J3)","v":""},{"$f":"IF('Наш прайс'!#REF!=0,\"\",'Наш прайс'!#REF!)","v":{"$error":"#REF!"}}]
[{"$f":"IF('Наш прайс'!B4=0,\"\",'Наш прайс'!B4)","v":"Paraframe II Serrated"},{"$f":"IF('Наш прайс'!#REF!=0,\"\",'Наш прайс'!#REF!)","v":{"$error":"#REF!"}},{"$f":"IF('Наш прайс'!#REF!=0,\"\",'Наш прайс'!#REF!)","v":{"$error":"#REF!"}},"",null,null,{"$f":"IF('Наш прайс'!#REF!=0,\"\",'Наш прайс'!#REF!)","v":{"$error":"#REF!"}},{"$f":"IF('Наш прайс'!#REF!=0,\"\",'Наш прайс'!#REF!)","v":{"$error":"#REF!"}},{"$f":"IF('Наш прайс'!#REF!=0,\"\",'Наш прайс'!#REF!)","v":{"$error":"#REF!"}},{"$f":"IF('Наш прайс'!#REF!=0,\"\",'Наш прайс'!#REF!)","v":{"$error":"#REF!"}},{"$f":"IF('Наш прайс'!#REF!=0,\"\",'Наш прайс'!#REF!)","v":{"$error":"#REF!"}},{"$f":"IF('Наш прайс'!J4=0,\"\",'Наш прайс'!J4)","v":""},{"$f":"IF('Наш прайс'!#REF!=0,\"\",'Наш прайс'!#REF!)","v":{"$error":"#REF!"}}]
[{"$f":"IF('Наш прайс'!B5=0,\"\",'Наш прайс'!B5)","v":"Paraframe Mini Fine"},{"$f":"IF('Наш прайс'!#REF!=0,\"\",'Наш прайс'!#REF!)","v":{"$error":"#REF!"}},{"$f":"IF('Наш прайс'!#REF!=0,\"\",'Наш прайс'!#REF!)","v":{"$error":"#REF!"}},"",null,null,{"$f":"IF('Наш прайс'!#REF!=0,\"\",'Наш прайс'!#REF!)","v":{"$error":"#REF!"}},{"$f":"IF('Наш прайс'!#REF!=0,\"\",'Наш прайс'!#REF!)","v":{"$error":"#REF!"}},{"$f":"IF('Наш прайс'!#REF!=0,\"\",'Наш прайс'!#REF!)","v":{"$error":"#REF!"}},{"$f":"IF('Наш прайс'!#REF!=0,\"\",'Наш прайс'!#REF!)","v":{"$error":"#REF!"}},{"$f":"IF('Наш прайс'!#REF!=0,\"\",'Наш прайс'!#REF!)","v":{"$error":"#REF!"}},{"$f":"IF('Наш прайс'!J5=0,\"\",'Наш прайс'!J5)","v":""},{"$f":"IF('Наш прайс'!#REF!=0,\"\",'Наш прайс'!#REF!)","v":{"$error":"#REF!"}}]
[{"$f":"IF('Наш прайс'!B6=0,\"\",'Наш прайс'!B6)","v":"PR 3.0 Serrated"},{"$f":"IF('Наш прайс'!#REF!=0,\"\",'Наш прайс'!#REF!)","v":{"$error":"#REF!"}},{"$f":"IF('Наш прайс'!#REF!=0,\"\",'Наш прайс'!#REF!)","v":{"$error":"#REF!"}},"",null,null,{"$f":"IF('Наш прайс'!#REF!=0,\"\",'Наш прайс'!#REF!)","v":{"$error":"#REF!"}},{"$f":"IF('Наш прайс'!#REF!=0,\"\",'Наш прайс'!#REF!)","v":{"$error":"#REF!"}},{"$f":"IF('Наш прайс'!#REF!=0,\"\",'Наш прайс'!#REF!)","v":{"$error":"#REF!"}},{"$f":"IF('Наш прайс'!#REF!=0,\"\",'Наш прайс'!#REF!)","v":{"$error":"#REF!"}},{"$f":"IF('Наш прайс'!#REF!=0,\"\",'Наш прайс'!#REF!)","v":{"$error":"#REF!"}},{"$f":"IF('Наш прайс'!J6=0,\"\",'Наш прайс'!J6)","v":""},{"$f":"IF('Наш прайс'!#REF!=0,\"\",'Наш прайс'!#REF!)","v":{"$error":"#REF!"}}]
[{"$f":"IF('Наш прайс'!B7=0,\"\",'Наш прайс'!B7)","v":"Remix Fine"},{"$f":"IF('Наш прайс'!#REF!=0,\"\",'Наш прайс'!#REF!)","v":{"$error":"#REF!"}},{"$f":"IF('Наш прайс'!#REF!=0,\"\",'Наш прайс'!#REF!)","v":{"$error":"#REF!"}},"",null,null,{"$f":"IF('Наш прайс'!#REF!=0,\"\",'Наш прайс'!#REF!)","v":{"$error":"#REF!"}},{"$f":"IF('Наш прайс'!#REF!=0,\"\",'Наш прайс'!#REF!)","v":{"$error":"#REF!"}},{"$f":"IF('Наш прайс'!#REF!=0,\"\",'Наш прайс'!#REF!)","v":{"$error":"#REF!"}},{"$f":"IF('Наш прайс'!#REF!=0,\"\",'Наш прайс'!#REF!)","v":{"$error":"#REF!"}},{"$f":"IF('Наш прайс'!#REF!=0,\"\",'Наш прайс'!#REF!)","v":{"$error":"#REF!"}},{"$f":"IF('Наш прайс'!J7=0,\"\",'Наш прайс'!J7)","v":""},{"$f":"IF('Наш прайс'!#REF!=0,\"\",'Наш прайс'!#REF!)","v":{"$error":"#REF!"}}]
[{"$f":"IF('Наш прайс'!B8=0,\"\",'Наш прайс'!B8)","v":"Remix Serrated"},{"$f":"IF('Наш прайс'!#REF!=0,\"\",'Наш прайс'!#REF!)","v":{"$error":"#REF!"}},{"$f":"IF('Наш прайс'!#REF!=0,\"\",'Наш прайс'!#REF!)","v":{"$error":"#REF!"}},"",null,null,{"$f":"IF('Наш прайс'!#REF!=0,\"\",'Наш прайс'!#REF!)","v":{"$error":"#REF!"}},{"$f":"IF('Наш прайс'!#REF!=0,\"\",'Наш прайс'!#REF!)","v":{"$error":"#REF!"}},{"$f":"IF('Наш прайс'!#REF!=0,\"\",'Наш прайс'!#REF!)","v":{"$error":"#REF!"}},{"$f":"IF('Наш прайс'!#REF!=0,\"\",'Наш прайс'!#REF!)","v":{"$error":"#REF!"}},{"$f":"IF('Наш прайс'!#REF!=0,\"\",'Наш прайс'!#REF!)","v":{"$error":"#REF!"}},{"$f":"IF('Наш прайс'!J8=0,\"\",'Наш прайс'!J8)","v":""},{"$f":"IF('Наш прайс'!#REF!=0,\"\",'Наш прайс'!#REF!)","v":{"$error":"#REF!"}}]
[{"$f":"IF('Наш прайс'!B9=0,\"\",'Наш прайс'!B9)","v":"Mini-Remix"},{"$f":"IF('Наш прайс'!#REF!=0,\"\",'Наш прайс'!#REF!)","v":{"$error":"#REF!"}},{"$f":"IF('Наш прайс'!#REF!=0,\"\",'Наш прайс'!#REF!)","v":{"$error":"#REF!"}},"",null,null,{"$f":"IF('Наш прайс'!#REF!=0,\"\",'Наш прайс'!#REF!)","v":{"$error":"#REF!"}},{"$f":"IF('Наш прайс'!#REF!=0,\"\",'Наш прайс'!#REF!)","v":{"$error":"#REF!"}},{"$f":"IF('Наш прайс'!#REF!=0,\"\",'Наш прайс'!#REF!)","v":{"$error":"#REF!"}},{"$f":"IF('Наш прайс'!#REF!=0,\"\",'Наш прайс'!#REF!)","v":{"$error":"#REF!"}},{"$f":"IF('Наш прайс'!#REF!=0,\"\",'Наш прайс'!#REF!)","v":{"$error":"#REF!"}},{"$f":"IF('Наш прайс'!J9=0,\"\",'Наш прайс'!J9)","v":""},{"$f":"IF('Наш прайс'!#REF!=0,\"\",'Наш прайс'!#REF!)","v":{"$error":"#REF!"}}]
[{"$f":"IF('Наш прайс'!B10=0,\"\",'Наш прайс'!B10)","v":"Remix Tactical"},{"$f":"IF('Наш прайс'!#REF!=0,\"\",'Наш прайс'!#REF!)","v":{"$error":"#REF!"}},{"$f":"IF('Наш прайс'!#REF!=0,\"\",'Наш прайс'!#REF!)","v":{"$error":"#REF!"}},"",null,null,{"$f":"IF('Наш прайс'!#REF!=0,\"\",'Наш прайс'!#REF!)","v":{"$error":"#REF!"}},{"$f":"IF('Наш прайс'!#REF!=0,\"\",'Наш прайс'!#REF!)","v":{"$error":"#REF!"}},{"$f":"IF('Наш прайс'!#REF!=0,\"\",'Наш прайс'!#REF!)","v":{"$error":"#REF!"}},{"$f":"IF('Наш прайс'!#REF!=0,\"\",'Наш прайс'!#REF!)","v":{"$error":"#REF!"}},{"$f":"IF('Наш прайс'!#REF!=0,\"\",'Наш прайс'!#REF!)","v":{"$error":"#REF!"}},{"$f":"IF('Наш прайс'!J10=0,\"\",'Наш прайс'!J10)","v":""},{"$f":"IF('Наш прайс'!#REF!=0,\"\",'Наш прайс'!#REF!)","v":{"$error":"#REF!"}}]
[{"$f":"IF('Наш прайс'!B11=0,\"\",'Наш прайс'!B11)","v":"STL 2.5"},{"$f":"IF('Наш прайс'!#REF!=0,\"\",'Наш прайс'!#REF!)","v":{"$error":"#REF!"}},{"$f":"IF('Наш прайс'!#REF!=0,\"\",'Наш прайс'!#REF!)","v":{"$error":"#REF!"}},"",null,null,{"$f":"IF('Наш прайс'!#REF!=0,\"\",'Наш прайс'!#REF!)","v":{"$error":"#REF!"}},{"$f":"IF('Наш прайс'!#REF!=0,\"\",'Наш прайс'!#REF!)","v":{"$error":"#REF!"}},{"$f":"IF('Наш прайс'!#REF!=0,\"\",'Наш прайс'!#REF!)","v":{"$error":"#REF!"}},{"$f":"IF('Наш прайс'!#REF!=0,\"\",'Наш прайс'!#REF!)","v":{"$error":"#REF!"}},{"$f":"IF('Наш прайс'!#REF!=0,\"\",'Наш прайс'!#REF!)","v":{"$error":"#REF!"}},{"$f":"IF('Наш прайс'!J11=0,\"\",'Наш прайс'!J11)","v":""},{"$f":"IF('Наш прайс'!#REF!=0,\"\",'Наш прайс'!#REF!)","v":{"$error":"#REF!"}}]
[{"$f":"IF('Наш прайс'!B12=0,\"\",'Наш прайс'!B12)","v":"Swagger"},{"$f":"IF('Наш прайс'!#REF!=0,\"\",'Наш прайс'!#REF!)","v":{"$error":"#REF!"}},{"$f":"IF('Наш прайс'!#REF!=0,\"\",'Наш прайс'!#REF!)","v":{"$error":"#REF!"}},"",null,null,{"$f":"IF('Наш прайс'!#REF!=0,\"\",'Наш прайс'!#REF!)","v":{"$error":"#REF!"}},{"$f":"IF('Наш прайс'!#REF!=0,\"\",'Наш прайс'!#REF!)","v":{"$error":"#REF!"}},{"$f":"IF('Наш прайс'!#REF!=0,\"\",'Наш прайс'!#REF!)","v":{"$error":"#REF!"}},{"$f":"IF('Наш прайс'!#REF!=0,\"\",'Наш прайс'!#REF!)","v":{"$error":"#REF!"}},{"$f":"IF('Наш прайс'!#REF!=0,\"\",'Наш прайс'!#REF!)","v":{"$error":"#REF!"}},{"$f":"IF('Наш прайс'!J12=0,\"\",'Наш прайс'!J12)","v":""},{"$f":"IF('Наш прайс'!#REF!=0,\"\",'Наш прайс'!#REF!)","v":{"$error":"#REF!"}}]
[{"$f":"IF('Наш прайс'!B13=0,\"\",'Наш прайс'!B13)","v":"E.A.B. Lite"},{"$f":"IF('Наш прайс'!#REF!=0,\"\",'Наш прайс'!#REF!)","v":{"$error":"#REF!"}},{"$f":"IF('Наш прайс'!#REF!=0,\"\",'Наш прайс'!#REF!)","v":{"$error":"#REF!"}},"",null,null,{"$f":"IF('Наш прайс'!#REF!=0,\"\",'Наш прайс'!#REF!)","v":{"$error":"#REF!"}},{"$f":"IF('Наш прайс'!#REF!=0,\"\",'Наш прайс'!#REF!)","v":{"$error":"#REF!"}},{"$f":"IF('Наш прайс'!#REF!=0,\"\",'Наш прайс'!#REF!)","v":{"$error":"#REF!"}},{"$f":"IF('Наш прайс'!#REF!=0,\"\",'Наш прайс'!#REF!)","v":{"$error":"#REF!"}},{"$f":"IF('Наш прайс'!#REF!=0,\"\",'Наш прайс'!#REF!)","v":{"$error":"#REF!"}},{"$f":"IF('Наш прайс'!J13=0,\"\",'Наш прайс'!J13)","v":""},{"$f":"IF('Наш прайс'!#REF!=0,\"\",'Наш прайс'!#REF!)","v":{"$error":"#REF!"}}]
[{"$f":"IF('Наш прайс'!#REF!=0,\"\",'Наш прайс'!#REF!)","v":{"$error":"#REF!"}},{"$f":"IF('Наш прайс'!#REF!=0,\"\",'Наш прайс'!#REF!)","v":{"$error":"#REF!"}},{"$f":"IF('Наш прайс'!#REF!=0,\"\",'Наш прайс'!#REF!)","v":{"$error":"#REF!"}},{"$error":"#REF!"},null,null,{"$f":"IF('Наш прайс'!#REF!=0,\"\",'Наш прайс'!#REF!)","v":{"$error":"#REF!"}},{"$f":"IF('Наш прайс'!#REF!=0,\"\",'Наш прайс'!#REF!)","v":{"$error":"#REF!"}},{"$f":"IF('Наш прайс'!#REF!=0,\"\",'Наш прайс'!#REF!)","v":{"$error":"#REF!"}},{"$f":"IF('Наш прайс'!#REF!=0,\"\",'Наш прайс'!#REF!)","v":{"$error":"#REF!"}},{"$f":"IF('Наш прайс'!#REF!=0,\"\",'Наш прайс'!#REF!)","v":{"$error":"#REF!"}},{"$f":"IF('Наш прайс'!#REF!=0,\"\",'Наш прайс'!#REF!)","v":{"$error":"#REF!"}},{"$f":"IF('Наш прайс'!#REF!=0,\"\",'Наш прайс'!#REF!)","v":{"$error":"#REF!"}}]
[{"$f":"IF('Наш прайс'!#REF!=0,\"\",'Наш прайс'!#REF!)","v":{"$error":"#REF!"}},{"$f":"IF('Наш прайс'!#REF!=0,\"\",'Наш прайс'!#REF!)","v":{"$error":"#REF!"}},{"$f":"IF('Наш прайс'!#REF!=0,\"\",'Наш прайс'!#REF!)","v":{"$error":"#REF!"}},{"$error":"#REF!"},null,null,{"$f":"IF('Наш прайс'!#REF!=0,\"\",'Наш прайс'!#REF!)","v":{"$error":"#REF!"}},{"$f":"IF('Наш прайс'!#REF!=0,\"\",'Наш прайс'!#REF!)","v":{"$error":"#REF!"}},{"$f":"IF('Наш прайс'!#REF!=0,\"\",'Наш прайс'!#REF!)","v":{"$error":"#REF!"}},{"$f":"IF('Наш прайс'!#REF!=0,\"\",'Наш прайс'!#REF!)","v":{"$error":"#REF!"}},{"$f":"IF('Наш прайс'!#REF!=0,\"\",'Наш прайс'!#REF!)","v":{"$error":"#REF!"}},{"$f":"IF('Наш прайс'!#REF!=0,\"\",'Наш прайс'!#REF!)","v":{"$error":"#REF!"}},{"$f":"IF('Наш прайс'!#REF!=0,\"\",'Наш прайс'!#REF!)","v":{"$error":"#REF!"}}]
[{"$f":"IF('Наш прайс'!#REF!=0,\"\",'Наш прайс'!#REF!)","v":{"$error":"#REF!"}},{"$f":"IF('Наш прайс'!#REF!=0,\"\",'Наш прайс'!#REF!)","v":{"$error":"#REF!"}},{"$f":"IF('Наш прайс'!#REF!=0,\"\",'Наш прайс'!#REF!)","v":{"$error":"#REF!"}},{"$error":"#REF!"},null,null,{"$f":"IF('Наш прайс'!#REF!=0,\"\",'Наш прайс'!#REF!)","v":{"$error":"#REF!"}},{"$f":"IF('Наш прайс'!#REF!=0,\"\",'Наш прайс'!#REF!)","v":{"$error":"#REF!"}},{"$f":"IF('Наш прайс'!#REF!=0,\"\",'Наш прайс'!#REF!)","v":{"$error":"#REF!"}},{"$f":"IF('Наш прайс'!#REF!=0,\"\",'Наш прайс'!#REF!)","v":{"$error":"#REF!"}},{"$f":"IF('Наш прайс'!#REF!=0,\"\",'Наш прайс'!#REF!)","v":{"$error":"#REF!"}},{"$f":"IF('Наш прайс'!#REF!=0,\"\",'Наш прайс'!#REF!)","v":{"$error":"#REF!"}},{"$f":"IF('Наш прайс'!#REF!=0,\"\",'Наш прайс'!#REF!)","v":{"$error":"#REF!"}}]
[{"$f":"IF('Наш прайс'!#REF!=0,\"\",'Наш прайс'!#REF!)","v":{"$error":"#REF!"}},{"$f":"IF('Наш прайс'!#REF!=0,\"\",'Наш прайс'!#REF!)","v":{"$error":"#REF!"}},{"$f":"IF('Наш прайс'!#REF!=0,\"\",'Наш прайс'!#REF!)","v":{"$error":"#REF!"}},{"$error":"#REF!"},null,null,{"$f":"IF('Наш прайс'!#REF!=0,\"\",'Наш прайс'!#REF!)","v":{"$error":"#REF!"}},{"$f":"IF('Наш прайс'!#REF!=0,\"\",'Наш прайс'!#REF!)","v":{"$error":"#REF!"}},{"$f":"IF('Наш прайс'!#REF!=0,\"\",'Наш прайс'!#REF!)","v":{"$error":"#REF!"}},{"$f":"IF('Наш прайс'!#REF!=0,\"\",'Наш прайс'!#REF!)","v":{"$error":"#REF!"}},{"$f":"IF('Наш прайс'!#REF!=0,\"\",'Наш прайс'!#REF!)","v":{"$error":"#REF!"}},{"$f":"IF('Наш прайс'!#REF!=0,\"\",'Наш прайс'!#REF!)","v":{"$error":"#REF!"}},{"$f":"IF('Наш прайс'!#REF!=0,\"\",'Наш прайс'!#REF!)","v":{"$error":"#REF!"}}]
[{"$f":"IF('Наш прайс'!#REF!=0,\"\",'Наш прайс'!#REF!)","v":{"$error":"#REF!"}},{"$f":"IF('Наш прайс'!#REF!=0,\"\",'Наш прайс'!#REF!)","v":{"$error":"#REF!"}},{"$f":"IF('Наш прайс'!#REF!=0,\"\",'Наш прайс'!#REF!)","v":{"$error":"#REF!"}},{"$error":"#REF!"},null,null,{"$f":"IF('Наш прайс'!#REF!=0,\"\",'Наш прайс'!#REF!)","v":{"$error":"#REF!"}},{"$f":"IF('Наш прайс'!#REF!=0,\"\",'Наш прайс'!#REF!)","v":{"$error":"#REF!"}},{"$f":"IF('Наш прайс'!#REF!=0,\"\",'Наш прайс'!#REF!)","v":{"$error":"#REF!"}},{"$f":"IF('Наш прайс'!#REF!=0,\"\",'Наш прайс'!#REF!)","v":{"$error":"#REF!"}},{"$f":"IF('Наш прайс'!#REF!=0,\"\",'Наш прайс'!#REF!)","v":{"$error":"#REF!"}},{"$f":"IF('Наш прайс'!#REF!=0,\"\",'Наш прайс'!#REF!)","v":{"$error":"#REF!"}},{"$f":"IF('Наш прайс'!#REF!=0,\"\",'Наш прайс'!#REF!)","v":{"$error":"#REF!"}}]
[{"$f":"IF('Наш прайс'!#REF!=0,\"\",'Наш прайс'!#REF!)","v":{"$error":"#REF!"}},{"$f":"IF('Наш прайс'!#REF!=0,\"\",'Наш прайс'!#REF!)","v":{"$error":"#REF!"}},{"$f":"IF('Наш прайс'!#REF!=0,\"\",'Наш прайс'!#REF!)","v":{"$error":"#REF!"}},{"$error":"#REF!"},null,null,{"$f":"IF('Наш прайс'!#REF!=0,\"\",'Наш прайс'!#REF!)","v":{"$error":"#REF!"}},{"$f":"IF('Наш прайс'!#REF!=0,\"\",'Наш прайс'!#REF!)","v":{"$error":"#REF!"}},{"$f":"IF('Наш прайс'!#REF!=0,\"\",'Наш прайс'!#REF!)","v":{"$error":"#REF!"}},{"$f":"IF('Наш прайс'!#REF!=0,\"\",'Наш прайс'!#REF!)","v":{"$error":"#REF!"}},{"$f":"IF('Наш прайс'!#REF!=0,\"\",'Наш прайс'!#REF!)","v":{"$error":"#REF!"}},{"$f":"IF('Наш прайс'!#REF!=0,\"\",'Наш прайс'!#REF!)","v":{"$error":"#REF!"}},{"$f":"IF('Наш прайс'!#REF!=0,\"\",'Наш прайс'!#REF!)","v":{"$error":"#REF!"}}]
[{"$f":"IF('Наш прайс'!#REF!=0,\"\",'Наш прайс'!#REF!)","v":{"$error":"#REF!"}},{"$f":"IF('Наш прайс'!#REF!=0,\"\",'Наш прайс'!#REF!)","v":{"$error":"#REF!"}},{"$f":"IF('Наш прайс'!#REF!=0,\"\",'Наш прайс'!#REF!)","v":{"$error":"#REF!"}},{"$error":"#REF!"},null,null,{"$f":"IF('Наш прайс'!#REF!=0,\"\",'Наш прайс'!#REF!)","v":{"$error":"#REF!"}},{"$f":"IF('Наш прайс'!#REF!=0,\"\",'Наш прайс'!#REF!)","v":{"$error":"#REF!"}},{"$f":"IF('Наш прайс'!#REF!=0,\"\",'Наш прайс'!#REF!)","v":{"$error":"#REF!"}},{"$f":"IF('Наш прайс'!#REF!=0,\"\",'Наш прайс'!#REF!)","v":{"$error":"#REF!"}},{"$f":"IF('Наш прайс'!#REF!=0,\"\",'Наш прайс'!#REF!)","v":{"$error":"#REF!"}},{"$f":"IF('Наш прайс'!#REF!=0,\"\",'Наш прайс'!#REF!)","v":{"$error":"#REF!"}},{"$f":"IF('Наш прайс'!#REF!=0,\"\",'Наш прайс'!#REF!)","v":{"$error":"#REF!"}}]
[{"$f":"IF('Наш прайс'!#REF!=0,\"\",'Наш прайс'!#REF!)","v":{"$error":"#REF!"}},{"$f":"IF('Наш прайс'!#REF!=0,\"\",'Наш прайс'!#REF!)","v":{"$error":"#REF!"}},{"$f":"IF('Наш прайс'!#REF!=0,\"\",'Наш прайс'!#REF!)","v":{"$error":"#REF!"}},{"$error":"#REF!"},null,null,{"$f":"IF('Наш прайс'!#REF!=0,\"\",'Наш прайс'!#REF!)","v":{"$error":"#REF!"}},{"$f":"IF('Наш прайс'!#REF!=0,\"\",'Наш прайс'!#REF!)","v":{"$error":"#REF!"}},{"$f":"IF('Наш прайс'!#REF!=0,\"\",'Наш прайс'!#REF!)","v":{"$error":"#REF!"}},{"$f":"IF('Наш прайс'!#REF!=0,\"\",'Наш прайс'!#REF!)","v":{"$error":"#REF!"}},{"$f":"IF('Наш прайс'!#REF!=0,\"\",'Наш прайс'!#REF!)","v":{"$error":"#REF!"}},{"$f":"IF('Наш прайс'!#REF!=0,\"\",'Наш прайс'!#REF!)","v":{"$error":"#REF!"}},{"$f":"IF('Наш прайс'!#REF!=0,\"\",'Наш прайс'!#REF!)","v":{"$error":"#REF!"}}]
[{"$f":"IF('Наш прайс'!#REF!=0,\"\",'Наш прайс'!#REF!)","v":{"$error":"#REF!"}},{"$f":"IF('Наш прайс'!#REF!=0,\"\",'Наш прайс'!#REF!)","v":{"$error":"#REF!"}},{"$f":"IF('Наш прайс'!#REF!=0,\"\",'Наш прайс'!#REF!)","v":{"$error":"#REF!"}},{"$error":"#REF!"},null,null,{"$f":"IF('Наш прайс'!#REF!=0,\"\",'Наш прайс'!#REF!)","v":{"$error":"#REF!"}},{"$f":"IF('Наш прайс'!#REF!=0,\"\",'Наш прайс'!#REF!)","v":{"$error":"#REF!"}},{"$f":"IF('Наш прайс'!#REF!=0,\"\",'Наш прайс'!#REF!)","v":{"$error":"#REF!"}},{"$f":"IF('Наш прайс'!#REF!=0,\"\",'Наш прайс'!#REF!)","v":{"$error":"#REF!"}},{"$f":"IF('Наш прайс'!#REF!=0,\"\",'Наш прайс'!#REF!)","v":{"$error":"#REF!"}},{"$f":"IF('Наш прайс'!#REF!=0,\"\",'Наш прайс'!#REF!)","v":{"$error":"#REF!"}},{"$f":"IF('Наш прайс'!#REF!=0,\"\",'Наш прайс'!#REF!)","v":{"$error":"#REF!"}}]
[{"$f":"IF('Наш прайс'!#REF!=0,\"\",'Наш прайс'!#REF!)","v":{"$error":"#REF!"}},{"$f":"IF('Наш прайс'!#REF!=0,\"\",'Наш прайс'!#REF!)","v":{"$error":"#REF!"}},{"$f":"IF('Наш прайс'!#REF!=0,\"\",'Наш прайс'!#REF!)","v":{"$error":"#REF!"}},{"$error":"#REF!"},null,null,{"$f":"IF('Наш прайс'!#REF!=0,\"\",'Наш прайс'!#REF!)","v":{"$error":"#REF!"}},{"$f":"IF('Наш прайс'!#REF!=0,\"\",'Наш прайс'!#REF!)","v":{"$error":"#REF!"}},{"$f":"IF('Наш прайс'!#REF!=0,\"\",'Наш прайс'!#REF!)","v":{"$error":"#REF!"}},{"$f":"IF('Наш прайс'!#REF!=0,\"\",'Наш прайс'!#REF!)","v":{"$error":"#REF!"}},{"$f":"IF('Наш прайс'!#REF!=0,\"\",'Наш прайс'!#REF!)","v":{"$error":"#REF!"}},{"$f":"IF('Наш прайс'!#REF!=0,\"\",'Наш прайс'!#REF!)","v":{"$error":"#REF!"}},{"$f":"IF('Наш прайс'!#REF!=0,\"\",'Наш прайс'!#REF!)","v":{"$error":"#REF!"}}]
[{"$f":"IF('Наш прайс'!#REF!=0,\"\",'Наш прайс'!#REF!)","v":{"$error":"#REF!"}},{"$f":"IF('Наш прайс'!#REF!=0,\"\",'Наш прайс'!#REF!)","v":{"$error":"#REF!"}},{"$f":"IF('Наш прайс'!#REF!=0,\"\",'Наш прайс'!#REF!)","v":{"$error":"#REF!"}},{"$error":"#REF!"},null,null,{"$f":"IF('Наш прайс'!#REF!=0,\"\",'Наш прайс'!#REF!)","v":{"$error":"#REF!"}},{"$f":"IF('Наш прайс'!#REF!=0,\"\",'Наш прайс'!#REF!)","v":{"$error":"#REF!"}},{"$f":"IF('Наш прайс'!#REF!=0,\"\",'Наш прайс'!#REF!)","v":{"$error":"#REF!"}},{"$f":"IF('Наш прайс'!#REF!=0,\"\",'Наш прайс'!#REF!)","v":{"$error":"#REF!"}},{"$f":"IF('Наш прайс'!#REF!=0,\"\",'Наш прайс'!#REF!)","v":{"$error":"#REF!"}},{"$f":"IF('Наш прайс'!#REF!=0,\"\",'Наш прайс'!#REF!)","v":{"$error":"#REF!"}},{"$f":"IF('Наш прайс'!#REF!=0,\"\",'Наш прайс'!#REF!)","v":{"$error":"#REF!"}}]
[{"$f":"IF('Наш прайс'!#REF!=0,\"\",'Наш прайс'!#REF!)","v":{"$error":"#REF!"}},{"$f":"IF('Наш прайс'!#REF!=0,\"\",'Наш прайс'!#REF!)","v":{"$error":"#REF!"}},{"$f":"IF('Наш прайс'!#REF!=0,\"\",'Наш прайс'!#REF!)","v":{"$error":"#REF!"}},{"$error":"#REF!"},null,null,{"$f":"IF('Наш прайс'!#REF!=0,\"\",'Наш прайс'!#REF!)","v":{"$error":"#REF!"}},{"$f":"IF('Наш прайс'!#REF!=0,\"\",'Наш прайс'!#REF!)","v":{"$error":"#REF!"}},{"$f":"IF('Наш прайс'!#REF!=0,\"\",'Наш прайс'!#REF!)","v":{"$error":"#REF!"}},{"$f":"IF('Наш прайс'!#REF!=0,\"\",'Наш прайс'!#REF!)","v":{"$error":"#REF!"}},{"$f":"IF('Наш прайс'!#REF!=0,\"\",'Наш прайс'!#REF!)","v":{"$error":"#REF!"}},{"$f":"IF('Наш прайс'!#REF!=0,\"\",'Наш прайс'!#REF!)","v":{"$error":"#REF!"}},{"$f":"IF('Наш прайс'!#REF!=0,\"\",'Наш прайс'!#REF!)","v":{"$error":"#REF!"}}]
[{"$f":"IF('Наш прайс'!B14=0,\"\",'Наш прайс'!B14)","v":""},{"$f":"IF('Наш прайс'!#REF!=0,\"\",'Наш прайс'!#REF!)","v":{"$error":"#REF!"}},{"$f":"IF('Наш прайс'!#REF!=0,\"\",'Наш прайс'!#REF!)","v":{"$error":"#REF!"}},"",null,null,{"$f":"IF('Наш прайс'!#REF!=0,\"\",'Наш прайс'!#REF!)","v":{"$error":"#REF!"}},{"$f":"IF('Наш прайс'!#REF!=0,\"\",'Наш прайс'!#REF!)","v":{"$error":"#REF!"}},{"$f":"IF('Наш прайс'!#REF!=0,\"\",'Наш прайс'!#REF!)","v":{"$error":"#REF!"}},{"$f":"IF('Наш прайс'!#REF!=0,\"\",'Наш прайс'!#REF!)","v":{"$error":"#REF!"}},{"$f":"IF('Наш прайс'!#REF!=0,\"\",'Наш прайс'!#REF!)","v":{"$error":"#REF!"}},{"$f":"IF('Наш прайс'!J14=0,\"\",'Наш прайс'!J14)","v":""},{"$f":"IF('Наш прайс'!#REF!=0,\"\",'Наш прайс'!#REF!)","v":{"$error":"#REF!"}}]
[{"$f":"IF('Наш прайс'!B15=0,\"\",'Наш прайс'!B15)","v":""},{"$f":"IF('Наш прайс'!#REF!=0,\"\",'Наш прайс'!#REF!)","v":{"$error":"#REF!"}},{"$f":"IF('Наш прайс'!#REF!=0,\"\",'Наш прайс'!#REF!)","v":{"$error":"#REF!"}},"",null,null,{"$f":"IF('Наш прайс'!#REF!=0,\"\",'Наш прайс'!#REF!)","v":{"$error":"#REF!"}},{"$f":"IF('Наш прайс'!#REF!=0,\"\",'Наш прайс'!#REF!)","v":{"$error":"#REF!"}},{"$f":"IF('Наш прайс'!#REF!=0,\"\",'Наш прайс'!#REF!)","v":{"$error":"#REF!"}},{"$f":"IF('Наш прайс'!#REF!=0,\"\",'Наш прайс'!#REF!)","v":{"$error":"#REF!"}},{"$f":"IF('Наш прайс'!#REF!=0,\"\",'Наш прайс'!#REF!)","v":{"$error":"#REF!"}},{"$f":"IF('Наш прайс'!J15=0,\"\",'Наш прайс'!J15)","v":""},{"$f":"IF('Наш прайс'!#REF!=0,\"\",'Наш прайс'!#REF!)","v":{"$error":"#REF!"}}]
[{"$f":"IF('Наш прайс'!B16=0,\"\",'Наш прайс'!B16)","v":""},{"$f":"IF('Наш прайс'!#REF!=0,\"\",'Наш прайс'!#REF!)","v":{"$error":"#REF!"}},{"$f":"IF('Наш прайс'!#REF!=0,\"\",'Наш прайс'!#REF!)","v":{"$error":"#REF!"}},"",null,null,{"$f":"IF('Наш прайс'!#REF!=0,\"\",'Наш прайс'!#REF!)","v":{"$error":"#REF!"}},{"$f":"IF('Наш прайс'!#REF!=0,\"\",'Наш прайс'!#REF!)","v":{"$error":"#REF!"}},{"$f":"IF('Наш прайс'!#REF!=0,\"\",'Наш прайс'!#REF!)","v":{"$error":"#REF!"}},{"$f":"IF('Наш прайс'!#REF!=0,\"\",'Наш прайс'!#REF!)","v":{"$error":"#REF!"}},{"$f":"IF('Наш прайс'!#REF!=0,\"\",'Наш прайс'!#REF!)","v":{"$error":"#REF!"}},{"$f":"IF('Наш прайс'!J16=0,\"\",'Наш прайс'!J16)","v":""},{"$f":"IF('Наш прайс'!#REF!=0,\"\",'Наш прайс'!#REF!)","v":{"$error":"#REF!"}}]
[{"$f":"IF('Наш прайс'!B17=0,\"\",'Наш прайс'!B17)","v":""},{"$f":"IF('Наш прайс'!#REF!=0,\"\",'Наш прайс'!#REF!)","v":{"$error":"#REF!"}},{"$f":"IF('Наш прайс'!#REF!=0,\"\",'Наш прайс'!#REF!)","v":{"$error":"#REF!"}},"",null,null,{"$f":"IF('Наш прайс'!#REF!=0,\"\",'Наш прайс'!#REF!)","v":{"$error":"#REF!"}},{"$f":"IF('Наш прайс'!#REF!=0,\"\",'Наш прайс'!#REF!)","v":{"$error":"#REF!"}},{"$f":"IF('Наш прайс'!#REF!=0,\"\",'Наш прайс'!#REF!)","v":{"$error":"#REF!"}},{"$f":"IF('Наш прайс'!#REF!=0,\"\",'Наш прайс'!#REF!)","v":{"$error":"#REF!"}},{"$f":"IF('Наш прайс'!#REF!=0,\"\",'Наш прайс'!#REF!)","v":{"$error":"#REF!"}},{"$f":"IF('Наш прайс'!J17=0,\"\",'Наш прайс'!J17)","v":""},{"$f":"IF('Наш прайс'!#REF!=0,\"\",'Наш прайс'!#REF!)","v":{"$error":"#REF!"}}]
[{"$f":"IF('Наш прайс'!B18=0,\"\",'Наш прайс'!B18)","v":""},{"$f":"IF('Наш прайс'!#REF!=0,\"\",'Наш прайс'!#REF!)","v":{"$error":"#REF!"}},{"$f":"IF('Наш прайс'!#REF!=0,\"\",'Наш прайс'!#REF!)","v":{"$error":"#REF!"}},"",null,null,{"$f":"IF('Наш прайс'!#REF!=0,\"\",'Наш прайс'!#REF!)","v":{"$error":"#REF!"}},{"$f":"IF('Наш прайс'!#REF!=0,\"\",'Наш прайс'!#REF!)","v":{"$error":"#REF!"}},{"$f":"IF('Наш прайс'!#REF!=0,\"\",'Наш прайс'!#REF!)","v":{"$error":"#REF!"}},{"$f":"IF('Наш прайс'!#REF!=0,\"\",'Наш прайс'!#REF!)","v":{"$error":"#REF!"}},{"$f":"IF('Наш прайс'!#REF!=0,\"\",'Наш прайс'!#REF!)","v":{"$error":"#REF!"}},{"$f":"IF('Наш прайс'!J18=0,\"\",'Наш прайс'!J18)","v":""},{"$f":"IF('Наш прайс'!#REF!=0,\"\",'Наш прайс'!#REF!)","v":{"$error":"#REF!"}}]
[{"$f":"IF('Наш прайс'!B19=0,\"\",'Наш прайс'!B19)","v":""},{"$f":"IF('Наш прайс'!#REF!=0,\"\",'Наш прайс'!#REF!)","v":{"$error":"#REF!"}},{"$f":"IF('Наш прайс'!#REF!=0,\"\",'Наш прайс'!#REF!)","v":{"$error":"#REF!"}},"",null,null,{"$f":"IF('Наш прайс'!#REF!=0,\"\",'Наш прайс'!#REF!)","v":{"$error":"#REF!"}},{"$f":"IF('Наш прайс'!#REF!=0,\"\",'Наш прайс'!#REF!)","v":{"$error":"#REF!"}},{"$f":"IF('Наш прайс'!#REF!=0,\"\",'Наш прайс'!#REF!)","v":{"$error":"#REF!"}},{"$f":"IF('Наш прайс'!#REF!=0,\"\",'Наш прайс'!#REF!)","v":{"$error":"#REF!"}},{"$f":"IF('Наш прайс'!#REF!=0,\"\",'Наш прайс'!#REF!)","v":{"$error":"#REF!"}},{"$f":"IF('Наш прайс'!J19=0,\"\",'Наш прайс'!J19)","v":""},{"$f":"IF('Наш прайс'!#REF!=0,\"\",'Наш прайс'!#REF!)","v":{"$error":"#REF!"}}]
[{"$f":"IF('Наш прайс'!B20=0,\"\",'Наш прайс'!B20)","v":""},{"$f":"IF('Наш прайс'!#REF!=0,\"\",'Наш прайс'!#REF!)","v":{"$error":"#REF!"}},{"$f":"IF('Наш прайс'!#REF!=0,\"\",'Наш прайс'!#REF!)","v":{"$error":"#REF!"}},"",null,null,{"$f":"IF('Наш прайс'!#REF!=0,\"\",'Наш прайс'!#REF!)","v":{"$error":"#REF!"}},{"$f":"IF('Наш прайс'!#REF!=0,\"\",'Наш прайс'!#REF!)","v":{"$error":"#REF!"}},{"$f":"IF('Наш прайс'!#REF!=0,\"\",'Наш прайс'!#REF!)","v":{"$error":"#REF!"}},{"$f":"IF('Наш прайс'!#REF!=0,\"\",'Наш прайс'!#REF!)","v":{"$error":"#REF!"}},{"$f":"IF('Наш прайс'!#REF!=0,\"\",'Наш прайс'!#REF!)","v":{"$error":"#REF!"}},{"$f":"IF('Наш прайс'!J20=0,\"\",'Наш прайс'!J20)","v":""},{"$f":"IF('Наш прайс'!#REF!=0,\"\",'Наш прайс'!#REF!)","v":{"$error":"#REF!"}}]
[{"$f":"IF('Наш прайс'!B21=0,\"\",'Наш прайс'!B21)","v":""},{"$f":"IF('Наш прайс'!#REF!=0,\"\",'Наш прайс'!#REF!)","v":{"$error":"#REF!"}},{"$f":"IF('Наш прайс'!#REF!=0,\"\",'Наш прайс'!#REF!)","v":{"$error":"#REF!"}},"",null,null,{"$f":"IF('Наш прайс'!#REF!=0,\"\",'Наш прайс'!#REF!)","v":{"$error":"#REF!"}},{"$f":"IF('Наш прайс'!#REF!=0,\"\",'Наш прайс'!#REF!)","v":{"$error":"#REF!"}},{"$f":"IF('Наш прайс'!#REF!=0,\"\",'Наш прайс'!#REF!)","v":{"$error":"#REF!"}},{"$f":"IF('Наш прайс'!#REF!=0,\"\",'Наш прайс'!#REF!)","v":{"$error":"#REF!"}},{"$f":"IF('Наш прайс'!#REF!=0,\"\",'Наш прайс'!#REF!)","v":{"$error":"#REF!"}},{"$f":"IF('Наш прайс'!J21=0,\"\",'Наш прайс'!J21)","v":""},{"$f":"IF('Наш прайс'!#REF!=0,\"\",'Наш прайс'!#REF!)","v":{"$error":"#REF!"}}]
[{"$f":"IF('Наш прайс'!B22=0,\"\",'Наш прайс'!B22)","v":""},{"$f":"IF('Наш прайс'!#REF!=0,\"\",'Наш прайс'!#REF!)","v":{"$error":"#REF!"}},{"$f":"IF('Наш прайс'!#REF!=0,\"\",'Наш прайс'!#REF!)","v":{"$error":"#REF!"}},"",null,null,{"$f":"IF('Наш прайс'!#REF!=0,\"\",'Наш прайс'!#REF!)","v":{"$error":"#REF!"}},{"$f":"IF('Наш прайс'!#REF!=0,\"\",'Наш прайс'!#REF!)","v":{"$error":"#REF!"}},{"$f":"IF('Наш прайс'!#REF!=0,\"\",'Наш прайс'!#REF!)","v":{"$error":"#REF!"}},{"$f":"IF('Наш прайс'!#REF!=0,\"\",'Наш прайс'!#REF!)","v":{"$error":"#REF!"}},{"$f":"IF('Наш прайс'!#REF!=0,\"\",'Наш прайс'!#REF!)","v":{"$error":"#REF!"}},{"$f":"IF('Наш прайс'!J22=0,\"\",'Наш прайс'!J22)","v":""},{"$f":"IF('Наш прайс'!#REF!=0,\"\",'Наш прайс'!#REF!)","v":{"$error":"#REF!"}}]
[{"$f":"IF('Наш прайс'!B23=0,\"\",'Наш прайс'!B23)","v":""},{"$f":"IF('Наш прайс'!#REF!=0,\"\",'Наш прайс'!#REF!)","v":{"$error":"#REF!"}},{"$f":"IF('Наш прайс'!#REF!=0,\"\",'Наш прайс'!#REF!)","v":{"$error":"#REF!"}},"",null,null,{"$f":"IF('Наш прайс'!#REF!=0,\"\",'Наш прайс'!#REF!)","v":{"$error":"#REF!"}},{"$f":"IF('Наш прайс'!#REF!=0,\"\",'Наш прайс'!#REF!)","v":{"$error":"#REF!"}},{"$f":"IF('Наш прайс'!#REF!=0,\"\",'Наш прайс'!#REF!)","v":{"$error":"#REF!"}},{"$f":"IF('Наш прайс'!#REF!=0,\"\",'Наш прайс'!#REF!)","v":{"$error":"#REF!"}},{"$f":"IF('Наш прайс'!#REF!=0,\"\",'Наш прайс'!#REF!)","v":{"$error":"#REF!"}},{"$f":"IF('Наш прайс'!J23=0,\"\",'Наш прайс'!J23)","v":""},{"$f":"IF('Наш прайс'!#REF!=0,\"\",'Наш прайс'!#REF!)","v":{"$error":"#REF!"}}]
[{"$f":"IF('Наш прайс'!B24=0,\"\",'Наш прайс'!B24)","v":""},{"$f":"IF('Наш прайс'!#REF!=0,\"\",'Наш прайс'!#REF!)","v":{"$error":"#REF!"}},{"$f":"IF('Наш прайс'!#REF!=0,\"\",'Наш прайс'!#REF!)","v":{"$error":"#REF!"}},"",null,null,{"$f":"IF('Наш прайс'!#REF!=0,\"\",'Наш прайс'!#REF!)","v":{"$error":"#REF!"}},{"$f":"IF('Наш прайс'!#REF!=0,\"\",'Наш прайс'!#REF!)","v":{"$error":"#REF!"}},{"$f":"IF('Наш прайс'!#REF!=0,\"\",'Наш прайс'!#REF!)","v":{"$error":"#REF!"}},{"$f":"IF('Наш прайс'!#REF!=0,\"\",'Наш прайс'!#REF!)","v":{"$error":"#REF!"}},{"$f":"IF('Наш прайс'!#REF!=0,\"\",'Наш прайс'!#REF!)","v":{"$error":"#REF!"}},{"$f":"IF('Наш прайс'!J24=0,\"\",'Наш прайс'!J24)","v":""},{"$f":"IF('Наш прайс'!#REF!=0,\"\",'Наш прайс'!#REF!)","v":{"$error":"#REF!"}}]
[{"$f":"IF('Наш прайс'!B25=0,\"\",'Наш прайс'!B25)","v":""},{"$f":"IF('Наш прайс'!#REF!=0,\"\",'Наш прайс'!#REF!)","v":{"$error":"#REF!"}},{"$f":"IF('Наш прайс'!#REF!=0,\"\",'Наш прайс'!#REF!)","v":{"$error":"#REF!"}},"",null,null,{"$f":"IF('Наш прайс'!#REF!=0,\"\",'Наш прайс'!#REF!)","v":{"$error":"#REF!"}},{"$f":"IF('Наш прайс'!#REF!=0,\"\",'Наш прайс'!#REF!)","v":{"$error":"#REF!"}},{"$f":"IF('Наш прайс'!#REF!=0,\"\",'Наш прайс'!#REF!)","v":{"$error":"#REF!"}},{"$f":"IF('Наш прайс'!#REF!=0,\"\",'Наш прайс'!#REF!)","v":{"$error":"#REF!"}},{"$f":"IF('Наш прайс'!#REF!=0,\"\",'Наш прайс'!#REF!)","v":{"$error":"#REF!"}},{"$f":"IF('Наш прайс'!J25=0,\"\",'Наш прайс'!J25)","v":""},{"$f":"IF('Наш прайс'!#REF!=0,\"\",'Наш прайс'!#REF!)","v":{"$error":"#REF!"}}]
[{"$f":"IF('Наш прайс'!B26=0,\"\",'Наш прайс'!B26)","v":""},{"$f":"IF('Наш прайс'!#REF!=0,\"\",'Наш прайс'!#REF!)","v":{"$error":"#REF!"}},{"$f":"IF('Наш прайс'!#REF!=0,\"\",'Наш прайс'!#REF!)","v":{"$error":"#REF!"}},"",null,null,{"$f":"IF('Наш прайс'!#REF!=0,\"\",'Наш прайс'!#REF!)","v":{"$error":"#REF!"}},{"$f":"IF('Наш прайс'!#REF!=0,\"\",'Наш прайс'!#REF!)","v":{"$error":"#REF!"}},{"$f":"IF('Наш прайс'!#REF!=0,\"\",'Наш прайс'!#REF!)","v":{"$error":"#REF!"}},{"$f":"IF('Наш прайс'!#REF!=0,\"\",'Наш прайс'!#REF!)","v":{"$error":"#REF!"}},{"$f":"IF('Наш прайс'!#REF!=0,\"\",'Наш прайс'!#REF!)","v":{"$error":"#REF!"}},{"$f":"IF('Наш прайс'!J26=0,\"\",'Наш прайс'!J26)","v":""},{"$f":"IF('Наш прайс'!#REF!=0,\"\",'Наш прайс'!#REF!)","v":{"$error":"#REF!"}}]
[{"$f":"IF('Наш прайс'!B27=0,\"\",'Наш прайс'!B27)","v":""},{"$f":"IF('Наш прайс'!#REF!=0,\"\",'Наш прайс'!#REF!)","v":{"$error":"#REF!"}},{"$f":"IF('Наш прайс'!#REF!=0,\"\",'Наш прайс'!#REF!)","v":{"$error":"#REF!"}},"",null,null,{"$f":"IF('Наш прайс'!#REF!=0,\"\",'Наш прайс'!#REF!)","v":{"$error":"#REF!"}},{"$f":"IF('Наш прайс'!#REF!=0,\"\",'Наш прайс'!#REF!)","v":{"$error":"#REF!"}},{"$f":"IF('Наш прайс'!#REF!=0,\"\",'Наш прайс'!#REF!)","v":{"$error":"#REF!"}},{"$f":"IF('Наш прайс'!#REF!=0,\"\",'Наш прайс'!#REF!)","v":{"$error":"#REF!"}},{"$f":"IF('Наш прайс'!#REF!=0,\"\",'Наш прайс'!#REF!)","v":{"$error":"#REF!"}},{"$f":"IF('Наш прайс'!J27=0,\"\",'Наш прайс'!J27)","v":""},{"$f":"IF('Наш прайс'!#REF!=0,\"\",'Наш прайс'!#REF!)","v":{"$error":"#REF!"}}]
[{"$f":"IF('Наш прайс'!B28=0,\"\",'Наш прайс'!B28)","v":""},{"$f":"IF('Наш прайс'!#REF!=0,\"\",'Наш прайс'!#REF!)","v":{"$error":"#REF!"}},{"$f":"IF('Наш прайс'!#REF!=0,\"\",'Наш прайс'!#REF!)","v":{"$error":"#REF!"}},"",null,null,{"$f":"IF('Наш прайс'!#REF!=0,\"\",'Наш прайс'!#REF!)","v":{"$error":"#REF!"}},{"$f":"IF('Наш прайс'!#REF!=0,\"\",'Наш прайс'!#REF!)","v":{"$error":"#REF!"}},{"$f":"IF('Наш прайс'!#REF!=0,\"\",'Наш прайс'!#REF!)","v":{"$error":"#REF!"}},{"$f":"IF('Наш прайс'!#REF!=0,\"\",'Наш прайс'!#REF!)","v":{"$error":"#REF!"}},{"$f":"IF('Наш прайс'!#REF!=0,\"\",'Наш прайс'!#REF!)","v":{"$error":"#REF!"}},{"$f":"IF('Наш прайс'!J28=0,\"\",'Наш прайс'!J28)","v":""},{"$f":"IF('Наш прайс'!#REF!=0,\"\",'Наш прайс'!#REF!)","v":{"$error":"#REF!"}}]
[{"$f":"IF('Наш прайс'!B29=0,\"\",'Наш прайс'!B29)","v":""},{"$f":"IF('Наш прайс'!#REF!=0,\"\",'Наш прайс'!#REF!)","v":{"$error":"#REF!"}},{"$f":"IF('Наш прайс'!#REF!=0,\"\",'Наш прайс'!#REF!)","v":{"$error":"#REF!"}},"",null,null,{"$f":"IF('Наш прайс'!#REF!=0,\"\",'Наш прайс'!#REF!)","v":{"$error":"#REF!"}},{"$f":"IF('Наш прайс'!#REF!=0,\"\",'Наш прайс'!#REF!)","v":{"$error":"#REF!"}},{"$f":"IF('Наш прайс'!#REF!=0,\"\",'Наш прайс'!#REF!)","v":{"$error":"#REF!"}},{"$f":"IF('Наш прайс'!#REF!=0,\"\",'Наш прайс'!#REF!)","v":{"$error":"#REF!"}},{"$f":"IF('Наш прайс'!#REF!=0,\"\",'Наш прайс'!#REF!)","v":{"$error":"#REF!"}},{"$f":"IF('Наш прайс'!J29=0,\"\",'Наш прайс'!J29)","v":""},{"$f":"IF('Наш прайс'!#REF!=0,\"\",'Наш прайс'!#REF!)","v":{"$error":"#REF!"}}]
[{"$f":"IF('Наш прайс'!B30=0,\"\",'Наш прайс'!B30)","v":""},{"$f":"IF('Наш прайс'!#REF!=0,\"\",'Наш прайс'!#REF!)","v":{"$error":"#REF!"}},{"$f":"IF('Наш прайс'!#REF!=0,\"\",'Наш прайс'!#REF!)","v":{"$error":"#REF!"}},"",null,null,{"$f":"IF('Наш прайс'!#REF!=0,\"\",'Наш прайс'!#REF!)","v":{"$error":"#REF!"}},{"$f":"IF('Наш прайс'!#REF!=0,\"\",'Наш прайс'!#REF!)","v":{"$error":"#REF!"}},{"$f":"IF('Наш прайс'!#REF!=0,\"\",'Наш прайс'!#REF!)","v":{"$error":"#REF!"}},{"$f":"IF('Наш прайс'!#REF!=0,\"\",'Наш прайс'!#REF!)","v":{"$error":"#REF!"}},{"$f":"IF('Наш прайс'!#REF!=0,\"\",'Наш прайс'!#REF!)","v":{"$error":"#REF!"}},{"$f":"IF('Наш прайс'!J30=0,\"\",'Наш прайс'!J30)","v":""},{"$f":"IF('Наш прайс'!#REF!=0,\"\",'Наш прайс'!#REF!)","v":{"$error":"#REF!"}}]
[{"$f":"IF('Наш прайс'!B31=0,\"\",'Наш прайс'!B31)","v":""},{"$f":"IF('Наш прайс'!#REF!=0,\"\",'Наш прайс'!#REF!)","v":{"$error":"#REF!"}},{"$f":"IF('Наш прайс'!#REF!=0,\"\",'Наш прайс'!#REF!)","v":{"$error":"#REF!"}},"",null,null,{"$f":"IF('Наш прайс'!#REF!=0,\"\",'Наш прайс'!#REF!)","v":{"$error":"#REF!"}},{"$f":"IF('Наш прайс'!#REF!=0,\"\",'Наш прайс'!#REF!)","v":{"$error":"#REF!"}},{"$f":"IF('Наш прайс'!#REF!=0,\"\",'Наш прайс'!#REF!)","v":{"$error":"#REF!"}},{"$f":"IF('Наш прайс'!#REF!=0,\"\",'Наш прайс'!#REF!)","v":{"$error":"#REF!"}},{"$f":"IF('Наш прайс'!#REF!=0,\"\",'Наш прайс'!#REF!)","v":{"$error":"#REF!"}},{"$f":"IF('Наш прайс'!J31=0,\"\",'Наш прайс'!J31)","v":""},{"$f":"IF('Наш прайс'!#REF!=0,\"\",'Наш прайс'!#REF!)","v":{"$error":"#REF!"}}]
[{"$f":"IF('Наш прайс'!B32=0,\"\",'Наш прайс'!B32)","v":""},{"$f":"IF('Наш прайс'!#REF!=0,\"\",'Наш прайс'!#REF!)","v":{"$error":"#REF!"}},{"$f":"IF('Наш прайс'!#REF!=0,\"\",'Наш прайс'!#REF!)","v":{"$error":"#REF!"}},"",null,null,{"$f":"IF('Наш прайс'!#REF!=0,\"\",'Наш прайс'!#REF!)","v":{"$error":"#REF!"}},{"$f":"IF('Наш прайс'!#REF!=0,\"\",'Наш прайс'!#REF!)","v":{"$error":"#REF!"}},{"$f":"IF('Наш прайс'!#REF!=0,\"\",'Наш прайс'!#REF!)","v":{"$error":"#REF!"}},{"$f":"IF('Наш прайс'!#REF!=0,\"\",'Наш прайс'!#REF!)","v":{"$error":"#REF!"}},{"$f":"IF('Наш прайс'!#REF!=0,\"\",'Наш прайс'!#REF!)","v":{"$error":"#REF!"}},{"$f":"IF('Наш прайс'!J32=0,\"\",'Наш прайс'!J32)","v":""},{"$f":"IF('Наш прайс'!#REF!=0,\"\",'Наш прайс'!#REF!)","v":{"$error":"#REF!"}}]
[{"$f":"IF('Наш прайс'!B33=0,\"\",'Наш прайс'!B33)","v":""},{"$f":"IF('Наш прайс'!#REF!=0,\"\",'Наш прайс'!#REF!)","v":{"$error":"#REF!"}},{"$f":"IF('Наш прайс'!#REF!=0,\"\",'Наш прайс'!#REF!)","v":{"$error":"#REF!"}},"",null,null,{"$f":"IF('Наш прайс'!#REF!=0,\"\",'Наш прайс'!#REF!)","v":{"$error":"#REF!"}},{"$f":"IF('Наш прайс'!#REF!=0,\"\",'Наш прайс'!#REF!)","v":{"$error":"#REF!"}},{"$f":"IF('Наш прайс'!#REF!=0,\"\",'Наш прайс'!#REF!)","v":{"$error":"#REF!"}},{"$f":"IF('Наш прайс'!#REF!=0,\"\",'Наш прайс'!#REF!)","v":{"$error":"#REF!"}},{"$f":"IF('Наш прайс'!#REF!=0,\"\",'Наш прайс'!#REF!)","v":{"$error":"#REF!"}},{"$f":"IF('Наш прайс'!J33=0,\"\",'Наш прайс'!J33)","v":""},{"$f":"IF('Наш прайс'!#REF!=0,\"\",'Наш прайс'!#REF!)","v":{"$error":"#REF!"}}]
[{"$f":"IF('Наш прайс'!B34=0,\"\",'Наш прайс'!B34)","v":""},{"$f":"IF('Наш прайс'!#REF!=0,\"\",'Наш прайс'!#REF!)","v":{"$error":"#REF!"}},{"$f":"IF('Наш прайс'!#REF!=0,\"\",'Наш прайс'!#REF!)","v":{"$error":"#REF!"}},"",null,null,{"$f":"IF('Наш прайс'!#REF!=0,\"\",'Наш прайс'!#REF!)","v":{"$error":"#REF!"}},{"$f":"IF('Наш прайс'!#REF!=0,\"\",'Наш прайс'!#REF!)","v":{"$error":"#REF!"}},{"$f":"IF('Наш прайс'!#REF!=0,\"\",'Наш прайс'!#REF!)","v":{"$error":"#REF!"}},{"$f":"IF('Наш прайс'!#REF!=0,\"\",'Наш прайс'!#REF!)","v":{"$error":"#REF!"}},{"$f":"IF('Наш прайс'!#REF!=0,\"\",'Наш прайс'!#REF!)","v":{"$error":"#REF!"}},{"$f":"IF('Наш прайс'!J34=0,\"\",'Наш прайс'!J34)","v":""},{"$f":"IF('Наш прайс'!#REF!=0,\"\",'Наш прайс'!#REF!)","v":{"$error":"#REF!"}}]
[{"$f":"IF('Наш прайс'!B35=0,\"\",'Наш прайс'!B35)","v":""},{"$f":"IF('Наш прайс'!#REF!=0,\"\",'Наш прайс'!#REF!)","v":{"$error":"#REF!"}},{"$f":"IF('Наш прайс'!#REF!=0,\"\",'Наш прайс'!#REF!)","v":{"$error":"#REF!"}},"",null,null,{"$f":"IF('Наш прайс'!#REF!=0,\"\",'Наш прайс'!#REF!)","v":{"$error":"#REF!"}},{"$f":"IF('Наш прайс'!#REF!=0,\"\",'Наш прайс'!#REF!)","v":{"$error":"#REF!"}},{"$f":"IF('Наш прайс'!#REF!=0,\"\",'Наш прайс'!#REF!)","v":{"$error":"#REF!"}},{"$f":"IF('Наш прайс'!#REF!=0,\"\",'Наш прайс'!#REF!)","v":{"$error":"#REF!"}},{"$f":"IF('Наш прайс'!#REF!=0,\"\",'Наш прайс'!#REF!)","v":{"$error":"#REF!"}},{"$f":"IF('Наш прайс'!J35=0,\"\",'Наш прайс'!J35)","v":""},{"$f":"IF('Наш прайс'!#REF!=0,\"\",'Наш прайс'!#REF!)","v":{"$error":"#REF!"}}]
[{"$f":"IF('Наш прайс'!B36=0,\"\",'Наш прайс'!B36)","v":""},{"$f":"IF('Наш прайс'!#REF!=0,\"\",'Наш прайс'!#REF!)","v":{"$error":"#REF!"}},{"$f":"IF('Наш прайс'!#REF!=0,\"\",'Наш прайс'!#REF!)","v":{"$error":"#REF!"}},"",null,null,{"$f":"IF('Наш прайс'!#REF!=0,\"\",'Наш прайс'!#REF!)","v":{"$error":"#REF!"}},{"$f":"IF('Наш прайс'!#REF!=0,\"\",'Наш прайс'!#REF!)","v":{"$error":"#REF!"}},{"$f":"IF('Наш прайс'!#REF!=0,\"\",'Наш прайс'!#REF!)","v":{"$error":"#REF!"}},{"$f":"IF('Наш прайс'!#REF!=0,\"\",'Наш прайс'!#REF!)","v":{"$error":"#REF!"}},{"$f":"IF('Наш прайс'!#REF!=0,\"\",'Наш прайс'!#REF!)","v":{"$error":"#REF!"}},{"$f":"IF('Наш прайс'!J36=0,\"\",'Наш прайс'!J36)","v":""},{"$f":"IF('Наш прайс'!#REF!=0,\"\",'Наш прайс'!#REF!)","v":{"$error":"#REF!"}}]
[{"$f":"IF('Наш прайс'!B37=0,\"\",'Наш прайс'!B37)","v":""},{"$f":"IF('Наш прайс'!#REF!=0,\"\",'Наш прайс'!#REF!)","v":{"$error":"#REF!"}},{"$f":"IF('Наш прайс'!#REF!=0,\"\",'Наш прайс'!#REF!)","v":{"$error":"#REF!"}},"",null,null,{"$f":"IF('Наш прайс'!#REF!=0,\"\",'Наш прайс'!#REF!)","v":{"$error":"#REF!"}},{"$f":"IF('Наш прайс'!#REF!=0,\"\",'Наш прайс'!#REF!)","v":{"$error":"#REF!"}},{"$f":"IF('Наш прайс'!#REF!=0,\"\",'Наш прайс'!#REF!)","v":{"$error":"#REF!"}},{"$f":"IF('Наш прайс'!#REF!=0,\"\",'Наш прайс'!#REF!)","v":{"$error":"#REF!"}},{"$f":"IF('Наш прайс'!#REF!=0,\"\",'Наш прайс'!#REF!)","v":{"$error":"#REF!"}},{"$f":"IF('Наш прайс'!J37=0,\"\",'Наш прайс'!J37)","v":""},{"$f":"IF('Наш прайс'!#REF!=0,\"\",'Наш прайс'!#REF!)","v":{"$error":"#REF!"}}]
[{"$f":"IF('Наш прайс'!B38=0,\"\",'Наш прайс'!B38)","v":""},{"$f":"IF('Наш прайс'!#REF!=0,\"\",'Наш прайс'!#REF!)","v":{"$error":"#REF!"}},{"$f":"IF('Наш прайс'!#REF!=0,\"\",'Наш прайс'!#REF!)","v":{"$error":"#REF!"}},"",null,null,{"$f":"IF('Наш прайс'!#REF!=0,\"\",'Наш прайс'!#REF!)","v":{"$error":"#REF!"}},{"$f":"IF('Наш прайс'!#REF!=0,\"\",'Наш прайс'!#REF!)","v":{"$error":"#REF!"}},{"$f":"IF('Наш прайс'!#REF!=0,\"\",'Наш прайс'!#REF!)","v":{"$error":"#REF!"}},{"$f":"IF('Наш прайс'!#REF!=0,\"\",'Наш прайс'!#REF!)","v":{"$error":"#REF!"}},{"$f":"IF('Наш прайс'!#REF!=0,\"\",'Наш прайс'!#REF!)","v":{"$error":"#REF!"}},{"$f":"IF('Наш прайс'!J38=0,\"\",'Наш прайс'!J38)","v":""},{"$f":"IF('Наш прайс'!#REF!=0,\"\",'Наш прайс'!#REF!)","v":{"$error":"#REF!"}}]
[{"$f":"IF('Наш прайс'!B39=0,\"\",'Наш прайс'!B39)","v":""},{"$f":"IF('Наш прайс'!#REF!=0,\"\",'Наш прайс'!#REF!)","v":{"$error":"#REF!"}},{"$f":"IF('Наш прайс'!#REF!=0,\"\",'Наш прайс'!#REF!)","v":{"$error":"#REF!"}},"",null,null,{"$f":"IF('Наш прайс'!#REF!=0,\"\",'Наш прайс'!#REF!)","v":{"$error":"#REF!"}},{"$f":"IF('Наш прайс'!#REF!=0,\"\",'Наш прайс'!#REF!)","v":{"$error":"#REF!"}},{"$f":"IF('Наш прайс'!#REF!=0,\"\",'Наш прайс'!#REF!)","v":{"$error":"#REF!"}},{"$f":"IF('Наш прайс'!#REF!=0,\"\",'Наш прайс'!#REF!)","v":{"$error":"#REF!"}},{"$f":"IF('Наш прайс'!#REF!=0,\"\",'Наш прайс'!#REF!)","v":{"$error":"#REF!"}},{"$f":"IF('Наш прайс'!J39=0,\"\",'Наш прайс'!J39)","v":""},{"$f":"IF('Наш прайс'!#REF!=0,\"\",'Наш прайс'!#REF!)","v":{"$error":"#REF!"}}]
[{"$f":"IF('Наш прайс'!B40=0,\"\",'Наш прайс'!B40)","v":""},{"$f":"IF('Наш прайс'!#REF!=0,\"\",'Наш прайс'!#REF!)","v":{"$error":"#REF!"}},{"$f":"IF('Наш прайс'!#REF!=0,\"\",'Наш прайс'!#REF!)","v":{"$error":"#REF!"}},"",null,null,{"$f":"IF('Наш прайс'!#REF!=0,\"\",'Наш прайс'!#REF!)","v":{"$error":"#REF!"}},{"$f":"IF('Наш прайс'!#REF!=0,\"\",'Наш прайс'!#REF!)","v":{"$error":"#REF!"}},{"$f":"IF('Наш прайс'!#REF!=0,\"\",'Наш прайс'!#REF!)","v":{"$error":"#REF!"}},{"$f":"IF('Наш прайс'!#REF!=0,\"\",'Наш прайс'!#REF!)","v":{"$error":"#REF!"}},{"$f":"IF('Наш прайс'!#REF!=0,\"\",'Наш прайс'!#REF!)","v":{"$error":"#REF!"}},{"$f":"IF('Наш прайс'!J40=0,\"\",'Наш прайс'!J40)","v":""},{"$f":"IF('Наш прайс'!#REF!=0,\"\",'Наш прайс'!#REF!)","v":{"$error":"#REF!"}}]
[{"$f":"IF('Наш прайс'!B41=0,\"\",'Наш прайс'!B41)","v":""},{"$f":"IF('Наш прайс'!#REF!=0,\"\",'Наш прайс'!#REF!)","v":{"$error":"#REF!"}},{"$f":"IF('Наш прайс'!#REF!=0,\"\",'Наш прайс'!#REF!)","v":{"$error":"#REF!"}},"",null,null,{"$f":"IF('Наш прайс'!#REF!=0,\"\",'Наш прайс'!#REF!)","v":{"$error":"#REF!"}},{"$f":"IF('Наш прайс'!#REF!=0,\"\",'Наш прайс'!#REF!)","v":{"$error":"#REF!"}},{"$f":"IF('Наш прайс'!#REF!=0,\"\",'Наш прайс'!#REF!)","v":{"$error":"#REF!"}},{"$f":"IF('Наш прайс'!#REF!=0,\"\",'Наш прайс'!#REF!)","v":{"$error":"#REF!"}},{"$f":"IF('Наш прайс'!#REF!=0,\"\",'Наш прайс'!#REF!)","v":{"$error":"#REF!"}},{"$f":"IF('Наш прайс'!J41=0,\"\",'Наш прайс'!J41)","v":""},{"$f":"IF('Наш прайс'!#REF!=0,\"\",'Наш прайс'!#REF!)","v":{"$error":"#REF!"}}]
[{"$f":"IF('Наш прайс'!B42=0,\"\",'Наш прайс'!B42)","v":""},{"$f":"IF('Наш прайс'!#REF!=0,\"\",'Наш прайс'!#REF!)","v":{"$error":"#REF!"}},{"$f":"IF('Наш прайс'!#REF!=0,\"\",'Наш прайс'!#REF!)","v":{"$error":"#REF!"}},"",null,null,{"$f":"IF('Наш прайс'!#REF!=0,\"\",'Наш прайс'!#REF!)","v":{"$error":"#REF!"}},{"$f":"IF('Наш прайс'!#REF!=0,\"\",'Наш прайс'!#REF!)","v":{"$error":"#REF!"}},{"$f":"IF('Наш прайс'!#REF!=0,\"\",'Наш прайс'!#REF!)","v":{"$error":"#REF!"}},{"$f":"IF('Наш прайс'!#REF!=0,\"\",'Наш прайс'!#REF!)","v":{"$error":"#REF!"}},{"$f":"IF('Наш прайс'!#REF!=0,\"\",'Наш прайс'!#REF!)","v":{"$error":"#REF!"}},{"$f":"IF('Наш прайс'!J42=0,\"\",'Наш прайс'!J42)","v":""},{"$f":"IF('Наш прайс'!#REF!=0,\"\",'Наш прайс'!#REF!)","v":{"$error":"#REF!"}}]
[{"$f":"IF('Наш прайс'!B43=0,\"\",'Наш прайс'!B43)","v":""},{"$f":"IF('Наш прайс'!#REF!=0,\"\",'Наш прайс'!#REF!)","v":{"$error":"#REF!"}},{"$f":"IF('Наш прайс'!#REF!=0,\"\",'Наш прайс'!#REF!)","v":{"$error":"#REF!"}},"",null,null,{"$f":"IF('Наш прайс'!#REF!=0,\"\",'Наш прайс'!#REF!)","v":{"$error":"#REF!"}},{"$f":"IF('Наш прайс'!#REF!=0,\"\",'Наш прайс'!#REF!)","v":{"$error":"#REF!"}},{"$f":"IF('Наш прайс'!#REF!=0,\"\",'Наш прайс'!#REF!)","v":{"$error":"#REF!"}},{"$f":"IF('Наш прайс'!#REF!=0,\"\",'Наш прайс'!#REF!)","v":{"$error":"#REF!"}},{"$f":"IF('Наш прайс'!#REF!=0,\"\",'Наш прайс'!#REF!)","v":{"$error":"#REF!"}},{"$f":"IF('Наш прайс'!J43=0,\"\",'Наш прайс'!J43)","v":""},{"$f":"IF('Наш прайс'!#REF!=0,\"\",'Наш прайс'!#REF!)","v":{"$error":"#REF!"}}]
[{"$f":"IF('Наш прайс'!B44=0,\"\",'Наш прайс'!B44)","v":""},{"$f":"IF('Наш прайс'!#REF!=0,\"\",'Наш прайс'!#REF!)","v":{"$error":"#REF!"}},{"$f":"IF('Наш прайс'!#REF!=0,\"\",'Наш прайс'!#REF!)","v":{"$error":"#REF!"}},"",null,null,{"$f":"IF('Наш прайс'!#REF!=0,\"\",'Наш прайс'!#REF!)","v":{"$error":"#REF!"}},{"$f":"IF('Наш прайс'!#REF!=0,\"\",'Наш прайс'!#REF!)","v":{"$error":"#REF!"}},{"$f":"IF('Наш прайс'!#REF!=0,\"\",'Наш прайс'!#REF!)","v":{"$error":"#REF!"}},{"$f":"IF('Наш прайс'!#REF!=0,\"\",'Наш прайс'!#REF!)","v":{"$error":"#REF!"}},{"$f":"IF('Наш прайс'!#REF!=0,\"\",'Наш прайс'!#REF!)","v":{"$error":"#REF!"}},{"$f":"IF('Наш прайс'!J44=0,\"\",'Наш прайс'!J44)","v":""},{"$f":"IF('Наш прайс'!#REF!=0,\"\",'Наш прайс'!#REF!)","v":{"$error":"#REF!"}}]
[{"$f":"IF('Наш прайс'!B45=0,\"\",'Наш прайс'!B45)","v":""},{"$f":"IF('Наш прайс'!#REF!=0,\"\",'Наш прайс'!#REF!)","v":{"$error":"#REF!"}},{"$f":"IF('Наш прайс'!#REF!=0,\"\",'Наш прайс'!#REF!)","v":{"$error":"#REF!"}},"",null,null,{"$f":"IF('Наш прайс'!#REF!=0,\"\",'Наш прайс'!#REF!)","v":{"$error":"#REF!"}},{"$f":"IF('Наш прайс'!#REF!=0,\"\",'Наш прайс'!#REF!)","v":{"$error":"#REF!"}},{"$f":"IF('Наш прайс'!#REF!=0,\"\",'Наш прайс'!#REF!)","v":{"$error":"#REF!"}},{"$f":"IF('Наш прайс'!#REF!=0,\"\",'Наш прайс'!#REF!)","v":{"$error":"#REF!"}},{"$f":"IF('Наш прайс'!#REF!=0,\"\",'Наш прайс'!#REF!)","v":{"$error":"#REF!"}},{"$f":"IF('Наш прайс'!J45=0,\"\",'Наш прайс'!J45)","v":""},{"$f":"IF('Наш прайс'!#REF!=0,\"\",'Наш прайс'!#REF!)","v":{"$error":"#REF!"}}]
[{"$f":"IF('Наш прайс'!B46=0,\"\",'Наш прайс'!B46)","v":""},{"$f":"IF('Наш прайс'!#REF!=0,\"\",'Наш прайс'!#REF!)","v":{"$error":"#REF!"}},{"$f":"IF('Наш прайс'!#REF!=0,\"\",'Наш прайс'!#REF!)","v":{"$error":"#REF!"}},"",null,null,{"$f":"IF('Наш прайс'!#REF!=0,\"\",'Наш прайс'!#REF!)","v":{"$error":"#REF!"}},{"$f":"IF('Наш прайс'!#REF!=0,\"\",'Наш прайс'!#REF!)","v":{"$error":"#REF!"}},{"$f":"IF('Наш прайс'!#REF!=0,\"\",'Наш прайс'!#REF!)","v":{"$error":"#REF!"}},{"$f":"IF('Наш прайс'!#REF!=0,\"\",'Наш прайс'!#REF!)","v":{"$error":"#REF!"}},{"$f":"IF('Наш прайс'!#REF!=0,\"\",'Наш прайс'!#REF!)","v":{"$error":"#REF!"}},{"$f":"IF('Наш прайс'!J46=0,\"\",'Наш прайс'!J46)","v":""},{"$f":"IF('Наш прайс'!#REF!=0,\"\",'Наш прайс'!#REF!)","v":{"$error":"#REF!"}}]
[{"$f":"IF('Наш прайс'!B47=0,\"\",'Наш прайс'!B47)","v":""},{"$f":"IF('Наш прайс'!#REF!=0,\"\",'Наш прайс'!#REF!)","v":{"$error":"#REF!"}},{"$f":"IF('Наш прайс'!#REF!=0,\"\",'Наш прайс'!#REF!)","v":{"$error":"#REF!"}},"",null,null,{"$f":"IF('Наш прайс'!#REF!=0,\"\",'Наш прайс'!#REF!)","v":{"$error":"#REF!"}},{"$f":"IF('Наш прайс'!#REF!=0,\"\",'Наш прайс'!#REF!)","v":{"$error":"#REF!"}},{"$f":"IF('Наш прайс'!#REF!=0,\"\",'Наш прайс'!#REF!)","v":{"$error":"#REF!"}},{"$f":"IF('Наш прайс'!#REF!=0,\"\",'Наш прайс'!#REF!)","v":{"$error":"#REF!"}},{"$f":"IF('Наш прайс'!#REF!=0,\"\",'Наш прайс'!#REF!)","v":{"$error":"#REF!"}},{"$f":"IF('Наш прайс'!J47=0,\"\",'Наш прайс'!J47)","v":""},{"$f":"IF('Наш прайс'!#REF!=0,\"\",'Наш прайс'!#REF!)","v":{"$error":"#REF!"}}]
[{"$f":"IF('Наш прайс'!B48=0,\"\",'Наш прайс'!B48)","v":""},{"$f":"IF('Наш прайс'!#REF!=0,\"\",'Наш прайс'!#REF!)","v":{"$error":"#REF!"}},{"$f":"IF('Наш прайс'!#REF!=0,\"\",'Наш прайс'!#REF!)","v":{"$error":"#REF!"}},{"$f":"L257","v":""},null,null,{"$f":"IF('Наш прайс'!#REF!=0,\"\",'Наш прайс'!#REF!)","v":{"$error":"#REF!"}},{"$f":"IF('Наш прайс'!#REF!=0,\"\",'Наш прайс'!#REF!)","v":{"$error":"#REF!"}},{"$f":"IF('Наш прайс'!#REF!=0,\"\",'Наш прайс'!#REF!)","v":{"$error":"#REF!"}},{"$f":"IF('Наш прайс'!#REF!=0,\"\",'Наш прайс'!#REF!)","v":{"$error":"#REF!"}},{"$f":"IF('Наш прайс'!#REF!=0,\"\",'Наш прайс'!#REF!)","v":{"$error":"#REF!"}},{"$f":"IF('Наш прайс'!J48=0,\"\",'Наш прайс'!J48)","v":""},{"$f":"IF('Наш прайс'!#REF!=0,\"\",'Наш прайс'!#REF!)","v":{"$error":"#REF!"}}]
[{"$f":"IF('Наш прайс'!B49=0,\"\",'Наш прайс'!B49)","v":""},{"$f":"IF('Наш прайс'!#REF!=0,\"\",'Наш прайс'!#REF!)","v":{"$error":"#REF!"}},{"$f":"IF('Наш прайс'!#REF!=0,\"\",'Наш прайс'!#REF!)","v":{"$error":"#REF!"}},"",null,null,{"$f":"IF('Наш прайс'!#REF!=0,\"\",'Наш прайс'!#REF!)","v":{"$error":"#REF!"}},{"$f":"IF('Наш прайс'!#REF!=0,\"\",'Наш прайс'!#REF!)","v":{"$error":"#REF!"}},{"$f":"IF('Наш прайс'!#REF!=0,\"\",'Наш прайс'!#REF!)","v":{"$error":"#REF!"}},{"$f":"IF('Наш прайс'!#REF!=0,\"\",'Наш прайс'!#REF!)","v":{"$error":"#REF!"}},{"$f":"IF('Наш прайс'!#REF!=0,\"\",'Наш прайс'!#REF!)","v":{"$error":"#REF!"}},{"$f":"IF('Наш прайс'!J49=0,\"\",'Наш прайс'!J49)","v":""},{"$f":"IF('Наш прайс'!#REF!=0,\"\",'Наш прайс'!#REF!)","v":{"$error":"#REF!"}}]
[{"$f":"IF('Наш прайс'!B50=0,\"\",'Наш прайс'!B50)","v":""},{"$f":"IF('Наш прайс'!#REF!=0,\"\",'Наш прайс'!#REF!)","v":{"$error":"#REF!"}},{"$f":"IF('Наш прайс'!#REF!=0,\"\",'Наш прайс'!#REF!)","v":{"$error":"#REF!"}},"",null,null,{"$f":"IF('Наш прайс'!#REF!=0,\"\",'Наш прайс'!#REF!)","v":{"$error":"#REF!"}},{"$f":"IF('Наш прайс'!#REF!=0,\"\",'Наш прайс'!#REF!)","v":{"$error":"#REF!"}},{"$f":"IF('Наш прайс'!#REF!=0,\"\",'Наш прайс'!#REF!)","v":{"$error":"#REF!"}},{"$f":"IF('Наш прайс'!#REF!=0,\"\",'Наш прайс'!#REF!)","v":{"$error":"#REF!"}},{"$f":"IF('Наш прайс'!#REF!=0,\"\",'Наш прайс'!#REF!)","v":{"$error":"#REF!"}},{"$f":"IF('Наш прайс'!J50=0,\"\",'Наш прайс'!J50)","v":""},{"$f":"IF('Наш прайс'!#REF!=0,\"\",'Наш прайс'!#REF!)","v":{"$error":"#REF!"}}]
[{"$f":"IF('Наш прайс'!B51=0,\"\",'Наш прайс'!B51)","v":""},{"$f":"IF('Наш прайс'!#REF!=0,\"\",'Наш прайс'!#REF!)","v":{"$error":"#REF!"}},{"$f":"IF('Наш прайс'!#REF!=0,\"\",'Наш прайс'!#REF!)","v":{"$error":"#REF!"}},"",null,null,{"$f":"IF('Наш прайс'!#REF!=0,\"\",'Наш прайс'!#REF!)","v":{"$error":"#REF!"}},{"$f":"IF('Наш прайс'!#REF!=0,\"\",'Наш прайс'!#REF!)","v":{"$error":"#REF!"}},{"$f":"IF('Наш прайс'!#REF!=0,\"\",'Наш прайс'!#REF!)","v":{"$error":"#REF!"}},{"$f":"IF('Наш прайс'!#REF!=0,\"\",'Наш прайс'!#REF!)","v":{"$error":"#REF!"}},{"$f":"IF('Наш прайс'!#REF!=0,\"\",'Наш прайс'!#REF!)","v":{"$error":"#REF!"}},{"$f":"IF('Наш прайс'!J51=0,\"\",'Наш прайс'!J51)","v":""},{"$f":"IF('Наш прайс'!#REF!=0,\"\",'Наш прайс'!#REF!)","v":{"$error":"#REF!"}}]
[{"$f":"IF('Наш прайс'!B52=0,\"\",'Наш прайс'!B52)","v":""},{"$f":"IF('Наш прайс'!#REF!=0,\"\",'Наш прайс'!#REF!)","v":{"$error":"#REF!"}},{"$f":"IF('Наш прайс'!#REF!=0,\"\",'Наш прайс'!#REF!)","v":{"$error":"#REF!"}},"",null,null,{"$f":"IF('Наш прайс'!#REF!=0,\"\",'Наш прайс'!#REF!)","v":{"$error":"#REF!"}},{"$f":"IF('Наш прайс'!#REF!=0,\"\",'Наш прайс'!#REF!)","v":{"$error":"#REF!"}},{"$f":"IF('Наш прайс'!#REF!=0,\"\",'Наш прайс'!#REF!)","v":{"$error":"#REF!"}},{"$f":"IF('Наш прайс'!#REF!=0,\"\",'Наш прайс'!#REF!)","v":{"$error":"#REF!"}},{"$f":"IF('Наш прайс'!#REF!=0,\"\",'Наш прайс'!#REF!)","v":{"$error":"#REF!"}},{"$f":"IF('Наш прайс'!J52=0,\"\",'Наш прайс'!J52)","v":""},{"$f":"IF('Наш прайс'!#REF!=0,\"\",'Наш прайс'!#REF!)","v":{"$error":"#REF!"}}]
[{"$f":"IF('Наш прайс'!B53=0,\"\",'Наш прайс'!B53)","v":""},{"$f":"IF('Наш прайс'!#REF!=0,\"\",'Наш прайс'!#REF!)","v":{"$error":"#REF!"}},{"$f":"IF('Наш прайс'!#REF!=0,\"\",'Наш прайс'!#REF!)","v":{"$error":"#REF!"}},"",null,null,{"$f":"IF('Наш прайс'!#REF!=0,\"\",'Наш прайс'!#REF!)","v":{"$error":"#REF!"}},{"$f":"IF('Наш прайс'!#REF!=0,\"\",'Наш прайс'!#REF!)","v":{"$error":"#REF!"}},{"$f":"IF('Наш прайс'!#REF!=0,\"\",'Наш прайс'!#REF!)","v":{"$error":"#REF!"}},{"$f":"IF('Наш прайс'!#REF!=0,\"\",'Наш прайс'!#REF!)","v":{"$error":"#REF!"}},{"$f":"IF('Наш прайс'!#REF!=0,\"\",'Наш прайс'!#REF!)","v":{"$error":"#REF!"}},{"$f":"IF('Наш прайс'!J53=0,\"\",'Наш прайс'!J53)","v":""},{"$f":"IF('Наш прайс'!#REF!=0,\"\",'Наш прайс'!#REF!)","v":{"$error":"#REF!"}}]
[{"$f":"IF('Наш прайс'!B54=0,\"\",'Наш прайс'!B54)","v":""},{"$f":"IF('Наш прайс'!#REF!=0,\"\",'Наш прайс'!#REF!)","v":{"$error":"#REF!"}},{"$f":"IF('Наш прайс'!#REF!=0,\"\",'Наш прайс'!#REF!)","v":{"$error":"#REF!"}},"",null,null,{"$f":"IF('Наш прайс'!#REF!=0,\"\",'Наш прайс'!#REF!)","v":{"$error":"#REF!"}},{"$f":"IF('Наш прайс'!#REF!=0,\"\",'Наш прайс'!#REF!)","v":{"$error":"#REF!"}},{"$f":"IF('Наш прайс'!#REF!=0,\"\",'Наш прайс'!#REF!)","v":{"$error":"#REF!"}},{"$f":"IF('Наш прайс'!#REF!=0,\"\",'Наш прайс'!#REF!)","v":{"$error":"#REF!"}},{"$f":"IF('Наш прайс'!#REF!=0,\"\",'Наш прайс'!#REF!)","v":{"$error":"#REF!"}},{"$f":"IF('Наш прайс'!J54=0,\"\",'Наш прайс'!J54)","v":""},{"$f":"IF('Наш прайс'!#REF!=0,\"\",'Наш прайс'!#REF!)","v":{"$error":"#REF!"}}]
[{"$f":"IF('Наш прайс'!B55=0,\"\",'Наш прайс'!B55)","v":""},{"$f":"IF('Наш прайс'!#REF!=0,\"\",'Наш прайс'!#REF!)","v":{"$error":"#REF!"}},{"$f":"IF('Наш прайс'!#REF!=0,\"\",'Наш прайс'!#REF!)","v":{"$error":"#REF!"}},"",null,null,{"$f":"IF('Наш прайс'!#REF!=0,\"\",'Наш прайс'!#REF!)","v":{"$error":"#REF!"}},{"$f":"IF('Наш прайс'!#REF!=0,\"\",'Наш прайс'!#REF!)","v":{"$error":"#REF!"}},{"$f":"IF('Наш прайс'!#REF!=0,\"\",'Наш прайс'!#REF!)","v":{"$error":"#REF!"}},{"$f":"IF('Наш прайс'!#REF!=0,\"\",'Наш прайс'!#REF!)","v":{"$error":"#REF!"}},{"$f":"IF('Наш прайс'!#REF!=0,\"\",'Наш прайс'!#REF!)","v":{"$error":"#REF!"}},{"$f":"IF('Наш прайс'!J55=0,\"\",'Наш прайс'!J55)","v":""},{"$f":"IF('Наш прайс'!#REF!=0,\"\",'Наш прайс'!#REF!)","v":{"$error":"#REF!"}}]
[{"$f":"IF('Наш прайс'!B56=0,\"\",'Наш прайс'!B56)","v":""},{"$f":"IF('Наш прайс'!#REF!=0,\"\",'Наш прайс'!#REF!)","v":{"$error":"#REF!"}},{"$f":"IF('Наш прайс'!#REF!=0,\"\",'Наш прайс'!#REF!)","v":{"$error":"#REF!"}},"",null,null,{"$f":"IF('Наш прайс'!#REF!=0,\"\",'Наш прайс'!#REF!)","v":{"$error":"#REF!"}},{"$f":"IF('Наш прайс'!#REF!=0,\"\",'Наш прайс'!#REF!)","v":{"$error":"#REF!"}},{"$f":"IF('Наш прайс'!#REF!=0,\"\",'Наш прайс'!#REF!)","v":{"$error":"#REF!"}},{"$f":"IF('Наш прайс'!#REF!=0,\"\",'Наш прайс'!#REF!)","v":{"$error":"#REF!"}},{"$f":"IF('Наш прайс'!#REF!=0,\"\",'Наш прайс'!#REF!)","v":{"$error":"#REF!"}},{"$f":"IF('Наш прайс'!J56=0,\"\",'Наш прайс'!J56)","v":""},{"$f":"IF('Наш прайс'!#REF!=0,\"\",'Наш прайс'!#REF!)","v":{"$error":"#REF!"}}]
[{"$f":"IF('Наш прайс'!B57=0,\"\",'Наш прайс'!B57)","v":""},{"$f":"IF('Наш прайс'!#REF!=0,\"\",'Наш прайс'!#REF!)","v":{"$error":"#REF!"}},{"$f":"IF('Наш прайс'!#REF!=0,\"\",'Наш прайс'!#REF!)","v":{"$error":"#REF!"}},"",null,null,{"$f":"IF('Наш прайс'!#REF!=0,\"\",'Наш прайс'!#REF!)","v":{"$error":"#REF!"}},{"$f":"IF('Наш прайс'!#REF!=0,\"\",'Наш прайс'!#REF!)","v":{"$error":"#REF!"}},{"$f":"IF('Наш прайс'!#REF!=0,\"\",'Наш прайс'!#REF!)","v":{"$error":"#REF!"}},{"$f":"IF('Наш прайс'!#REF!=0,\"\",'Наш прайс'!#REF!)","v":{"$error":"#REF!"}},{"$f":"IF('Наш прайс'!#REF!=0,\"\",'Наш прайс'!#REF!)","v":{"$error":"#REF!"}},{"$f":"IF('Наш прайс'!J57=0,\"\",'Наш прайс'!J57)","v":""},{"$f":"IF('Наш прайс'!#REF!=0,\"\",'Наш прайс'!#REF!)","v":{"$error":"#REF!"}}]
[{"$f":"IF('Наш прайс'!B58=0,\"\",'Наш прайс'!B58)","v":""},{"$f":"IF('Наш прайс'!#REF!=0,\"\",'Наш прайс'!#REF!)","v":{"$error":"#REF!"}},{"$f":"IF('Наш прайс'!#REF!=0,\"\",'Наш прайс'!#REF!)","v":{"$error":"#REF!"}},"",null,null,{"$f":"IF('Наш прайс'!#REF!=0,\"\",'Наш прайс'!#REF!)","v":{"$error":"#REF!"}},{"$f":"IF('Наш прайс'!#REF!=0,\"\",'Наш прайс'!#REF!)","v":{"$error":"#REF!"}},{"$f":"IF('Наш прайс'!#REF!=0,\"\",'Наш прайс'!#REF!)","v":{"$error":"#REF!"}},{"$f":"IF('Наш прайс'!#REF!=0,\"\",'Наш прайс'!#REF!)","v":{"$error":"#REF!"}},{"$f":"IF('Наш прайс'!#REF!=0,\"\",'Наш прайс'!#REF!)","v":{"$error":"#REF!"}},{"$f":"IF('Наш прайс'!J58=0,\"\",'Наш прайс'!J58)","v":""},{"$f":"IF('Наш прайс'!#REF!=0,\"\",'Наш прайс'!#REF!)","v":{"$error":"#REF!"}}]
[{"$f":"IF('Наш прайс'!B59=0,\"\",'Наш прайс'!B59)","v":""},{"$f":"IF('Наш прайс'!#REF!=0,\"\",'Наш прайс'!#REF!)","v":{"$error":"#REF!"}},{"$f":"IF('Наш прайс'!#REF!=0,\"\",'Наш прайс'!#REF!)","v":{"$error":"#REF!"}},"",null,null,{"$f":"IF('Наш прайс'!#REF!=0,\"\",'Наш прайс'!#REF!)","v":{"$error":"#REF!"}},{"$f":"IF('Наш прайс'!#REF!=0,\"\",'Наш прайс'!#REF!)","v":{"$error":"#REF!"}},{"$f":"IF('Наш прайс'!#REF!=0,\"\",'Наш прайс'!#REF!)","v":{"$error":"#REF!"}},{"$f":"IF('Наш прайс'!#REF!=0,\"\",'Наш прайс'!#REF!)","v":{"$error":"#REF!"}},{"$f":"IF('Наш прайс'!#REF!=0,\"\",'Наш прайс'!#REF!)","v":{"$error":"#REF!"}},{"$f":"IF('Наш прайс'!J59=0,\"\",'Наш прайс'!J59)","v":""},{"$f":"IF('Наш прайс'!#REF!=0,\"\",'Наш прайс'!#REF!)","v":{"$error":"#REF!"}}]
[{"$f":"IF('Наш прайс'!B60=0,\"\",'Наш прайс'!B60)","v":""},{"$f":"IF('Наш прайс'!#REF!=0,\"\",'Наш прайс'!#REF!)","v":{"$error":"#REF!"}},{"$f":"IF('Наш прайс'!#REF!=0,\"\",'Наш прайс'!#REF!)","v":{"$error":"#REF!"}},"",null,null,{"$f":"IF('Наш прайс'!#REF!=0,\"\",'Наш прайс'!#REF!)","v":{"$error":"#REF!"}},{"$f":"IF('Наш прайс'!#REF!=0,\"\",'Наш прайс'!#REF!)","v":{"$error":"#REF!"}},{"$f":"IF('Наш прайс'!#REF!=0,\"\",'Наш прайс'!#REF!)","v":{"$error":"#REF!"}},{"$f":"IF('Наш прайс'!#REF!=0,\"\",'Наш прайс'!#REF!)","v":{"$error":"#REF!"}},{"$f":"IF('Наш прайс'!#REF!=0,\"\",'Наш прайс'!#REF!)","v":{"$error":"#REF!"}},{"$f":"IF('Наш прайс'!J60=0,\"\",'Наш прайс'!J60)","v":""},{"$f":"IF('Наш прайс'!#REF!=0,\"\",'Наш прайс'!#REF!)","v":{"$error":"#REF!"}}]
[{"$f":"IF('Наш прайс'!B61=0,\"\",'Наш прайс'!B61)","v":""},{"$f":"IF('Наш прайс'!#REF!=0,\"\",'Наш прайс'!#REF!)","v":{"$error":"#REF!"}},{"$f":"IF('Наш прайс'!#REF!=0,\"\",'Наш прайс'!#REF!)","v":{"$error":"#REF!"}},"",null,null,{"$f":"IF('Наш прайс'!#REF!=0,\"\",'Наш прайс'!#REF!)","v":{"$error":"#REF!"}},{"$f":"IF('Наш прайс'!#REF!=0,\"\",'Наш прайс'!#REF!)","v":{"$error":"#REF!"}},{"$f":"IF('Наш прайс'!#REF!=0,\"\",'Наш прайс'!#REF!)","v":{"$error":"#REF!"}},{"$f":"IF('Наш прайс'!#REF!=0,\"\",'Наш прайс'!#REF!)","v":{"$error":"#REF!"}},{"$f":"IF('Наш прайс'!#REF!=0,\"\",'Наш прайс'!#REF!)","v":{"$error":"#REF!"}},{"$f":"IF('Наш прайс'!J61=0,\"\",'Наш прайс'!J61)","v":""},{"$f":"IF('Наш прайс'!#REF!=0,\"\",'Наш прайс'!#REF!)","v":{"$error":"#REF!"}}]
[{"$f":"IF('Наш прайс'!B62=0,\"\",'Наш прайс'!B62)","v":""},{"$f":"IF('Наш прайс'!#REF!=0,\"\",'Наш прайс'!#REF!)","v":{"$error":"#REF!"}},{"$f":"IF('Наш прайс'!#REF!=0,\"\",'Наш прайс'!#REF!)","v":{"$error":"#REF!"}},"",null,null,{"$f":"IF('Наш прайс'!#REF!=0,\"\",'Наш прайс'!#REF!)","v":{"$error":"#REF!"}},{"$f":"IF('Наш прайс'!#REF!=0,\"\",'Наш прайс'!#REF!)","v":{"$error":"#REF!"}},{"$f":"IF('Наш прайс'!#REF!=0,\"\",'Наш прайс'!#REF!)","v":{"$error":"#REF!"}},{"$f":"IF('Наш прайс'!#REF!=0,\"\",'Наш прайс'!#REF!)","v":{"$error":"#REF!"}},{"$f":"IF('Наш прайс'!#REF!=0,\"\",'Наш прайс'!#REF!)","v":{"$error":"#REF!"}},{"$f":"IF('Наш прайс'!J62=0,\"\",'Наш прайс'!J62)","v":""},{"$f":"IF('Наш прайс'!#REF!=0,\"\",'Наш прайс'!#REF!)","v":{"$error":"#REF!"}}]
[{"$f":"IF('Наш прайс'!B63=0,\"\",'Наш прайс'!B63)","v":""},{"$f":"IF('Наш прайс'!#REF!=0,\"\",'Наш прайс'!#REF!)","v":{"$error":"#REF!"}},{"$f":"IF('Наш прайс'!#REF!=0,\"\",'Наш прайс'!#REF!)","v":{"$error":"#REF!"}},"",null,null,{"$f":"IF('Наш прайс'!#REF!=0,\"\",'Наш прайс'!#REF!)","v":{"$error":"#REF!"}},{"$f":"IF('Наш прайс'!#REF!=0,\"\",'Наш прайс'!#REF!)","v":{"$error":"#REF!"}},{"$f":"IF('Наш прайс'!#REF!=0,\"\",'Наш прайс'!#REF!)","v":{"$error":"#REF!"}},{"$f":"IF('Наш прайс'!#REF!=0,\"\",'Наш прайс'!#REF!)","v":{"$error":"#REF!"}},{"$f":"IF('Наш прайс'!#REF!=0,\"\",'Наш прайс'!#REF!)","v":{"$error":"#REF!"}},{"$f":"IF('Наш прайс'!J63=0,\"\",'Наш прайс'!J63)","v":""},{"$f":"IF('Наш прайс'!#REF!=0,\"\",'Наш прайс'!#REF!)","v":{"$error":"#REF!"}}]
[{"$f":"IF('Наш прайс'!B64=0,\"\",'Наш прайс'!B64)","v":""},{"$f":"IF('Наш прайс'!#REF!=0,\"\",'Наш прайс'!#REF!)","v":{"$error":"#REF!"}},{"$f":"IF('Наш прайс'!#REF!=0,\"\",'Наш прайс'!#REF!)","v":{"$error":"#REF!"}},"",null,null,{"$f":"IF('Наш прайс'!#REF!=0,\"\",'Наш прайс'!#REF!)","v":{"$error":"#REF!"}},{"$f":"IF('Наш прайс'!#REF!=0,\"\",'Наш прайс'!#REF!)","v":{"$error":"#REF!"}},{"$f":"IF('Наш прайс'!#REF!=0,\"\",'Наш прайс'!#REF!)","v":{"$error":"#REF!"}},{"$f":"IF('Наш прайс'!#REF!=0,\"\",'Наш прайс'!#REF!)","v":{"$error":"#REF!"}},{"$f":"IF('Наш прайс'!#REF!=0,\"\",'Наш прайс'!#REF!)","v":{"$error":"#REF!"}},{"$f":"IF('Наш прайс'!J64=0,\"\",'Наш прайс'!J64)","v":""},{"$f":"IF('Наш прайс'!#REF!=0,\"\",'Наш прайс'!#REF!)","v":{"$error":"#REF!"}}]
[{"$f":"IF('Наш прайс'!B65=0,\"\",'Наш прайс'!B65)","v":""},{"$f":"IF('Наш прайс'!#REF!=0,\"\",'Наш прайс'!#REF!)","v":{"$error":"#REF!"}},{"$f":"IF('Наш прайс'!#REF!=0,\"\",'Наш прайс'!#REF!)","v":{"$error":"#REF!"}},"",null,null,{"$f":"IF('Наш прайс'!#REF!=0,\"\",'Наш прайс'!#REF!)","v":{"$error":"#REF!"}},{"$f":"IF('Наш прайс'!#REF!=0,\"\",'Наш прайс'!#REF!)","v":{"$error":"#REF!"}},{"$f":"IF('Наш прайс'!#REF!=0,\"\",'Наш прайс'!#REF!)","v":{"$error":"#REF!"}},{"$f":"IF('Наш прайс'!#REF!=0,\"\",'Наш прайс'!#REF!)","v":{"$error":"#REF!"}},{"$f":"IF('Наш прайс'!#REF!=0,\"\",'Наш прайс'!#REF!)","v":{"$error":"#REF!"}},{"$f":"IF('Наш прайс'!J65=0,\"\",'Наш прайс'!J65)","v":""},{"$f":"IF('Наш прайс'!#REF!=0,\"\",'Наш прайс'!#REF!)","v":{"$error":"#REF!"}}]
[{"$f":"IF('Наш прайс'!B66=0,\"\",'Наш прайс'!B66)","v":""},{"$f":"IF('Наш прайс'!#REF!=0,\"\",'Наш прайс'!#REF!)","v":{"$error":"#REF!"}},{"$f":"IF('Наш прайс'!#REF!=0,\"\",'Наш прайс'!#REF!)","v":{"$error":"#REF!"}},"",null,null,{"$f":"IF('Наш прайс'!#REF!=0,\"\",'Наш прайс'!#REF!)","v":{"$error":"#REF!"}},{"$f":"IF('Наш прайс'!#REF!=0,\"\",'Наш прайс'!#REF!)","v":{"$error":"#REF!"}},{"$f":"IF('Наш прайс'!#REF!=0,\"\",'Наш прайс'!#REF!)","v":{"$error":"#REF!"}},{"$f":"IF('Наш прайс'!#REF!=0,\"\",'Наш прайс'!#REF!)","v":{"$error":"#REF!"}},{"$f":"IF('Наш прайс'!#REF!=0,\"\",'Наш прайс'!#REF!)","v":{"$error":"#REF!"}},{"$f":"IF('Наш прайс'!J66=0,\"\",'Наш прайс'!J66)","v":""},{"$f":"IF('Наш прайс'!#REF!=0,\"\",'Наш прайс'!#REF!)","v":{"$error":"#REF!"}}]
[{"$f":"IF('Наш прайс'!B67=0,\"\",'Наш прайс'!B67)","v":""},{"$f":"IF('Наш прайс'!#REF!=0,\"\",'Наш прайс'!#REF!)","v":{"$error":"#REF!"}},{"$f":"IF('Наш прайс'!#REF!=0,\"\",'Наш прайс'!#REF!)","v":{"$error":"#REF!"}},"",null,null,{"$f":"IF('Наш прайс'!#REF!=0,\"\",'Наш прайс'!#REF!)","v":{"$error":"#REF!"}},{"$f":"IF('Наш прайс'!#REF!=0,\"\",'Наш прайс'!#REF!)","v":{"$error":"#REF!"}},{"$f":"IF('Наш прайс'!#REF!=0,\"\",'Наш прайс'!#REF!)","v":{"$error":"#REF!"}},{"$f":"IF('Наш прайс'!#REF!=0,\"\",'Наш прайс'!#REF!)","v":{"$error":"#REF!"}},{"$f":"IF('Наш прайс'!#REF!=0,\"\",'Наш прайс'!#REF!)","v":{"$error":"#REF!"}},{"$f":"IF('Наш прайс'!J67=0,\"\",'Наш прайс'!J67)","v":""},{"$f":"IF('Наш прайс'!#REF!=0,\"\",'Наш прайс'!#REF!)","v":{"$error":"#REF!"}}]
[{"$f":"IF('Наш прайс'!B68=0,\"\",'Наш прайс'!B68)","v":""},{"$f":"IF('Наш прайс'!#REF!=0,\"\",'Наш прайс'!#REF!)","v":{"$error":"#REF!"}},{"$f":"IF('Наш прайс'!#REF!=0,\"\",'Наш прайс'!#REF!)","v":{"$error":"#REF!"}},"",null,null,{"$f":"IF('Наш прайс'!#REF!=0,\"\",'Наш прайс'!#REF!)","v":{"$error":"#REF!"}},{"$f":"IF('Наш прайс'!#REF!=0,\"\",'Наш прайс'!#REF!)","v":{"$error":"#REF!"}},{"$f":"IF('Наш прайс'!#REF!=0,\"\",'Наш прайс'!#REF!)","v":{"$error":"#REF!"}},{"$f":"IF('Наш прайс'!#REF!=0,\"\",'Наш прайс'!#REF!)","v":{"$error":"#REF!"}},{"$f":"IF('Наш прайс'!#REF!=0,\"\",'Наш прайс'!#REF!)","v":{"$error":"#REF!"}},{"$f":"IF('Наш прайс'!J68=0,\"\",'Наш прайс'!J68)","v":""},{"$f":"IF('Наш прайс'!#REF!=0,\"\",'Наш прайс'!#REF!)","v":{"$error":"#REF!"}}]
[{"$f":"IF('Наш прайс'!B69=0,\"\",'Наш прайс'!B69)","v":""},{"$f":"IF('Наш прайс'!#REF!=0,\"\",'Наш прайс'!#REF!)","v":{"$error":"#REF!"}},{"$f":"IF('Наш прайс'!#REF!=0,\"\",'Наш прайс'!#REF!)","v":{"$error":"#REF!"}},"",null,null,{"$f":"IF('Наш прайс'!#REF!=0,\"\",'Наш прайс'!#REF!)","v":{"$error":"#REF!"}},{"$f":"IF('Наш прайс'!#REF!=0,\"\",'Наш прайс'!#REF!)","v":{"$error":"#REF!"}},{"$f":"IF('Наш прайс'!#REF!=0,\"\",'Наш прайс'!#REF!)","v":{"$error":"#REF!"}},{"$f":"IF('Наш прайс'!#REF!=0,\"\",'Наш прайс'!#REF!)","v":{"$error":"#REF!"}},{"$f":"IF('Наш прайс'!#REF!=0,\"\",'Наш прайс'!#REF!)","v":{"$error":"#REF!"}},{"$f":"IF('Наш прайс'!J69=0,\"\",'Наш прайс'!J69)","v":""},{"$f":"IF('Наш прайс'!#REF!=0,\"\",'Наш прайс'!#REF!)","v":{"$error":"#REF!"}}]
[{"$f":"IF('Наш прайс'!B70=0,\"\",'Наш прайс'!B70)","v":""},{"$f":"IF('Наш прайс'!#REF!=0,\"\",'Наш прайс'!#REF!)","v":{"$error":"#REF!"}},{"$f":"IF('Наш прайс'!#REF!=0,\"\",'Наш прайс'!#REF!)","v":{"$error":"#REF!"}},"",null,null,{"$f":"IF('Наш прайс'!#REF!=0,\"\",'Наш прайс'!#REF!)","v":{"$error":"#REF!"}},{"$f":"IF('Наш прайс'!#REF!=0,\"\",'Наш прайс'!#REF!)","v":{"$error":"#REF!"}},{"$f":"IF('Наш прайс'!#REF!=0,\"\",'Наш прайс'!#REF!)","v":{"$error":"#REF!"}},{"$f":"IF('Наш прайс'!#REF!=0,\"\",'Наш прайс'!#REF!)","v":{"$error":"#REF!"}},{"$f":"IF('Наш прайс'!#REF!=0,\"\",'Наш прайс'!#REF!)","v":{"$error":"#REF!"}},{"$f":"IF('Наш прайс'!J70=0,\"\",'Наш прайс'!J70)","v":""},{"$f":"IF('Наш прайс'!#REF!=0,\"\",'Наш прайс'!#REF!)","v":{"$error":"#REF!"}}]
[{"$f":"IF('Наш прайс'!B71=0,\"\",'Наш прайс'!B71)","v":""},{"$f":"IF('Наш прайс'!#REF!=0,\"\",'Наш прайс'!#REF!)","v":{"$error":"#REF!"}},{"$f":"IF('Наш прайс'!#REF!=0,\"\",'Наш прайс'!#REF!)","v":{"$error":"#REF!"}},"",null,null,{"$f":"IF('Наш прайс'!#REF!=0,\"\",'Наш прайс'!#REF!)","v":{"$error":"#REF!"}},{"$f":"IF('Наш прайс'!#REF!=0,\"\",'Наш прайс'!#REF!)","v":{"$error":"#REF!"}},{"$f":"IF('Наш прайс'!#REF!=0,\"\",'Наш прайс'!#REF!)","v":{"$error":"#REF!"}},{"$f":"IF('Наш прайс'!#REF!=0,\"\",'Наш прайс'!#REF!)","v":{"$error":"#REF!"}},{"$f":"IF('Наш прайс'!#REF!=0,\"\",'Наш прайс'!#REF!)","v":{"$error":"#REF!"}},{"$f":"IF('Наш прайс'!J71=0,\"\",'Наш прайс'!J71)","v":""},{"$f":"IF('Наш прайс'!#REF!=0,\"\",'Наш прайс'!#REF!)","v":{"$error":"#REF!"}}]
[{"$f":"IF('Наш прайс'!B72=0,\"\",'Наш прайс'!B72)","v":""},{"$f":"IF('Наш прайс'!#REF!=0,\"\",'Наш прайс'!#REF!)","v":{"$error":"#REF!"}},{"$f":"IF('Наш прайс'!#REF!=0,\"\",'Наш прайс'!#REF!)","v":{"$error":"#REF!"}},"",null,null,{"$f":"IF('Наш прайс'!#REF!=0,\"\",'Наш прайс'!#REF!)","v":{"$error":"#REF!"}},{"$f":"IF('Наш прайс'!#REF!=0,\"\",'Наш прайс'!#REF!)","v":{"$error":"#REF!"}},{"$f":"IF('Наш прайс'!#REF!=0,\"\",'Наш прайс'!#REF!)","v":{"$error":"#REF!"}},{"$f":"IF('Наш прайс'!#REF!=0,\"\",'Наш прайс'!#REF!)","v":{"$error":"#REF!"}},{"$f":"IF('Наш прайс'!#REF!=0,\"\",'Наш прайс'!#REF!)","v":{"$error":"#REF!"}},{"$f":"IF('Наш прайс'!J72=0,\"\",'Наш прайс'!J72)","v":""},{"$f":"IF('Наш прайс'!#REF!=0,\"\",'Наш прайс'!#REF!)","v":{"$error":"#REF!"}}]
[{"$f":"IF('Наш прайс'!B73=0,\"\",'Наш прайс'!B73)","v":""},{"$f":"IF('Наш прайс'!#REF!=0,\"\",'Наш прайс'!#REF!)","v":{"$error":"#REF!"}},{"$f":"IF('Наш прайс'!#REF!=0,\"\",'Наш прайс'!#REF!)","v":{"$error":"#REF!"}},"",null,null,{"$f":"IF('Наш прайс'!#REF!=0,\"\",'Наш прайс'!#REF!)","v":{"$error":"#REF!"}},{"$f":"IF('Наш прайс'!#REF!=0,\"\",'Наш прайс'!#REF!)","v":{"$error":"#REF!"}},{"$f":"IF('Наш прайс'!#REF!=0,\"\",'Наш прайс'!#REF!)","v":{"$error":"#REF!"}},{"$f":"IF('Наш прайс'!#REF!=0,\"\",'Наш прайс'!#REF!)","v":{"$error":"#REF!"}},{"$f":"IF('Наш прайс'!#REF!=0,\"\",'Наш прайс'!#REF!)","v":{"$error":"#REF!"}},{"$f":"IF('Наш прайс'!J73=0,\"\",'Наш прайс'!J73)","v":""},{"$f":"IF('Наш прайс'!#REF!=0,\"\",'Наш прайс'!#REF!)","v":{"$error":"#REF!"}}]
[{"$f":"IF('Наш прайс'!B74=0,\"\",'Наш прайс'!B74)","v":""},{"$f":"IF('Наш прайс'!#REF!=0,\"\",'Наш прайс'!#REF!)","v":{"$error":"#REF!"}},{"$f":"IF('Наш прайс'!#REF!=0,\"\",'Наш прайс'!#REF!)","v":{"$error":"#REF!"}},"",null,null,{"$f":"IF('Наш прайс'!#REF!=0,\"\",'Наш прайс'!#REF!)","v":{"$error":"#REF!"}},{"$f":"IF('Наш прайс'!#REF!=0,\"\",'Наш прайс'!#REF!)","v":{"$error":"#REF!"}},{"$f":"IF('Наш прайс'!#REF!=0,\"\",'Наш прайс'!#REF!)","v":{"$error":"#REF!"}},{"$f":"IF('Наш прайс'!#REF!=0,\"\",'Наш прайс'!#REF!)","v":{"$error":"#REF!"}},{"$f":"IF('Наш прайс'!#REF!=0,\"\",'Наш прайс'!#REF!)","v":{"$error":"#REF!"}},{"$f":"IF('Наш прайс'!J74=0,\"\",'Наш прайс'!J74)","v":""},{"$f":"IF('Наш прайс'!#REF!=0,\"\",'Наш прайс'!#REF!)","v":{"$error":"#REF!"}}]
[{"$f":"IF('Наш прайс'!B75=0,\"\",'Наш прайс'!B75)","v":""},{"$f":"IF('Наш прайс'!#REF!=0,\"\",'Наш прайс'!#REF!)","v":{"$error":"#REF!"}},{"$f":"IF('Наш прайс'!#REF!=0,\"\",'Наш прайс'!#REF!)","v":{"$error":"#REF!"}},"",null,null,{"$f":"IF('Наш прайс'!#REF!=0,\"\",'Наш прайс'!#REF!)","v":{"$error":"#REF!"}},{"$f":"IF('Наш прайс'!#REF!=0,\"\",'Наш прайс'!#REF!)","v":{"$error":"#REF!"}},{"$f":"IF('Наш прайс'!#REF!=0,\"\",'Наш прайс'!#REF!)","v":{"$error":"#REF!"}},{"$f":"IF('Наш прайс'!#REF!=0,\"\",'Наш прайс'!#REF!)","v":{"$error":"#REF!"}},{"$f":"IF('Наш прайс'!#REF!=0,\"\",'Наш прайс'!#REF!)","v":{"$error":"#REF!"}},{"$f":"IF('Наш прайс'!J75=0,\"\",'Наш прайс'!J75)","v":""},{"$f":"IF('Наш прайс'!#REF!=0,\"\",'Наш прайс'!#REF!)","v":{"$error":"#REF!"}}]
[{"$f":"IF('Наш прайс'!B76=0,\"\",'Наш прайс'!B76)","v":""},{"$f":"IF('Наш прайс'!#REF!=0,\"\",'Наш прайс'!#REF!)","v":{"$error":"#REF!"}},{"$f":"IF('Наш прайс'!#REF!=0,\"\",'Наш прайс'!#REF!)","v":{"$error":"#REF!"}},"",null,null,{"$f":"IF('Наш прайс'!#REF!=0,\"\",'Наш прайс'!#REF!)","v":{"$error":"#REF!"}},{"$f":"IF('Наш прайс'!#REF!=0,\"\",'Наш прайс'!#REF!)","v":{"$error":"#REF!"}},{"$f":"IF('Наш прайс'!#REF!=0,\"\",'Наш прайс'!#REF!)","v":{"$error":"#REF!"}},{"$f":"IF('Наш прайс'!#REF!=0,\"\",'Наш прайс'!#REF!)","v":{"$error":"#REF!"}},{"$f":"IF('Наш прайс'!#REF!=0,\"\",'Наш прайс'!#REF!)","v":{"$error":"#REF!"}},{"$f":"IF('Наш прайс'!J76=0,\"\",'Наш прайс'!J76)","v":""},{"$f":"IF('Наш прайс'!#REF!=0,\"\",'Наш прайс'!#REF!)","v":{"$error":"#REF!"}}]
[{"$f":"IF('Наш прайс'!B77=0,\"\",'Наш прайс'!B77)","v":""},{"$f":"IF('Наш прайс'!#REF!=0,\"\",'Наш прайс'!#REF!)","v":{"$error":"#REF!"}},{"$f":"IF('Наш прайс'!#REF!=0,\"\",'Наш прайс'!#REF!)","v":{"$error":"#REF!"}},"",null,null,{"$f":"IF('Наш прайс'!#REF!=0,\"\",'Наш прайс'!#REF!)","v":{"$error":"#REF!"}},{"$f":"IF('Наш прайс'!#REF!=0,\"\",'Наш прайс'!#REF!)","v":{"$error":"#REF!"}},{"$f":"IF('Наш прайс'!#REF!=0,\"\",'Наш прайс'!#REF!)","v":{"$error":"#REF!"}},{"$f":"IF('Наш прайс'!#REF!=0,\"\",'Наш прайс'!#REF!)","v":{"$error":"#REF!"}},{"$f":"IF('Наш прайс'!#REF!=0,\"\",'Наш прайс'!#REF!)","v":{"$error":"#REF!"}},{"$f":"IF('Наш прайс'!J77=0,\"\",'Наш прайс'!J77)","v":""},{"$f":"IF('Наш прайс'!#REF!=0,\"\",'Наш прайс'!#REF!)","v":{"$error":"#REF!"}}]
[{"$f":"IF('Наш прайс'!B78=0,\"\",'Наш прайс'!B78)","v":""},{"$f":"IF('Наш прайс'!#REF!=0,\"\",'Наш прайс'!#REF!)","v":{"$error":"#REF!"}},{"$f":"IF('Наш прайс'!#REF!=0,\"\",'Наш прайс'!#REF!)","v":{"$error":"#REF!"}},"",null,null,{"$f":"IF('Наш прайс'!#REF!=0,\"\",'Наш прайс'!#REF!)","v":{"$error":"#REF!"}},{"$f":"IF('Наш прайс'!#REF!=0,\"\",'Наш прайс'!#REF!)","v":{"$error":"#REF!"}},{"$f":"IF('Наш прайс'!#REF!=0,\"\",'Наш прайс'!#REF!)","v":{"$error":"#REF!"}},{"$f":"IF('Наш прайс'!#REF!=0,\"\",'Наш прайс'!#REF!)","v":{"$error":"#REF!"}},{"$f":"IF('Наш прайс'!#REF!=0,\"\",'Наш прайс'!#REF!)","v":{"$error":"#REF!"}},{"$f":"IF('Наш прайс'!J78=0,\"\",'Наш прайс'!J78)","v":""},{"$f":"IF('Наш прайс'!#REF!=0,\"\",'Наш прайс'!#REF!)","v":{"$error":"#REF!"}}]
[{"$f":"IF('Наш прайс'!B79=0,\"\",'Наш прайс'!B79)","v":""},{"$f":"IF('Наш прайс'!#REF!=0,\"\",'Наш прайс'!#REF!)","v":{"$error":"#REF!"}},{"$f":"IF('Наш прайс'!#REF!=0,\"\",'Наш прайс'!#REF!)","v":{"$error":"#REF!"}},"",null,null,{"$f":"IF('Наш прайс'!#REF!=0,\"\",'Наш прайс'!#REF!)","v":{"$error":"#REF!"}},{"$f":"IF('Наш прайс'!#REF!=0,\"\",'Наш прайс'!#REF!)","v":{"$error":"#REF!"}},{"$f":"IF('Наш прайс'!#REF!=0,\"\",'Наш прайс'!#REF!)","v":{"$error":"#REF!"}},{"$f":"IF('Наш прайс'!#REF!=0,\"\",'Наш прайс'!#REF!)","v":{"$error":"#REF!"}},{"$f":"IF('Наш прайс'!#REF!=0,\"\",'Наш прайс'!#REF!)","v":{"$error":"#REF!"}},{"$f":"IF('Наш прайс'!J79=0,\"\",'Наш прайс'!J79)","v":""},{"$f":"IF('Наш прайс'!#REF!=0,\"\",'Наш прайс'!#REF!)","v":{"$error":"#REF!"}}]
[{"$f":"IF('Наш прайс'!B80=0,\"\",'Наш прайс'!B80)","v":""},{"$f":"IF('Наш прайс'!#REF!=0,\"\",'Наш прайс'!#REF!)","v":{"$error":"#REF!"}},{"$f":"IF('Наш прайс'!#REF!=0,\"\",'Наш прайс'!#REF!)","v":{"$error":"#REF!"}},"",null,null,{"$f":"IF('Наш прайс'!#REF!=0,\"\",'Наш прайс'!#REF!)","v":{"$error":"#REF!"}},{"$f":"IF('Наш прайс'!#REF!=0,\"\",'Наш прайс'!#REF!)","v":{"$error":"#REF!"}},{"$f":"IF('Наш прайс'!#REF!=0,\"\",'Наш прайс'!#REF!)","v":{"$error":"#REF!"}},{"$f":"IF('Наш прайс'!#REF!=0,\"\",'Наш прайс'!#REF!)","v":{"$error":"#REF!"}},{"$f":"IF('Наш прайс'!#REF!=0,\"\",'Наш прайс'!#REF!)","v":{"$error":"#REF!"}},{"$f":"IF('Наш прайс'!J80=0,\"\",'Наш прайс'!J80)","v":""},{"$f":"IF('Наш прайс'!#REF!=0,\"\",'Наш прайс'!#REF!)","v":{"$error":"#REF!"}}]
[{"$f":"IF('Наш прайс'!B81=0,\"\",'Наш прайс'!B81)","v":""},{"$f":"IF('Наш прайс'!#REF!=0,\"\",'Наш прайс'!#REF!)","v":{"$error":"#REF!"}},{"$f":"IF('Наш прайс'!#REF!=0,\"\",'Наш прайс'!#REF!)","v":{"$error":"#REF!"}},"",null,null,{"$f":"IF('Наш прайс'!#REF!=0,\"\",'Наш прайс'!#REF!)","v":{"$error":"#REF!"}},{"$f":"IF('Наш прайс'!#REF!=0,\"\",'Наш прайс'!#REF!)","v":{"$error":"#REF!"}},{"$f":"IF('Наш прайс'!#REF!=0,\"\",'Наш прайс'!#REF!)","v":{"$error":"#REF!"}},{"$f":"IF('Наш прайс'!#REF!=0,\"\",'Наш прайс'!#REF!)","v":{"$error":"#REF!"}},{"$f":"IF('Наш прайс'!#REF!=0,\"\",'Наш прайс'!#REF!)","v":{"$error":"#REF!"}},{"$f":"IF('Наш прайс'!J81=0,\"\",'Наш прайс'!J81)","v":""},{"$f":"IF('Наш прайс'!#REF!=0,\"\",'Наш прайс'!#REF!)","v":{"$error":"#REF!"}}]
[{"$f":"IF('Наш прайс'!B82=0,\"\",'Наш прайс'!B82)","v":""},{"$f":"IF('Наш прайс'!#REF!=0,\"\",'Наш прайс'!#REF!)","v":{"$error":"#REF!"}},{"$f":"IF('Наш прайс'!#REF!=0,\"\",'Наш прайс'!#REF!)","v":{"$error":"#REF!"}},"",null,null,{"$f":"IF('Наш прайс'!#REF!=0,\"\",'Наш прайс'!#REF!)","v":{"$error":"#REF!"}},{"$f":"IF('Наш прайс'!#REF!=0,\"\",'Наш прайс'!#REF!)","v":{"$error":"#REF!"}},{"$f":"IF('Наш прайс'!#REF!=0,\"\",'Наш прайс'!#REF!)","v":{"$error":"#REF!"}},{"$f":"IF('Наш прайс'!#REF!=0,\"\",'Наш прайс'!#REF!)","v":{"$error":"#REF!"}},{"$f":"IF('Наш прайс'!#REF!=0,\"\",'Наш прайс'!#REF!)","v":{"$error":"#REF!"}},{"$f":"IF('Наш прайс'!J82=0,\"\",'Наш прайс'!J82)","v":""},{"$f":"IF('Наш прайс'!#REF!=0,\"\",'Наш прайс'!#REF!)","v":{"$error":"#REF!"}}]
[{"$f":"IF('Наш прайс'!B83=0,\"\",'Наш прайс'!B83)","v":""},{"$f":"IF('Наш прайс'!#REF!=0,\"\",'Наш прайс'!#REF!)","v":{"$error":"#REF!"}},{"$f":"IF('Наш прайс'!#REF!=0,\"\",'Наш прайс'!#REF!)","v":{"$error":"#REF!"}},"",null,null,{"$f":"IF('Наш прайс'!#REF!=0,\"\",'Наш прайс'!#REF!)","v":{"$error":"#REF!"}},{"$f":"IF('Наш прайс'!#REF!=0,\"\",'Наш прайс'!#REF!)","v":{"$error":"#REF!"}},{"$f":"IF('Наш прайс'!#REF!=0,\"\",'Наш прайс'!#REF!)","v":{"$error":"#REF!"}},{"$f":"IF('Наш прайс'!#REF!=0,\"\",'Наш прайс'!#REF!)","v":{"$error":"#REF!"}},{"$f":"IF('Наш прайс'!#REF!=0,\"\",'Наш прайс'!#REF!)","v":{"$error":"#REF!"}},{"$f":"IF('Наш прайс'!J83=0,\"\",'Наш прайс'!J83)","v":""},{"$f":"IF('Наш прайс'!#REF!=0,\"\",'Наш прайс'!#REF!)","v":{"$error":"#REF!"}}]
[{"$f":"IF('Наш прайс'!B84=0,\"\",'Наш прайс'!B84)","v":""},{"$f":"IF('Наш прайс'!#REF!=0,\"\",'Наш прайс'!#REF!)","v":{"$error":"#REF!"}},{"$f":"IF('Наш прайс'!#REF!=0,\"\",'Наш прайс'!#REF!)","v":{"$error":"#REF!"}},"",null,null,{"$f":"IF('Наш прайс'!#REF!=0,\"\",'Наш прайс'!#REF!)","v":{"$error":"#REF!"}},{"$f":"IF('Наш прайс'!#REF!=0,\"\",'Наш прайс'!#REF!)","v":{"$error":"#REF!"}},{"$f":"IF('Наш прайс'!#REF!=0,\"\",'Наш прайс'!#REF!)","v":{"$error":"#REF!"}},{"$f":"IF('Наш прайс'!#REF!=0,\"\",'Наш прайс'!#REF!)","v":{"$error":"#REF!"}},{"$f":"IF('Наш прайс'!#REF!=0,\"\",'Наш прайс'!#REF!)","v":{"$error":"#REF!"}},{"$f":"IF('Наш прайс'!J84=0,\"\",'Наш прайс'!J84)","v":""},{"$f":"IF('Наш прайс'!#REF!=0,\"\",'Наш прайс'!#REF!)","v":{"$error":"#REF!"}}]
[{"$f":"IF('Наш прайс'!B85=0,\"\",'Наш прайс'!B85)","v":""},{"$f":"IF('Наш прайс'!#REF!=0,\"\",'Наш прайс'!#REF!)","v":{"$error":"#REF!"}},{"$f":"IF('Наш прайс'!#REF!=0,\"\",'Наш прайс'!#REF!)","v":{"$error":"#REF!"}},"",null,null,{"$f":"IF('Наш прайс'!#REF!=0,\"\",'Наш прайс'!#REF!)","v":{"$error":"#REF!"}},{"$f":"IF('Наш прайс'!#REF!=0,\"\",'Наш прайс'!#REF!)","v":{"$error":"#REF!"}},{"$f":"IF('Наш прайс'!#REF!=0,\"\",'Наш прайс'!#REF!)","v":{"$error":"#REF!"}},{"$f":"IF('Наш прайс'!#REF!=0,\"\",'Наш прайс'!#REF!)","v":{"$error":"#REF!"}},{"$f":"IF('Наш прайс'!#REF!=0,\"\",'Наш прайс'!#REF!)","v":{"$error":"#REF!"}},{"$f":"IF('Наш прайс'!J85=0,\"\",'Наш прайс'!J85)","v":""},{"$f":"IF('Наш прайс'!#REF!=0,\"\",'Наш прайс'!#REF!)","v":{"$error":"#REF!"}}]
[{"$f":"IF('Наш прайс'!B86=0,\"\",'Наш прайс'!B86)","v":""},{"$f":"IF('Наш прайс'!#REF!=0,\"\",'Наш прайс'!#REF!)","v":{"$error":"#REF!"}},{"$f":"IF('Наш прайс'!#REF!=0,\"\",'Наш прайс'!#REF!)","v":{"$error":"#REF!"}},"",null,null,{"$f":"IF('Наш прайс'!#REF!=0,\"\",'Наш прайс'!#REF!)","v":{"$error":"#REF!"}},{"$f":"IF('Наш прайс'!#REF!=0,\"\",'Наш прайс'!#REF!)","v":{"$error":"#REF!"}},{"$f":"IF('Наш прайс'!#REF!=0,\"\",'Наш прайс'!#REF!)","v":{"$error":"#REF!"}},{"$f":"IF('Наш прайс'!#REF!=0,\"\",'Наш прайс'!#REF!)","v":{"$error":"#REF!"}},{"$f":"IF('Наш прайс'!#REF!=0,\"\",'Наш прайс'!#REF!)","v":{"$error":"#REF!"}},{"$f":"IF('Наш прайс'!J86=0,\"\",'Наш прайс'!J86)","v":""},{"$f":"IF('Наш прайс'!#REF!=0,\"\",'Наш прайс'!#REF!)","v":{"$error":"#REF!"}}]
[{"$f":"IF('Наш прайс'!B87=0,\"\",'Наш прайс'!B87)","v":""},{"$f":"IF('Наш прайс'!#REF!=0,\"\",'Наш прайс'!#REF!)","v":{"$error":"#REF!"}},{"$f":"IF('Наш прайс'!#REF!=0,\"\",'Наш прайс'!#REF!)","v":{"$error":"#REF!"}},"",null,null,{"$f":"IF('Наш прайс'!#REF!=0,\"\",'Наш прайс'!#REF!)","v":{"$error":"#REF!"}},{"$f":"IF('Наш прайс'!#REF!=0,\"\",'Наш прайс'!#REF!)","v":{"$error":"#REF!"}},{"$f":"IF('Наш прайс'!#REF!=0,\"\",'Наш прайс'!#REF!)","v":{"$error":"#REF!"}},{"$f":"IF('Наш прайс'!#REF!=0,\"\",'Наш прайс'!#REF!)","v":{"$error":"#REF!"}},{"$f":"IF('Наш прайс'!#REF!=0,\"\",'Наш прайс'!#REF!)","v":{"$error":"#REF!"}},{"$f":"IF('Наш прайс'!J87=0,\"\",'Наш прайс'!J87)","v":""},{"$f":"IF('Наш прайс'!#REF!=0,\"\",'Наш прайс'!#REF!)","v":{"$error":"#REF!"}}]
[{"$f":"IF('Наш прайс'!B88=0,\"\",'Наш прайс'!B88)","v":""},{"$f":"IF('Наш прайс'!#REF!=0,\"\",'Наш прайс'!#REF!)","v":{"$error":"#REF!"}},{"$f":"IF('Наш прайс'!#REF!=0,\"\",'Наш прайс'!#REF!)","v":{"$error":"#REF!"}},"",null,null,{"$f":"IF('Наш прайс'!#REF!=0,\"\",'Наш прайс'!#REF!)","v":{"$error":"#REF!"}},{"$f":"IF('Наш прайс'!#REF!=0,\"\",'Наш прайс'!#REF!)","v":{"$error":"#REF!"}},{"$f":"IF('Наш прайс'!#REF!=0,\"\",'Наш прайс'!#REF!)","v":{"$error":"#REF!"}},{"$f":"IF('Наш прайс'!#REF!=0,\"\",'Наш прайс'!#REF!)","v":{"$error":"#REF!"}},{"$f":"IF('Наш прайс'!#REF!=0,\"\",'Наш прайс'!#REF!)","v":{"$error":"#REF!"}},{"$f":"IF('Наш прайс'!J88=0,\"\",'Наш прайс'!J88)","v":""},{"$f":"IF('Наш прайс'!#REF!=0,\"\",'Наш прайс'!#REF!)","v":{"$error":"#REF!"}}]
[{"$f":"IF('Наш прайс'!B89=0,\"\",'Наш прайс'!B89)","v":""},{"$f":"IF('Наш прайс'!#REF!=0,\"\",'Наш прайс'!#REF!)","v":{"$error":"#REF!"}},{"$f":"IF('Наш прайс'!#REF!=0,\"\",'Наш прайс'!#REF!)","v":{"$error":"#REF!"}},"",null,null,{"$f":"IF('Наш прайс'!#REF!=0,\"\",'Наш прайс'!#REF!)","v":{"$error":"#REF!"}},{"$f":"IF('Наш прайс'!#REF!=0,\"\",'Наш прайс'!#REF!)","v":{"$error":"#REF!"}},{"$f":"IF('Наш прайс'!#REF!=0,\"\",'Наш прайс'!#REF!)","v":{"$error":"#REF!"}},{"$f":"IF('Наш прайс'!#REF!=0,\"\",'Наш прайс'!#REF!)","v":{"$error":"#REF!"}},{"$f":"IF('Наш прайс'!#REF!=0,\"\",'Наш прайс'!#REF!)","v":{"$error":"#REF!"}},{"$f":"IF('Наш прайс'!J89=0,\"\",'Наш прайс'!J89)","v":""},{"$f":"IF('Наш прайс'!#REF!=0,\"\",'Наш прайс'!#REF!)","v":{"$error":"#REF!"}}]
[{"$f":"IF('Наш прайс'!B90=0,\"\",'Наш прайс'!B90)","v":""},{"$f":"IF('Наш прайс'!#REF!=0,\"\",'Наш прайс'!#REF!)","v":{"$error":"#REF!"}},{"$f":"IF('Наш прайс'!#REF!=0,\"\",'Наш прайс'!#REF!)","v":{"$error":"#REF!"}},"",null,null,{"$f":"IF('Наш прайс'!#REF!=0,\"\",'Наш прайс'!#REF!)","v":{"$error":"#REF!"}},{"$f":"IF('Наш прайс'!#REF!=0,\"\",'Наш прайс'!#REF!)","v":{"$error":"#REF!"}},{"$f":"IF('Наш прайс'!#REF!=0,\"\",'Наш прайс'!#REF!)","v":{"$error":"#REF!"}},{"$f":"IF('Наш прайс'!#REF!=0,\"\",'Наш прайс'!#REF!)","v":{"$error":"#REF!"}},{"$f":"IF('Наш прайс'!#REF!=0,\"\",'Наш прайс'!#REF!)","v":{"$error":"#REF!"}},{"$f":"IF('Наш прайс'!J90=0,\"\",'Наш прайс'!J90)","v":""},{"$f":"IF('Наш прайс'!#REF!=0,\"\",'Наш прайс'!#REF!)","v":{"$error":"#REF!"}}]
[{"$f":"IF('Наш прайс'!B91=0,\"\",'Наш прайс'!B91)","v":""},{"$f":"IF('Наш прайс'!#REF!=0,\"\",'Наш прайс'!#REF!)","v":{"$error":"#REF!"}},{"$f":"IF('Наш прайс'!#REF!=0,\"\",'Наш прайс'!#REF!)","v":{"$error":"#REF!"}},"",null,null,{"$f":"IF('Наш прайс'!#REF!=0,\"\",'Наш прайс'!#REF!)","v":{"$error":"#REF!"}},{"$f":"IF('Наш прайс'!#REF!=0,\"\",'Наш прайс'!#REF!)","v":{"$error":"#REF!"}},{"$f":"IF('Наш прайс'!#REF!=0,\"\",'Наш прайс'!#REF!)","v":{"$error":"#REF!"}},{"$f":"IF('Наш прайс'!#REF!=0,\"\",'Наш прайс'!#REF!)","v":{"$error":"#REF!"}},{"$f":"IF('Наш прайс'!#REF!=0,\"\",'Наш прайс'!#REF!)","v":{"$error":"#REF!"}},{"$f":"IF('Наш прайс'!J91=0,\"\",'Наш прайс'!J91)","v":""},{"$f":"IF('Наш прайс'!#REF!=0,\"\",'Наш прайс'!#REF!)","v":{"$error":"#REF!"}}]
[{"$f":"IF('Наш прайс'!B92=0,\"\",'Наш прайс'!B92)","v":""},{"$f":"IF('Наш прайс'!#REF!=0,\"\",'Наш прайс'!#REF!)","v":{"$error":"#REF!"}},{"$f":"IF('Наш прайс'!#REF!=0,\"\",'Наш прайс'!#REF!)","v":{"$error":"#REF!"}},"",null,null,{"$f":"IF('Наш прайс'!#REF!=0,\"\",'Наш прайс'!#REF!)","v":{"$error":"#REF!"}},{"$f":"IF('Наш прайс'!#REF!=0,\"\",'Наш прайс'!#REF!)","v":{"$error":"#REF!"}},{"$f":"IF('Наш прайс'!#REF!=0,\"\",'Наш прайс'!#REF!)","v":{"$error":"#REF!"}},{"$f":"IF('Наш прайс'!#REF!=0,\"\",'Наш прайс'!#REF!)","v":{"$error":"#REF!"}},{"$f":"IF('Наш прайс'!#REF!=0,\"\",'Наш прайс'!#REF!)","v":{"$error":"#REF!"}},{"$f":"IF('Наш прайс'!J92=0,\"\",'Наш прайс'!J92)","v":""},{"$f":"IF('Наш прайс'!#REF!=0,\"\",'Наш прайс'!#REF!)","v":{"$error":"#REF!"}}]
[{"$f":"IF('Наш прайс'!B93=0,\"\",'Наш прайс'!B93)","v":""},{"$f":"IF('Наш прайс'!#REF!=0,\"\",'Наш прайс'!#REF!)","v":{"$error":"#REF!"}},{"$f":"IF('Наш прайс'!#REF!=0,\"\",'Наш прайс'!#REF!)","v":{"$error":"#REF!"}},"",null,null,{"$f":"IF('Наш прайс'!#REF!=0,\"\",'Наш прайс'!#REF!)","v":{"$error":"#REF!"}},{"$f":"IF('Наш прайс'!#REF!=0,\"\",'Наш прайс'!#REF!)","v":{"$error":"#REF!"}},{"$f":"IF('Наш прайс'!#REF!=0,\"\",'Наш прайс'!#REF!)","v":{"$error":"#REF!"}},{"$f":"IF('Наш прайс'!#REF!=0,\"\",'Наш прайс'!#REF!)","v":{"$error":"#REF!"}},{"$f":"IF('Наш прайс'!#REF!=0,\"\",'Наш прайс'!#REF!)","v":{"$error":"#REF!"}},{"$f":"IF('Наш прайс'!J93=0,\"\",'Наш прайс'!J93)","v":""},{"$f":"IF('Наш прайс'!#REF!=0,\"\",'Наш прайс'!#REF!)","v":{"$error":"#REF!"}}]
[{"$f":"IF('Наш прайс'!B94=0,\"\",'Наш прайс'!B94)","v":""},{"$f":"IF('Наш прайс'!#REF!=0,\"\",'Наш прайс'!#REF!)","v":{"$error":"#REF!"}},{"$f":"IF('Наш прайс'!#REF!=0,\"\",'Наш прайс'!#REF!)","v":{"$error":"#REF!"}},"",null,null,{"$f":"IF('Наш прайс'!#REF!=0,\"\",'Наш прайс'!#REF!)","v":{"$error":"#REF!"}},{"$f":"IF('Наш прайс'!#REF!=0,\"\",'Наш прайс'!#REF!)","v":{"$error":"#REF!"}},{"$f":"IF('Наш прайс'!#REF!=0,\"\",'Наш прайс'!#REF!)","v":{"$error":"#REF!"}},{"$f":"IF('Наш прайс'!#REF!=0,\"\",'Наш прайс'!#REF!)","v":{"$error":"#REF!"}},{"$f":"IF('Наш прайс'!#REF!=0,\"\",'Наш прайс'!#REF!)","v":{"$error":"#REF!"}},{"$f":"IF('Наш прайс'!J94=0,\"\",'Наш прайс'!J94)","v":""},{"$f":"IF('Наш прайс'!#REF!=0,\"\",'Наш прайс'!#REF!)","v":{"$error":"#REF!"}}]
[{"$f":"IF('Наш прайс'!B95=0,\"\",'Наш прайс'!B95)","v":""},{"$f":"IF('Наш прайс'!#REF!=0,\"\",'Наш прайс'!#REF!)","v":{"$error":"#REF!"}},{"$f":"IF('Наш прайс'!#REF!=0,\"\",'Наш прайс'!#REF!)","v":{"$error":"#REF!"}},"",null,null,{"$f":"IF('Наш прайс'!#REF!=0,\"\",'Наш прайс'!#REF!)","v":{"$error":"#REF!"}},{"$f":"IF('Наш прайс'!#REF!=0,\"\",'Наш прайс'!#REF!)","v":{"$error":"#REF!"}},{"$f":"IF('Наш прайс'!#REF!=0,\"\",'Наш прайс'!#REF!)","v":{"$error":"#REF!"}},{"$f":"IF('Наш прайс'!#REF!=0,\"\",'Наш прайс'!#REF!)","v":{"$error":"#REF!"}},{"$f":"IF('Наш прайс'!#REF!=0,\"\",'Наш прайс'!#REF!)","v":{"$error":"#REF!"}},{"$f":"IF('Наш прайс'!J95=0,\"\",'Наш прайс'!J95)","v":""},{"$f":"IF('Наш прайс'!#REF!=0,\"\",'Наш прайс'!#REF!)","v":{"$error":"#REF!"}}]
[{"$f":"IF('Наш прайс'!B96=0,\"\",'Наш прайс'!B96)","v":""},{"$f":"IF('Наш прайс'!#REF!=0,\"\",'Наш прайс'!#REF!)","v":{"$error":"#REF!"}},{"$f":"IF('Наш прайс'!#REF!=0,\"\",'Наш прайс'!#REF!)","v":{"$error":"#REF!"}},"",null,null,{"$f":"IF('Наш прайс'!#REF!=0,\"\",'Наш прайс'!#REF!)","v":{"$error":"#REF!"}},{"$f":"IF('Наш прайс'!#REF!=0,\"\",'Наш прайс'!#REF!)","v":{"$error":"#REF!"}},{"$f":"IF('Наш прайс'!#REF!=0,\"\",'Наш прайс'!#REF!)","v":{"$error":"#REF!"}},{"$f":"IF('Наш прайс'!#REF!=0,\"\",'Наш прайс'!#REF!)","v":{"$error":"#REF!"}},{"$f":"IF('Наш прайс'!#REF!=0,\"\",'Наш прайс'!#REF!)","v":{"$error":"#REF!"}},{"$f":"IF('Наш прайс'!J96=0,\"\",'Наш прайс'!J96)","v":""},{"$f":"IF('Наш прайс'!#REF!=0,\"\",'Наш прайс'!#REF!)","v":{"$error":"#REF!"}}]
[{"$f":"IF('Наш прайс'!B97=0,\"\",'Наш прайс'!B97)","v":""},{"$f":"IF('Наш прайс'!#REF!=0,\"\",'Наш прайс'!#REF!)","v":{"$error":"#REF!"}},{"$f":"IF('Наш прайс'!#REF!=0,\"\",'Наш прайс'!#REF!)","v":{"$error":"#REF!"}},"",null,null,{"$f":"IF('Наш прайс'!#REF!=0,\"\",'Наш прайс'!#REF!)","v":{"$error":"#REF!"}},{"$f":"IF('Наш прайс'!#REF!=0,\"\",'Наш прайс'!#REF!)","v":{"$error":"#REF!"}},{"$f":"IF('Наш прайс'!#REF!=0,\"\",'Наш прайс'!#REF!)","v":{"$error":"#REF!"}},{"$f":"IF('Наш прайс'!#REF!=0,\"\",'Наш прайс'!#REF!)","v":{"$error":"#REF!"}},{"$f":"IF('Наш прайс'!#REF!=0,\"\",'Наш прайс'!#REF!)","v":{"$error":"#REF!"}},{"$f":"IF('Наш прайс'!J97=0,\"\",'Наш прайс'!J97)","v":""},{"$f":"IF('Наш прайс'!#REF!=0,\"\",'Наш прайс'!#REF!)","v":{"$error":"#REF!"}}]
[{"$f":"IF('Наш прайс'!B98=0,\"\",'Наш прайс'!B98)","v":""},{"$f":"IF('Наш прайс'!#REF!=0,\"\",'Наш прайс'!#REF!)","v":{"$error":"#REF!"}},{"$f":"IF('Наш прайс'!#REF!=0,\"\",'Наш прайс'!#REF!)","v":{"$error":"#REF!"}},"",null,null,{"$f":"IF('Наш прайс'!#REF!=0,\"\",'Наш прайс'!#REF!)","v":{"$error":"#REF!"}},{"$f":"IF('Наш прайс'!#REF!=0,\"\",'Наш прайс'!#REF!)","v":{"$error":"#REF!"}},{"$f":"IF('Наш прайс'!#REF!=0,\"\",'Наш прайс'!#REF!)","v":{"$error":"#REF!"}},{"$f":"IF('Наш прайс'!#REF!=0,\"\",'Наш прайс'!#REF!)","v":{"$error":"#REF!"}},{"$f":"IF('Наш прайс'!#REF!=0,\"\",'Наш прайс'!#REF!)","v":{"$error":"#REF!"}},{"$f":"IF('Наш прайс'!J98=0,\"\",'Наш прайс'!J98)","v":""},{"$f":"IF('Наш прайс'!#REF!=0,\"\",'Наш прайс'!#REF!)","v":{"$error":"#REF!"}}]
[{"$f":"IF('Наш прайс'!B99=0,\"\",'Наш прайс'!B99)","v":""},{"$f":"IF('Наш прайс'!#REF!=0,\"\",'Наш прайс'!#REF!)","v":{"$error":"#REF!"}},{"$f":"IF('Наш прайс'!#REF!=0,\"\",'Наш прайс'!#REF!)","v":{"$error":"#REF!"}},"",null,null,{"$f":"IF('Наш прайс'!#REF!=0,\"\",'Наш прайс'!#REF!)","v":{"$error":"#REF!"}},{"$f":"IF('Наш прайс'!#REF!=0,\"\",'Наш прайс'!#REF!)","v":{"$error":"#REF!"}},{"$f":"IF('Наш прайс'!#REF!=0,\"\",'Наш прайс'!#REF!)","v":{"$error":"#REF!"}},{"$f":"IF('Наш прайс'!#REF!=0,\"\",'Наш прайс'!#REF!)","v":{"$error":"#REF!"}},{"$f":"IF('Наш прайс'!#REF!=0,\"\",'Наш прайс'!#REF!)","v":{"$error":"#REF!"}},{"$f":"IF('Наш прайс'!J99=0,\"\",'Наш прайс'!J99)","v":""},{"$f":"IF('Наш прайс'!#REF!=0,\"\",'Наш прайс'!#REF!)","v":{"$error":"#REF!"}}]
[{"$f":"IF('Наш прайс'!B100=0,\"\",'Наш прайс'!B100)","v":""},{"$f":"IF('Наш прайс'!#REF!=0,\"\",'Наш прайс'!#REF!)","v":{"$error":"#REF!"}},{"$f":"IF('Наш прайс'!#REF!=0,\"\",'Наш прайс'!#REF!)","v":{"$error":"#REF!"}},"",null,null,{"$f":"IF('Наш прайс'!#REF!=0,\"\",'Наш прайс'!#REF!)","v":{"$error":"#REF!"}},{"$f":"IF('Наш прайс'!#REF!=0,\"\",'Наш прайс'!#REF!)","v":{"$error":"#REF!"}},{"$f":"IF('Наш прайс'!#REF!=0,\"\",'Наш прайс'!#REF!)","v":{"$error":"#REF!"}},{"$f":"IF('Наш прайс'!#REF!=0,\"\",'Наш прайс'!#REF!)","v":{"$error":"#REF!"}},{"$f":"IF('Наш прайс'!#REF!=0,\"\",'Наш прайс'!#REF!)","v":{"$error":"#REF!"}},{"$f":"IF('Наш прайс'!J100=0,\"\",'Наш прайс'!J100)","v":""},{"$f":"IF('Наш прайс'!#REF!=0,\"\",'Наш прайс'!#REF!)","v":{"$error":"#REF!"}}]
[{"$f":"IF('Наш прайс'!B101=0,\"\",'Наш прайс'!B101)","v":""},{"$f":"IF('Наш прайс'!#REF!=0,\"\",'Наш прайс'!#REF!)","v":{"$error":"#REF!"}},{"$f":"IF('Наш прайс'!#REF!=0,\"\",'Наш прайс'!#REF!)","v":{"$error":"#REF!"}},"",null,null,{"$f":"IF('Наш прайс'!#REF!=0,\"\",'Наш прайс'!#REF!)","v":{"$error":"#REF!"}},{"$f":"IF('Наш прайс'!#REF!=0,\"\",'Наш прайс'!#REF!)","v":{"$error":"#REF!"}},{"$f":"IF('Наш прайс'!#REF!=0,\"\",'Наш прайс'!#REF!)","v":{"$error":"#REF!"}},{"$f":"IF('Наш прайс'!#REF!=0,\"\",'Наш прайс'!#REF!)","v":{"$error":"#REF!"}},{"$f":"IF('Наш прайс'!#REF!=0,\"\",'Наш прайс'!#REF!)","v":{"$error":"#REF!"}},{"$f":"IF('Наш прайс'!J101=0,\"\",'Наш прайс'!J101)","v":""},{"$f":"IF('Наш прайс'!#REF!=0,\"\",'Наш прайс'!#REF!)","v":{"$error":"#REF!"}}]
[{"$f":"IF('Наш прайс'!B102=0,\"\",'Наш прайс'!B102)","v":""},{"$f":"IF('Наш прайс'!#REF!=0,\"\",'Наш прайс'!#REF!)","v":{"$error":"#REF!"}},{"$f":"IF('Наш прайс'!#REF!=0,\"\",'Наш прайс'!#REF!)","v":{"$error":"#REF!"}},"",null,null,{"$f":"IF('Наш прайс'!#REF!=0,\"\",'Наш прайс'!#REF!)","v":{"$error":"#REF!"}},{"$f":"IF('Наш прайс'!#REF!=0,\"\",'Наш прайс'!#REF!)","v":{"$error":"#REF!"}},{"$f":"IF('Наш прайс'!#REF!=0,\"\",'Наш прайс'!#REF!)","v":{"$error":"#REF!"}},{"$f":"IF('Наш прайс'!#REF!=0,\"\",'Наш прайс'!#REF!)","v":{"$error":"#REF!"}},{"$f":"IF('Наш прайс'!#REF!=0,\"\",'Наш прайс'!#REF!)","v":{"$error":"#REF!"}},{"$f":"IF('Наш прайс'!J102=0,\"\",'Наш прайс'!J102)","v":""},{"$f":"IF('Наш прайс'!#REF!=0,\"\",'Наш прайс'!#REF!)","v":{"$error":"#REF!"}}]
[{"$f":"IF('Наш прайс'!B103=0,\"\",'Наш прайс'!B103)","v":""},{"$f":"IF('Наш прайс'!#REF!=0,\"\",'Наш прайс'!#REF!)","v":{"$error":"#REF!"}},{"$f":"IF('Наш прайс'!#REF!=0,\"\",'Наш прайс'!#REF!)","v":{"$error":"#REF!"}},"",null,null,{"$f":"IF('Наш прайс'!#REF!=0,\"\",'Наш прайс'!#REF!)","v":{"$error":"#REF!"}},{"$f":"IF('Наш прайс'!#REF!=0,\"\",'Наш прайс'!#REF!)","v":{"$error":"#REF!"}},{"$f":"IF('Наш прайс'!#REF!=0,\"\",'Наш прайс'!#REF!)","v":{"$error":"#REF!"}},{"$f":"IF('Наш прайс'!#REF!=0,\"\",'Наш прайс'!#REF!)","v":{"$error":"#REF!"}},{"$f":"IF('Наш прайс'!#REF!=0,\"\",'Наш прайс'!#REF!)","v":{"$error":"#REF!"}},{"$f":"IF('Наш прайс'!J103=0,\"\",'Наш прайс'!J103)","v":""},{"$f":"IF('Наш прайс'!#REF!=0,\"\",'Наш прайс'!#REF!)","v":{"$error":"#REF!"}}]
[{"$f":"IF('Наш прайс'!B104=0,\"\",'Наш прайс'!B104)","v":""},{"$f":"IF('Наш прайс'!#REF!=0,\"\",'Наш прайс'!#REF!)","v":{"$error":"#REF!"}},{"$f":"IF('Наш прайс'!#REF!=0,\"\",'Наш прайс'!#REF!)","v":{"$error":"#REF!"}},"",null,null,{"$f":"IF('Наш прайс'!#REF!=0,\"\",'Наш прайс'!#REF!)","v":{"$error":"#REF!"}},{"$f":"IF('Наш прайс'!#REF!=0,\"\",'Наш прайс'!#REF!)","v":{"$error":"#REF!"}},{"$f":"IF('Наш прайс'!#REF!=0,\"\",'Наш прайс'!#REF!)","v":{"$error":"#REF!"}},{"$f":"IF('Наш прайс'!#REF!=0,\"\",'Наш прайс'!#REF!)","v":{"$error":"#REF!"}},{"$f":"IF('Наш прайс'!#REF!=0,\"\",'Наш прайс'!#REF!)","v":{"$error":"#REF!"}},{"$f":"IF('Наш прайс'!J104=0,\"\",'Наш прайс'!J104)","v":""},{"$f":"IF('Наш прайс'!#REF!=0,\"\",'Наш прайс'!#REF!)","v":{"$error":"#REF!"}}]
[{"$f":"IF('Наш прайс'!B105=0,\"\",'Наш прайс'!B105)","v":""},{"$f":"IF('Наш прайс'!#REF!=0,\"\",'Наш прайс'!#REF!)","v":{"$error":"#REF!"}},{"$f":"IF('Наш прайс'!#REF!=0,\"\",'Наш прайс'!#REF!)","v":{"$error":"#REF!"}},"",null,null,{"$f":"IF('Наш прайс'!#REF!=0,\"\",'Наш прайс'!#REF!)","v":{"$error":"#REF!"}},{"$f":"IF('Наш прайс'!#REF!=0,\"\",'Наш прайс'!#REF!)","v":{"$error":"#REF!"}},{"$f":"IF('Наш прайс'!#REF!=0,\"\",'Наш прайс'!#REF!)","v":{"$error":"#REF!"}},{"$f":"IF('Наш прайс'!#REF!=0,\"\",'Наш прайс'!#REF!)","v":{"$error":"#REF!"}},{"$f":"IF('Наш прайс'!#REF!=0,\"\",'Наш прайс'!#REF!)","v":{"$error":"#REF!"}},{"$f":"IF('Наш прайс'!J105=0,\"\",'Наш прайс'!J105)","v":""},{"$f":"IF('Наш прайс'!#REF!=0,\"\",'Наш прайс'!#REF!)","v":{"$error":"#REF!"}}]
[{"$f":"IF('Наш прайс'!B106=0,\"\",'Наш прайс'!B106)","v":""},{"$f":"IF('Наш прайс'!#REF!=0,\"\",'Наш прайс'!#REF!)","v":{"$error":"#REF!"}},{"$f":"IF('Наш прайс'!#REF!=0,\"\",'Наш прайс'!#REF!)","v":{"$error":"#REF!"}},"",null,null,{"$f":"IF('Наш прайс'!#REF!=0,\"\",'Наш прайс'!#REF!)","v":{"$error":"#REF!"}},{"$f":"IF('Наш прайс'!#REF!=0,\"\",'Наш прайс'!#REF!)","v":{"$error":"#REF!"}},{"$f":"IF('Наш прайс'!#REF!=0,\"\",'Наш прайс'!#REF!)","v":{"$error":"#REF!"}},{"$f":"IF('Наш прайс'!#REF!=0,\"\",'Наш прайс'!#REF!)","v":{"$error":"#REF!"}},{"$f":"IF('Наш прайс'!#REF!=0,\"\",'Наш прайс'!#REF!)","v":{"$error":"#REF!"}},{"$f":"IF('Наш прайс'!J106=0,\"\",'Наш прайс'!J106)","v":""},{"$f":"IF('Наш прайс'!#REF!=0,\"\",'Наш прайс'!#REF!)","v":{"$error":"#REF!"}}]
[{"$f":"IF('Наш прайс'!B107=0,\"\",'Наш прайс'!B107)","v":""},{"$f":"IF('Наш прайс'!#REF!=0,\"\",'Наш прайс'!#REF!)","v":{"$error":"#REF!"}},{"$f":"IF('Наш прайс'!#REF!=0,\"\",'Наш прайс'!#REF!)","v":{"$error":"#REF!"}},"",null,null,{"$f":"IF('Наш прайс'!#REF!=0,\"\",'Наш прайс'!#REF!)","v":{"$error":"#REF!"}},{"$f":"IF('Наш прайс'!#REF!=0,\"\",'Наш прайс'!#REF!)","v":{"$error":"#REF!"}},{"$f":"IF('Наш прайс'!#REF!=0,\"\",'Наш прайс'!#REF!)","v":{"$error":"#REF!"}},{"$f":"IF('Наш прайс'!#REF!=0,\"\",'Наш прайс'!#REF!)","v":{"$error":"#REF!"}},{"$f":"IF('Наш прайс'!#REF!=0,\"\",'Наш прайс'!#REF!)","v":{"$error":"#REF!"}},{"$f":"IF('Наш прайс'!J107=0,\"\",'Наш прайс'!J107)","v":""},{"$f":"IF('Наш прайс'!#REF!=0,\"\",'Наш прайс'!#REF!)","v":{"$error":"#REF!"}}]
[{"$f":"IF('Наш прайс'!B108=0,\"\",'Наш прайс'!B108)","v":""},{"$f":"IF('Наш прайс'!#REF!=0,\"\",'Наш прайс'!#REF!)","v":{"$error":"#REF!"}},{"$f":"IF('Наш прайс'!#REF!=0,\"\",'Наш прайс'!#REF!)","v":{"$error":"#REF!"}},"",null,null,{"$f":"IF('Наш прайс'!#REF!=0,\"\",'Наш прайс'!#REF!)","v":{"$error":"#REF!"}},{"$f":"IF('Наш прайс'!#REF!=0,\"\",'Наш прайс'!#REF!)","v":{"$error":"#REF!"}},{"$f":"IF('Наш прайс'!#REF!=0,\"\",'Наш прайс'!#REF!)","v":{"$error":"#REF!"}},{"$f":"IF('Наш прайс'!#REF!=0,\"\",'Наш прайс'!#REF!)","v":{"$error":"#REF!"}},{"$f":"IF('Наш прайс'!#REF!=0,\"\",'Наш прайс'!#REF!)","v":{"$error":"#REF!"}},{"$f":"IF('Наш прайс'!J108=0,\"\",'Наш прайс'!J108)","v":""},{"$f":"IF('Наш прайс'!#REF!=0,\"\",'Наш прайс'!#REF!)","v":{"$error":"#REF!"}}]
[{"$f":"IF('Наш прайс'!B109=0,\"\",'Наш прайс'!B109)","v":""},{"$f":"IF('Наш прайс'!#REF!=0,\"\",'Наш прайс'!#REF!)","v":{"$error":"#REF!"}},{"$f":"IF('Наш прайс'!#REF!=0,\"\",'Наш прайс'!#REF!)","v":{"$error":"#REF!"}},"",null,null,{"$f":"IF('Наш прайс'!#REF!=0,\"\",'Наш прайс'!#REF!)","v":{"$error":"#REF!"}},{"$f":"IF('Наш прайс'!#REF!=0,\"\",'Наш прайс'!#REF!)","v":{"$error":"#REF!"}},{"$f":"IF('Наш прайс'!#REF!=0,\"\",'Наш прайс'!#REF!)","v":{"$error":"#REF!"}},{"$f":"IF('Наш прайс'!#REF!=0,\"\",'Наш прайс'!#REF!)","v":{"$error":"#REF!"}},{"$f":"IF('Наш прайс'!#REF!=0,\"\",'Наш прайс'!#REF!)","v":{"$error":"#REF!"}},{"$f":"IF('Наш прайс'!J109=0,\"\",'Наш прайс'!J109)","v":""},{"$f":"IF('Наш прайс'!#REF!=0,\"\",'Наш прайс'!#REF!)","v":{"$error":"#REF!"}}]
[{"$f":"IF('Наш прайс'!B110=0,\"\",'Наш прайс'!B110)","v":""},{"$f":"IF('Наш прайс'!#REF!=0,\"\",'Наш прайс'!#REF!)","v":{"$error":"#REF!"}},{"$f":"IF('Наш прайс'!#REF!=0,\"\",'Наш прайс'!#REF!)","v":{"$error":"#REF!"}},"",null,null,{"$f":"IF('Наш прайс'!#REF!=0,\"\",'Наш прайс'!#REF!)","v":{"$error":"#REF!"}},{"$f":"IF('Наш прайс'!#REF!=0,\"\",'Наш прайс'!#REF!)","v":{"$error":"#REF!"}},{"$f":"IF('Наш прайс'!#REF!=0,\"\",'Наш прайс'!#REF!)","v":{"$error":"#REF!"}},{"$f":"IF('Наш прайс'!#REF!=0,\"\",'Наш прайс'!#REF!)","v":{"$error":"#REF!"}},{"$f":"IF('Наш прайс'!#REF!=0,\"\",'Наш прайс'!#REF!)","v":{"$error":"#REF!"}},{"$f":"IF('Наш прайс'!J110=0,\"\",'Наш прайс'!J110)","v":""},{"$f":"IF('Наш прайс'!#REF!=0,\"\",'Наш прайс'!#REF!)","v":{"$error":"#REF!"}}]
[{"$f":"IF('Наш прайс'!B111=0,\"\",'Наш прайс'!B111)","v":""},{"$f":"IF('Наш прайс'!#REF!=0,\"\",'Наш прайс'!#REF!)","v":{"$error":"#REF!"}},{"$f":"IF('Наш прайс'!#REF!=0,\"\",'Наш прайс'!#REF!)","v":{"$error":"#REF!"}},"",null,null,{"$f":"IF('Наш прайс'!#REF!=0,\"\",'Наш прайс'!#REF!)","v":{"$error":"#REF!"}},{"$f":"IF('Наш прайс'!#REF!=0,\"\",'Наш прайс'!#REF!)","v":{"$error":"#REF!"}},{"$f":"IF('Наш прайс'!#REF!=0,\"\",'Наш прайс'!#REF!)","v":{"$error":"#REF!"}},{"$f":"IF('Наш прайс'!#REF!=0,\"\",'Наш прайс'!#REF!)","v":{"$error":"#REF!"}},{"$f":"IF('Наш прайс'!#REF!=0,\"\",'Наш прайс'!#REF!)","v":{"$error":"#REF!"}},{"$f":"IF('Наш прайс'!J111=0,\"\",'Наш прайс'!J111)","v":""},{"$f":"IF('Наш прайс'!#REF!=0,\"\",'Наш прайс'!#REF!)","v":{"$error":"#REF!"}}]
[{"$f":"IF('Наш прайс'!B112=0,\"\",'Наш прайс'!B112)","v":""},{"$f":"IF('Наш прайс'!#REF!=0,\"\",'Наш прайс'!#REF!)","v":{"$error":"#REF!"}},{"$f":"IF('Наш прайс'!#REF!=0,\"\",'Наш прайс'!#REF!)","v":{"$error":"#REF!"}},{"$f":"L321","v":""},null,null,{"$f":"IF('Наш прайс'!#REF!=0,\"\",'Наш прайс'!#REF!)","v":{"$error":"#REF!"}},{"$f":"IF('Наш прайс'!#REF!=0,\"\",'Наш прайс'!#REF!)","v":{"$error":"#REF!"}},{"$f":"IF('Наш прайс'!#REF!=0,\"\",'Наш прайс'!#REF!)","v":{"$error":"#REF!"}},{"$f":"IF('Наш прайс'!#REF!=0,\"\",'Наш прайс'!#REF!)","v":{"$error":"#REF!"}},{"$f":"IF('Наш прайс'!#REF!=0,\"\",'Наш прайс'!#REF!)","v":{"$error":"#REF!"}},{"$f":"IF('Наш прайс'!J112=0,\"\",'Наш прайс'!J112)","v":""},{"$f":"IF('Наш прайс'!#REF!=0,\"\",'Наш прайс'!#REF!)","v":{"$error":"#REF!"}}]
[{"$f":"IF('Наш прайс'!B113=0,\"\",'Наш прайс'!B113)","v":""},{"$f":"IF('Наш прайс'!#REF!=0,\"\",'Наш прайс'!#REF!)","v":{"$error":"#REF!"}},{"$f":"IF('Наш прайс'!#REF!=0,\"\",'Наш прайс'!#REF!)","v":{"$error":"#REF!"}},"",null,null,{"$f":"IF('Наш прайс'!#REF!=0,\"\",'Наш прайс'!#REF!)","v":{"$error":"#REF!"}},{"$f":"IF('Наш прайс'!#REF!=0,\"\",'Наш прайс'!#REF!)","v":{"$error":"#REF!"}},{"$f":"IF('Наш прайс'!#REF!=0,\"\",'Наш прайс'!#REF!)","v":{"$error":"#REF!"}},{"$f":"IF('Наш прайс'!#REF!=0,\"\",'Наш прайс'!#REF!)","v":{"$error":"#REF!"}},{"$f":"IF('Наш прайс'!#REF!=0,\"\",'Наш прайс'!#REF!)","v":{"$error":"#REF!"}},{"$f":"IF('Наш прайс'!J113=0,\"\",'Наш прайс'!J113)","v":""},{"$f":"IF('Наш прайс'!#REF!=0,\"\",'Наш прайс'!#REF!)","v":{"$error":"#REF!"}}]
[{"$f":"IF('Наш прайс'!B114=0,\"\",'Наш прайс'!B114)","v":""},{"$f":"IF('Наш прайс'!#REF!=0,\"\",'Наш прайс'!#REF!)","v":{"$error":"#REF!"}},{"$f":"IF('Наш прайс'!#REF!=0,\"\",'Наш прайс'!#REF!)","v":{"$error":"#REF!"}},"",null,null,{"$f":"IF('Наш прайс'!#REF!=0,\"\",'Наш прайс'!#REF!)","v":{"$error":"#REF!"}},{"$f":"IF('Наш прайс'!#REF!=0,\"\",'Наш прайс'!#REF!)","v":{"$error":"#REF!"}},{"$f":"IF('Наш прайс'!#REF!=0,\"\",'Наш прайс'!#REF!)","v":{"$error":"#REF!"}},{"$f":"IF('Наш прайс'!#REF!=0,\"\",'Наш прайс'!#REF!)","v":{"$error":"#REF!"}},{"$f":"IF('Наш прайс'!#REF!=0,\"\",'Наш прайс'!#REF!)","v":{"$error":"#REF!"}},{"$f":"IF('Наш прайс'!J114=0,\"\",'Наш прайс'!J114)","v":""},{"$f":"IF('Наш прайс'!#REF!=0,\"\",'Наш прайс'!#REF!)","v":{"$error":"#REF!"}}]
[{"$f":"IF('Наш прайс'!B115=0,\"\",'Наш прайс'!B115)","v":""},{"$f":"IF('Наш прайс'!#REF!=0,\"\",'Наш прайс'!#REF!)","v":{"$error":"#REF!"}},{"$f":"IF('Наш прайс'!#REF!=0,\"\",'Наш прайс'!#REF!)","v":{"$error":"#REF!"}},"",null,null,{"$f":"IF('Наш прайс'!#REF!=0,\"\",'Наш прайс'!#REF!)","v":{"$error":"#REF!"}},{"$f":"IF('Наш прайс'!#REF!=0,\"\",'Наш прайс'!#REF!)","v":{"$error":"#REF!"}},{"$f":"IF('Наш прайс'!#REF!=0,\"\",'Наш прайс'!#REF!)","v":{"$error":"#REF!"}},{"$f":"IF('Наш прайс'!#REF!=0,\"\",'Наш прайс'!#REF!)","v":{"$error":"#REF!"}},{"$f":"IF('Наш прайс'!#REF!=0,\"\",'Наш прайс'!#REF!)","v":{"$error":"#REF!"}},{"$f":"IF('Наш прайс'!J115=0,\"\",'Наш прайс'!J115)","v":""},{"$f":"IF('Наш прайс'!#REF!=0,\"\",'Наш прайс'!#REF!)","v":{"$error":"#REF!"}}]
[{"$f":"IF('Наш прайс'!B116=0,\"\",'Наш прайс'!B116)","v":""},{"$f":"IF('Наш прайс'!#REF!=0,\"\",'Наш прайс'!#REF!)","v":{"$error":"#REF!"}},{"$f":"IF('Наш прайс'!#REF!=0,\"\",'Наш прайс'!#REF!)","v":{"$error":"#REF!"}},"",null,null,{"$f":"IF('Наш прайс'!#REF!=0,\"\",'Наш прайс'!#REF!)","v":{"$error":"#REF!"}},{"$f":"IF('Наш прайс'!#REF!=0,\"\",'Наш прайс'!#REF!)","v":{"$error":"#REF!"}},{"$f":"IF('Наш прайс'!#REF!=0,\"\",'Наш прайс'!#REF!)","v":{"$error":"#REF!"}},{"$f":"IF('Наш прайс'!#REF!=0,\"\",'Наш прайс'!#REF!)","v":{"$error":"#REF!"}},{"$f":"IF('Наш прайс'!#REF!=0,\"\",'Наш прайс'!#REF!)","v":{"$error":"#REF!"}},{"$f":"IF('Наш прайс'!J116=0,\"\",'Наш прайс'!J116)","v":""},{"$f":"IF('Наш прайс'!#REF!=0,\"\",'Наш прайс'!#REF!)","v":{"$error":"#REF!"}}]
[{"$f":"IF('Наш прайс'!B117=0,\"\",'Наш прайс'!B117)","v":""},{"$f":"IF('Наш прайс'!#REF!=0,\"\",'Наш прайс'!#REF!)","v":{"$error":"#REF!"}},{"$f":"IF('Наш прайс'!#REF!=0,\"\",'Наш прайс'!#REF!)","v":{"$error":"#REF!"}},"",null,null,{"$f":"IF('Наш прайс'!#REF!=0,\"\",'Наш прайс'!#REF!)","v":{"$error":"#REF!"}},{"$f":"IF('Наш прайс'!#REF!=0,\"\",'Наш прайс'!#REF!)","v":{"$error":"#REF!"}},{"$f":"IF('Наш прайс'!#REF!=0,\"\",'Наш прайс'!#REF!)","v":{"$error":"#REF!"}},{"$f":"IF('Наш прайс'!#REF!=0,\"\",'Наш прайс'!#REF!)","v":{"$error":"#REF!"}},{"$f":"IF('Наш прайс'!#REF!=0,\"\",'Наш прайс'!#REF!)","v":{"$error":"#REF!"}},{"$f":"IF('Наш прайс'!J117=0,\"\",'Наш прайс'!J117)","v":""},{"$f":"IF('Наш прайс'!#REF!=0,\"\",'Наш прайс'!#REF!)","v":{"$error":"#REF!"}}]
[{"$f":"IF('Наш прайс'!B118=0,\"\",'Наш прайс'!B118)","v":""},{"$f":"IF('Наш прайс'!#REF!=0,\"\",'Наш прайс'!#REF!)","v":{"$error":"#REF!"}},{"$f":"IF('Наш прайс'!#REF!=0,\"\",'Наш прайс'!#REF!)","v":{"$error":"#REF!"}},"",null,null,{"$f":"IF('Наш прайс'!#REF!=0,\"\",'Наш прайс'!#REF!)","v":{"$error":"#REF!"}},{"$f":"IF('Наш прайс'!#REF!=0,\"\",'Наш прайс'!#REF!)","v":{"$error":"#REF!"}},{"$f":"IF('Наш прайс'!#REF!=0,\"\",'Наш прайс'!#REF!)","v":{"$error":"#REF!"}},{"$f":"IF('Наш прайс'!#REF!=0,\"\",'Наш прайс'!#REF!)","v":{"$error":"#REF!"}},{"$f":"IF('Наш прайс'!#REF!=0,\"\",'Наш прайс'!#REF!)","v":{"$error":"#REF!"}},{"$f":"IF('Наш прайс'!J118=0,\"\",'Наш прайс'!J118)","v":""},{"$f":"IF('Наш прайс'!#REF!=0,\"\",'Наш прайс'!#REF!)","v":{"$error":"#REF!"}}]
[{"$f":"IF('Наш прайс'!B119=0,\"\",'Наш прайс'!B119)","v":""},{"$f":"IF('Наш прайс'!#REF!=0,\"\",'Наш прайс'!#REF!)","v":{"$error":"#REF!"}},{"$f":"IF('Наш прайс'!#REF!=0,\"\",'Наш прайс'!#REF!)","v":{"$error":"#REF!"}},"",null,null,{"$f":"IF('Наш прайс'!#REF!=0,\"\",'Наш прайс'!#REF!)","v":{"$error":"#REF!"}},{"$f":"IF('Наш прайс'!#REF!=0,\"\",'Наш прайс'!#REF!)","v":{"$error":"#REF!"}},{"$f":"IF('Наш прайс'!#REF!=0,\"\",'Наш прайс'!#REF!)","v":{"$error":"#REF!"}},{"$f":"IF('Наш прайс'!#REF!=0,\"\",'Наш прайс'!#REF!)","v":{"$error":"#REF!"}},{"$f":"IF('Наш прайс'!#REF!=0,\"\",'Наш прайс'!#REF!)","v":{"$error":"#REF!"}},{"$f":"IF('Наш прайс'!J119=0,\"\",'Наш прайс'!J119)","v":""},{"$f":"IF('Наш прайс'!#REF!=0,\"\",'Наш прайс'!#REF!)","v":{"$error":"#REF!"}}]
[{"$f":"IF('Наш прайс'!B120=0,\"\",'Наш прайс'!B120)","v":""},{"$f":"IF('Наш прайс'!#REF!=0,\"\",'Наш прайс'!#REF!)","v":{"$error":"#REF!"}},{"$f":"IF('Наш прайс'!#REF!=0,\"\",'Наш прайс'!#REF!)","v":{"$error":"#REF!"}},"",null,null,{"$f":"IF('Наш прайс'!#REF!=0,\"\",'Наш прайс'!#REF!)","v":{"$error":"#REF!"}},{"$f":"IF('Наш прайс'!#REF!=0,\"\",'Наш прайс'!#REF!)","v":{"$error":"#REF!"}},{"$f":"IF('Наш прайс'!#REF!=0,\"\",'Наш прайс'!#REF!)","v":{"$error":"#REF!"}},{"$f":"IF('Наш прайс'!#REF!=0,\"\",'Наш прайс'!#REF!)","v":{"$error":"#REF!"}},{"$f":"IF('Наш прайс'!#REF!=0,\"\",'Наш прайс'!#REF!)","v":{"$error":"#REF!"}},{"$f":"IF('Наш прайс'!J120=0,\"\",'Наш прайс'!J120)","v":""},{"$f":"IF('Наш прайс'!#REF!=0,\"\",'Наш прайс'!#REF!)","v":{"$error":"#REF!"}}]
[{"$f":"IF('Наш прайс'!B121=0,\"\",'Наш прайс'!B121)","v":""},{"$f":"IF('Наш прайс'!#REF!=0,\"\",'Наш прайс'!#REF!)","v":{"$error":"#REF!"}},{"$f":"IF('Наш прайс'!#REF!=0,\"\",'Наш прайс'!#REF!)","v":{"$error":"#REF!"}},"",null,null,{"$f":"IF('Наш прайс'!#REF!=0,\"\",'Наш прайс'!#REF!)","v":{"$error":"#REF!"}},{"$f":"IF('Наш прайс'!#REF!=0,\"\",'Наш прайс'!#REF!)","v":{"$error":"#REF!"}},{"$f":"IF('Наш прайс'!#REF!=0,\"\",'Наш прайс'!#REF!)","v":{"$error":"#REF!"}},{"$f":"IF('Наш прайс'!#REF!=0,\"\",'Наш прайс'!#REF!)","v":{"$error":"#REF!"}},{"$f":"IF('Наш прайс'!#REF!=0,\"\",'Наш прайс'!#REF!)","v":{"$error":"#REF!"}},{"$f":"IF('Наш прайс'!J121=0,\"\",'Наш прайс'!J121)","v":""},{"$f":"IF('Наш прайс'!#REF!=0,\"\",'Наш прайс'!#REF!)","v":{"$error":"#REF!"}}]
[{"$f":"IF('Наш прайс'!B122=0,\"\",'Наш прайс'!B122)","v":""},{"$f":"IF('Наш прайс'!#REF!=0,\"\",'Наш прайс'!#REF!)","v":{"$error":"#REF!"}},{"$f":"IF('Наш прайс'!#REF!=0,\"\",'Наш прайс'!#REF!)","v":{"$error":"#REF!"}},"",null,null,{"$f":"IF('Наш прайс'!#REF!=0,\"\",'Наш прайс'!#REF!)","v":{"$error":"#REF!"}},{"$f":"IF('Наш прайс'!#REF!=0,\"\",'Наш прайс'!#REF!)","v":{"$error":"#REF!"}},{"$f":"IF('Наш прайс'!#REF!=0,\"\",'Наш прайс'!#REF!)","v":{"$error":"#REF!"}},{"$f":"IF('Наш прайс'!#REF!=0,\"\",'Наш прайс'!#REF!)","v":{"$error":"#REF!"}},{"$f":"IF('Наш прайс'!#REF!=0,\"\",'Наш прайс'!#REF!)","v":{"$error":"#REF!"}},{"$f":"IF('Наш прайс'!J122=0,\"\",'Наш прайс'!J122)","v":""},{"$f":"IF('Наш прайс'!#REF!=0,\"\",'Наш прайс'!#REF!)","v":{"$error":"#REF!"}}]
[{"$f":"IF('Наш прайс'!B123=0,\"\",'Наш прайс'!B123)","v":""},{"$f":"IF('Наш прайс'!#REF!=0,\"\",'Наш прайс'!#REF!)","v":{"$error":"#REF!"}},{"$f":"IF('Наш прайс'!#REF!=0,\"\",'Наш прайс'!#REF!)","v":{"$error":"#REF!"}},"",null,null,{"$f":"IF('Наш прайс'!#REF!=0,\"\",'Наш прайс'!#REF!)","v":{"$error":"#REF!"}},{"$f":"IF('Наш прайс'!#REF!=0,\"\",'Наш прайс'!#REF!)","v":{"$error":"#REF!"}},{"$f":"IF('Наш прайс'!#REF!=0,\"\",'Наш прайс'!#REF!)","v":{"$error":"#REF!"}},{"$f":"IF('Наш прайс'!#REF!=0,\"\",'Наш прайс'!#REF!)","v":{"$error":"#REF!"}},{"$f":"IF('Наш прайс'!#REF!=0,\"\",'Наш прайс'!#REF!)","v":{"$error":"#REF!"}},{"$f":"IF('Наш прайс'!J123=0,\"\",'Наш прайс'!J123)","v":""},{"$f":"IF('Наш прайс'!#REF!=0,\"\",'Наш прайс'!#REF!)","v":{"$error":"#REF!"}}]
[{"$f":"IF('Наш прайс'!B124=0,\"\",'Наш прайс'!B124)","v":""},{"$f":"IF('Наш прайс'!#REF!=0,\"\",'Наш прайс'!#REF!)","v":{"$error":"#REF!"}},{"$f":"IF('Наш прайс'!#REF!=0,\"\",'Наш прайс'!#REF!)","v":{"$error":"#REF!"}},"",null,null,{"$f":"IF('Наш прайс'!#REF!=0,\"\",'Наш прайс'!#REF!)","v":{"$error":"#REF!"}},{"$f":"IF('Наш прайс'!#REF!=0,\"\",'Наш прайс'!#REF!)","v":{"$error":"#REF!"}},{"$f":"IF('Наш прайс'!#REF!=0,\"\",'Наш прайс'!#REF!)","v":{"$error":"#REF!"}},{"$f":"IF('Наш прайс'!#REF!=0,\"\",'Наш прайс'!#REF!)","v":{"$error":"#REF!"}},{"$f":"IF('Наш прайс'!#REF!=0,\"\",'Наш прайс'!#REF!)","v":{"$error":"#REF!"}},{"$f":"IF('Наш прайс'!J124=0,\"\",'Наш прайс'!J124)","v":""},{"$f":"IF('Наш прайс'!#REF!=0,\"\",'Наш прайс'!#REF!)","v":{"$error":"#REF!"}}]
[{"$f":"IF('Наш прайс'!B125=0,\"\",'Наш прайс'!B125)","v":""},{"$f":"IF('Наш прайс'!#REF!=0,\"\",'Наш прайс'!#REF!)","v":{"$error":"#REF!"}},{"$f":"IF('Наш прайс'!#REF!=0,\"\",'Наш прайс'!#REF!)","v":{"$error":"#REF!"}},"",null,null,{"$f":"IF('Наш прайс'!#REF!=0,\"\",'Наш прайс'!#REF!)","v":{"$error":"#REF!"}},{"$f":"IF('Наш прайс'!#REF!=0,\"\",'Наш прайс'!#REF!)","v":{"$error":"#REF!"}},{"$f":"IF('Наш прайс'!#REF!=0,\"\",'Наш прайс'!#REF!)","v":{"$error":"#REF!"}},{"$f":"IF('Наш прайс'!#REF!=0,\"\",'Наш прайс'!#REF!)","v":{"$error":"#REF!"}},{"$f":"IF('Наш прайс'!#REF!=0,\"\",'Наш прайс'!#REF!)","v":{"$error":"#REF!"}},{"$f":"IF('Наш прайс'!J125=0,\"\",'Наш прайс'!J125)","v":""},{"$f":"IF('Наш прайс'!#REF!=0,\"\",'Наш прайс'!#REF!)","v":{"$error":"#REF!"}}]
[{"$f":"IF('Наш прайс'!B126=0,\"\",'Наш прайс'!B126)","v":""},{"$f":"IF('Наш прайс'!#REF!=0,\"\",'Наш прайс'!#REF!)","v":{"$error":"#REF!"}},{"$f":"IF('Наш прайс'!#REF!=0,\"\",'Наш прайс'!#REF!)","v":{"$error":"#REF!"}},"",null,null,{"$f":"IF('Наш прайс'!#REF!=0,\"\",'Наш прайс'!#REF!)","v":{"$error":"#REF!"}},{"$f":"IF('Наш прайс'!#REF!=0,\"\",'Наш прайс'!#REF!)","v":{"$error":"#REF!"}},{"$f":"IF('Наш прайс'!#REF!=0,\"\",'Наш прайс'!#REF!)","v":{"$error":"#REF!"}},{"$f":"IF('Наш прайс'!#REF!=0,\"\",'Наш прайс'!#REF!)","v":{"$error":"#REF!"}},{"$f":"IF('Наш прайс'!#REF!=0,\"\",'Наш прайс'!#REF!)","v":{"$error":"#REF!"}},{"$f":"IF('Наш прайс'!J126=0,\"\",'Наш прайс'!J126)","v":""},{"$f":"IF('Наш прайс'!#REF!=0,\"\",'Наш прайс'!#REF!)","v":{"$error":"#REF!"}}]
[{"$f":"IF('Наш прайс'!B127=0,\"\",'Наш прайс'!B127)","v":""},{"$f":"IF('Наш прайс'!#REF!=0,\"\",'Наш прайс'!#REF!)","v":{"$error":"#REF!"}},{"$f":"IF('Наш прайс'!#REF!=0,\"\",'Наш прайс'!#REF!)","v":{"$error":"#REF!"}},"",null,null,{"$f":"IF('Наш прайс'!#REF!=0,\"\",'Наш прайс'!#REF!)","v":{"$error":"#REF!"}},{"$f":"IF('Наш прайс'!#REF!=0,\"\",'Наш прайс'!#REF!)","v":{"$error":"#REF!"}},{"$f":"IF('Наш прайс'!#REF!=0,\"\",'Наш прайс'!#REF!)","v":{"$error":"#REF!"}},{"$f":"IF('Наш прайс'!#REF!=0,\"\",'Наш прайс'!#REF!)","v":{"$error":"#REF!"}},{"$f":"IF('Наш прайс'!#REF!=0,\"\",'Наш прайс'!#REF!)","v":{"$error":"#REF!"}},{"$f":"IF('Наш прайс'!J127=0,\"\",'Наш прайс'!J127)","v":""},{"$f":"IF('Наш прайс'!#REF!=0,\"\",'Наш прайс'!#REF!)","v":{"$error":"#REF!"}}]
[{"$f":"IF('Наш прайс'!B128=0,\"\",'Наш прайс'!B128)","v":""},{"$f":"IF('Наш прайс'!#REF!=0,\"\",'Наш прайс'!#REF!)","v":{"$error":"#REF!"}},{"$f":"IF('Наш прайс'!#REF!=0,\"\",'Наш прайс'!#REF!)","v":{"$error":"#REF!"}},"",null,null,{"$f":"IF('Наш прайс'!#REF!=0,\"\",'Наш прайс'!#REF!)","v":{"$error":"#REF!"}},{"$f":"IF('Наш прайс'!#REF!=0,\"\",'Наш прайс'!#REF!)","v":{"$error":"#REF!"}},{"$f":"IF('Наш прайс'!#REF!=0,\"\",'Наш прайс'!#REF!)","v":{"$error":"#REF!"}},{"$f":"IF('Наш прайс'!#REF!=0,\"\",'Наш прайс'!#REF!)","v":{"$error":"#REF!"}},{"$f":"IF('Наш прайс'!#REF!=0,\"\",'Наш прайс'!#REF!)","v":{"$error":"#REF!"}},{"$f":"IF('Наш прайс'!J128=0,\"\",'Наш прайс'!J128)","v":""},{"$f":"IF('Наш прайс'!#REF!=0,\"\",'Наш прайс'!#REF!)","v":{"$error":"#REF!"}}]
[{"$f":"IF('Наш прайс'!B129=0,\"\",'Наш прайс'!B129)","v":""},{"$f":"IF('Наш прайс'!#REF!=0,\"\",'Наш прайс'!#REF!)","v":{"$error":"#REF!"}},{"$f":"IF('Наш прайс'!#REF!=0,\"\",'Наш прайс'!#REF!)","v":{"$error":"#REF!"}},"",null,null,{"$f":"IF('Наш прайс'!#REF!=0,\"\",'Наш прайс'!#REF!)","v":{"$error":"#REF!"}},{"$f":"IF('Наш прайс'!#REF!=0,\"\",'Наш прайс'!#REF!)","v":{"$error":"#REF!"}},{"$f":"IF('Наш прайс'!#REF!=0,\"\",'Наш прайс'!#REF!)","v":{"$error":"#REF!"}},{"$f":"IF('Наш прайс'!#REF!=0,\"\",'Наш прайс'!#REF!)","v":{"$error":"#REF!"}},{"$f":"IF('Наш прайс'!#REF!=0,\"\",'Наш прайс'!#REF!)","v":{"$error":"#REF!"}},{"$f":"IF('Наш прайс'!J129=0,\"\",'Наш прайс'!J129)","v":""},{"$f":"IF('Наш прайс'!#REF!=0,\"\",'Наш прайс'!#REF!)","v":{"$error":"#REF!"}}]
[{"$f":"IF('Наш прайс'!B130=0,\"\",'Наш прайс'!B130)","v":""},{"$f":"IF('Наш прайс'!#REF!=0,\"\",'Наш прайс'!#REF!)","v":{"$error":"#REF!"}},{"$f":"IF('Наш прайс'!#REF!=0,\"\",'Наш прайс'!#REF!)","v":{"$error":"#REF!"}},"",null,null,{"$f":"IF('Наш прайс'!#REF!=0,\"\",'Наш прайс'!#REF!)","v":{"$error":"#REF!"}},{"$f":"IF('Наш прайс'!#REF!=0,\"\",'Наш прайс'!#REF!)","v":{"$error":"#REF!"}},{"$f":"IF('Наш прайс'!#REF!=0,\"\",'Наш прайс'!#REF!)","v":{"$error":"#REF!"}},{"$f":"IF('Наш прайс'!#REF!=0,\"\",'Наш прайс'!#REF!)","v":{"$error":"#REF!"}},{"$f":"IF('Наш прайс'!#REF!=0,\"\",'Наш прайс'!#REF!)","v":{"$error":"#REF!"}},{"$f":"IF('Наш прайс'!J130=0,\"\",'Наш прайс'!J130)","v":""},{"$f":"IF('Наш прайс'!#REF!=0,\"\",'Наш прайс'!#REF!)","v":{"$error":"#REF!"}}]
[{"$f":"IF('Наш прайс'!B131=0,\"\",'Наш прайс'!B131)","v":""},{"$f":"IF('Наш прайс'!#REF!=0,\"\",'Наш прайс'!#REF!)","v":{"$error":"#REF!"}},{"$f":"IF('Наш прайс'!#REF!=0,\"\",'Наш прайс'!#REF!)","v":{"$error":"#REF!"}},"",null,null,{"$f":"IF('Наш прайс'!#REF!=0,\"\",'Наш прайс'!#REF!)","v":{"$error":"#REF!"}},{"$f":"IF('Наш прайс'!#REF!=0,\"\",'Наш прайс'!#REF!)","v":{"$error":"#REF!"}},{"$f":"IF('Наш прайс'!#REF!=0,\"\",'Наш прайс'!#REF!)","v":{"$error":"#REF!"}},{"$f":"IF('Наш прайс'!#REF!=0,\"\",'Наш прайс'!#REF!)","v":{"$error":"#REF!"}},{"$f":"IF('Наш прайс'!#REF!=0,\"\",'Наш прайс'!#REF!)","v":{"$error":"#REF!"}},{"$f":"IF('Наш прайс'!J131=0,\"\",'Наш прайс'!J131)","v":""},{"$f":"IF('Наш прайс'!#REF!=0,\"\",'Наш прайс'!#REF!)","v":{"$error":"#REF!"}}]
[{"$f":"IF('Наш прайс'!B132=0,\"\",'Наш прайс'!B132)","v":""},{"$f":"IF('Наш прайс'!#REF!=0,\"\",'Наш прайс'!#REF!)","v":{"$error":"#REF!"}},{"$f":"IF('Наш прайс'!#REF!=0,\"\",'Наш прайс'!#REF!)","v":{"$error":"#REF!"}},"",null,null,{"$f":"IF('Наш прайс'!#REF!=0,\"\",'Наш прайс'!#REF!)","v":{"$error":"#REF!"}},{"$f":"IF('Наш прайс'!#REF!=0,\"\",'Наш прайс'!#REF!)","v":{"$error":"#REF!"}},{"$f":"IF('Наш прайс'!#REF!=0,\"\",'Наш прайс'!#REF!)","v":{"$error":"#REF!"}},{"$f":"IF('Наш прайс'!#REF!=0,\"\",'Наш прайс'!#REF!)","v":{"$error":"#REF!"}},{"$f":"IF('Наш прайс'!#REF!=0,\"\",'Наш прайс'!#REF!)","v":{"$error":"#REF!"}},{"$f":"IF('Наш прайс'!J132=0,\"\",'Наш прайс'!J132)","v":""},{"$f":"IF('Наш прайс'!#REF!=0,\"\",'Наш прайс'!#REF!)","v":{"$error":"#REF!"}}]
[{"$f":"IF('Наш прайс'!B133=0,\"\",'Наш прайс'!B133)","v":""},{"$f":"IF('Наш прайс'!#REF!=0,\"\",'Наш прайс'!#REF!)","v":{"$error":"#REF!"}},{"$f":"IF('Наш прайс'!#REF!=0,\"\",'Наш прайс'!#REF!)","v":{"$error":"#REF!"}},"",null,null,{"$f":"IF('Наш прайс'!#REF!=0,\"\",'Наш прайс'!#REF!)","v":{"$error":"#REF!"}},{"$f":"IF('Наш прайс'!#REF!=0,\"\",'Наш прайс'!#REF!)","v":{"$error":"#REF!"}},{"$f":"IF('Наш прайс'!#REF!=0,\"\",'Наш прайс'!#REF!)","v":{"$error":"#REF!"}},{"$f":"IF('Наш прайс'!#REF!=0,\"\",'Наш прайс'!#REF!)","v":{"$error":"#REF!"}},{"$f":"IF('Наш прайс'!#REF!=0,\"\",'Наш прайс'!#REF!)","v":{"$error":"#REF!"}},{"$f":"IF('Наш прайс'!J133=0,\"\",'Наш прайс'!J133)","v":""},{"$f":"IF('Наш прайс'!#REF!=0,\"\",'Наш прайс'!#REF!)","v":{"$error":"#REF!"}}]
[{"$f":"IF('Наш прайс'!B134=0,\"\",'Наш прайс'!B134)","v":""},{"$f":"IF('Наш прайс'!#REF!=0,\"\",'Наш прайс'!#REF!)","v":{"$error":"#REF!"}},{"$f":"IF('Наш прайс'!#REF!=0,\"\",'Наш прайс'!#REF!)","v":{"$error":"#REF!"}},"",null,null,{"$f":"IF('Наш прайс'!#REF!=0,\"\",'Наш прайс'!#REF!)","v":{"$error":"#REF!"}},{"$f":"IF('Наш прайс'!#REF!=0,\"\",'Наш прайс'!#REF!)","v":{"$error":"#REF!"}},{"$f":"IF('Наш прайс'!#REF!=0,\"\",'Наш прайс'!#REF!)","v":{"$error":"#REF!"}},{"$f":"IF('Наш прайс'!#REF!=0,\"\",'Наш прайс'!#REF!)","v":{"$error":"#REF!"}},{"$f":"IF('Наш прайс'!#REF!=0,\"\",'Наш прайс'!#REF!)","v":{"$error":"#REF!"}},{"$f":"IF('Наш прайс'!J134=0,\"\",'Наш прайс'!J134)","v":""},{"$f":"IF('Наш прайс'!#REF!=0,\"\",'Наш прайс'!#REF!)","v":{"$error":"#REF!"}}]
[{"$f":"IF('Наш прайс'!B135=0,\"\",'Наш прайс'!B135)","v":""},{"$f":"IF('Наш прайс'!#REF!=0,\"\",'Наш прайс'!#REF!)","v":{"$error":"#REF!"}},{"$f":"IF('Наш прайс'!#REF!=0,\"\",'Наш прайс'!#REF!)","v":{"$error":"#REF!"}},"",null,null,{"$f":"IF('Наш прайс'!#REF!=0,\"\",'Наш прайс'!#REF!)","v":{"$error":"#REF!"}},{"$f":"IF('Наш прайс'!#REF!=0,\"\",'Наш прайс'!#REF!)","v":{"$error":"#REF!"}},{"$f":"IF('Наш прайс'!#REF!=0,\"\",'Наш прайс'!#REF!)","v":{"$error":"#REF!"}},{"$f":"IF('Наш прайс'!#REF!=0,\"\",'Наш прайс'!#REF!)","v":{"$error":"#REF!"}},{"$f":"IF('Наш прайс'!#REF!=0,\"\",'Наш прайс'!#REF!)","v":{"$error":"#REF!"}},{"$f":"IF('Наш прайс'!J135=0,\"\",'Наш прайс'!J135)","v":""},{"$f":"IF('Наш прайс'!#REF!=0,\"\",'Наш прайс'!#REF!)","v":{"$error":"#REF!"}}]
[{"$f":"IF('Наш прайс'!B136=0,\"\",'Наш прайс'!B136)","v":""},{"$f":"IF('Наш прайс'!#REF!=0,\"\",'Наш прайс'!#REF!)","v":{"$error":"#REF!"}},{"$f":"IF('Наш прайс'!#REF!=0,\"\",'Наш прайс'!#REF!)","v":{"$error":"#REF!"}},"",null,null,{"$f":"IF('Наш прайс'!#REF!=0,\"\",'Наш прайс'!#REF!)","v":{"$error":"#REF!"}},{"$f":"IF('Наш прайс'!#REF!=0,\"\",'Наш прайс'!#REF!)","v":{"$error":"#REF!"}},{"$f":"IF('Наш прайс'!#REF!=0,\"\",'Наш прайс'!#REF!)","v":{"$error":"#REF!"}},{"$f":"IF('Наш прайс'!#REF!=0,\"\",'Наш прайс'!#REF!)","v":{"$error":"#REF!"}},{"$f":"IF('Наш прайс'!#REF!=0,\"\",'Наш прайс'!#REF!)","v":{"$error":"#REF!"}},{"$f":"IF('Наш прайс'!J136=0,\"\",'Наш прайс'!J136)","v":""},{"$f":"IF('Наш прайс'!#REF!=0,\"\",'Наш прайс'!#REF!)","v":{"$error":"#REF!"}}]
[{"$f":"IF('Наш прайс'!B137=0,\"\",'Наш прайс'!B137)","v":""},{"$f":"IF('Наш прайс'!#REF!=0,\"\",'Наш прайс'!#REF!)","v":{"$error":"#REF!"}},{"$f":"IF('Наш прайс'!#REF!=0,\"\",'Наш прайс'!#REF!)","v":{"$error":"#REF!"}},"",null,null,{"$f":"IF('Наш прайс'!#REF!=0,\"\",'Наш прайс'!#REF!)","v":{"$error":"#REF!"}},{"$f":"IF('Наш прайс'!#REF!=0,\"\",'Наш прайс'!#REF!)","v":{"$error":"#REF!"}},{"$f":"IF('Наш прайс'!#REF!=0,\"\",'Наш прайс'!#REF!)","v":{"$error":"#REF!"}},{"$f":"IF('Наш прайс'!#REF!=0,\"\",'Наш прайс'!#REF!)","v":{"$error":"#REF!"}},{"$f":"IF('Наш прайс'!#REF!=0,\"\",'Наш прайс'!#REF!)","v":{"$error":"#REF!"}},{"$f":"IF('Наш прайс'!J137=0,\"\",'Наш прайс'!J137)","v":""},{"$f":"IF('Наш прайс'!#REF!=0,\"\",'Наш прайс'!#REF!)","v":{"$error":"#REF!"}}]
[{"$f":"IF('Наш прайс'!B138=0,\"\",'Наш прайс'!B138)","v":""},{"$f":"IF('Наш прайс'!#REF!=0,\"\",'Наш прайс'!#REF!)","v":{"$error":"#REF!"}},{"$f":"IF('Наш прайс'!#REF!=0,\"\",'Наш прайс'!#REF!)","v":{"$error":"#REF!"}},"",null,null,{"$f":"IF('Наш прайс'!#REF!=0,\"\",'Наш прайс'!#REF!)","v":{"$error":"#REF!"}},{"$f":"IF('Наш прайс'!#REF!=0,\"\",'Наш прайс'!#REF!)","v":{"$error":"#REF!"}},{"$f":"IF('Наш прайс'!#REF!=0,\"\",'Наш прайс'!#REF!)","v":{"$error":"#REF!"}},{"$f":"IF('Наш прайс'!#REF!=0,\"\",'Наш прайс'!#REF!)","v":{"$error":"#REF!"}},{"$f":"IF('Наш прайс'!#REF!=0,\"\",'Наш прайс'!#REF!)","v":{"$error":"#REF!"}},{"$f":"IF('Наш прайс'!J138=0,\"\",'Наш прайс'!J138)","v":""},{"$f":"IF('Наш прайс'!#REF!=0,\"\",'Наш прайс'!#REF!)","v":{"$error":"#REF!"}}]
[{"$f":"IF('Наш прайс'!B139=0,\"\",'Наш прайс'!B139)","v":""},{"$f":"IF('Наш прайс'!#REF!=0,\"\",'Наш прайс'!#REF!)","v":{"$error":"#REF!"}},{"$f":"IF('Наш прайс'!#REF!=0,\"\",'Наш прайс'!#REF!)","v":{"$error":"#REF!"}},"",null,null,{"$f":"IF('Наш прайс'!#REF!=0,\"\",'Наш прайс'!#REF!)","v":{"$error":"#REF!"}},{"$f":"IF('Наш прайс'!#REF!=0,\"\",'Наш прайс'!#REF!)","v":{"$error":"#REF!"}},{"$f":"IF('Наш прайс'!#REF!=0,\"\",'Наш прайс'!#REF!)","v":{"$error":"#REF!"}},{"$f":"IF('Наш прайс'!#REF!=0,\"\",'Наш прайс'!#REF!)","v":{"$error":"#REF!"}},{"$f":"IF('Наш прайс'!#REF!=0,\"\",'Наш прайс'!#REF!)","v":{"$error":"#REF!"}},{"$f":"IF('Наш прайс'!J139=0,\"\",'Наш прайс'!J139)","v":""},{"$f":"IF('Наш прайс'!#REF!=0,\"\",'Наш прайс'!#REF!)","v":{"$error":"#REF!"}}]
[{"$f":"IF('Наш прайс'!B140=0,\"\",'Наш прайс'!B140)","v":""},{"$f":"IF('Наш прайс'!#REF!=0,\"\",'Наш прайс'!#REF!)","v":{"$error":"#REF!"}},{"$f":"IF('Наш прайс'!#REF!=0,\"\",'Наш прайс'!#REF!)","v":{"$error":"#REF!"}},"",null,null,{"$f":"IF('Наш прайс'!#REF!=0,\"\",'Наш прайс'!#REF!)","v":{"$error":"#REF!"}},{"$f":"IF('Наш прайс'!#REF!=0,\"\",'Наш прайс'!#REF!)","v":{"$error":"#REF!"}},{"$f":"IF('Наш прайс'!#REF!=0,\"\",'Наш прайс'!#REF!)","v":{"$error":"#REF!"}},{"$f":"IF('Наш прайс'!#REF!=0,\"\",'Наш прайс'!#REF!)","v":{"$error":"#REF!"}},{"$f":"IF('Наш прайс'!#REF!=0,\"\",'Наш прайс'!#REF!)","v":{"$error":"#REF!"}},{"$f":"IF('Наш прайс'!J140=0,\"\",'Наш прайс'!J140)","v":""},{"$f":"IF('Наш прайс'!#REF!=0,\"\",'Наш прайс'!#REF!)","v":{"$error":"#REF!"}}]
[{"$f":"IF('Наш прайс'!B141=0,\"\",'Наш прайс'!B141)","v":""},{"$f":"IF('Наш прайс'!#REF!=0,\"\",'Наш прайс'!#REF!)","v":{"$error":"#REF!"}},{"$f":"IF('Наш прайс'!#REF!=0,\"\",'Наш прайс'!#REF!)","v":{"$error":"#REF!"}},"",null,null,{"$f":"IF('Наш прайс'!#REF!=0,\"\",'Наш прайс'!#REF!)","v":{"$error":"#REF!"}},{"$f":"IF('Наш прайс'!#REF!=0,\"\",'Наш прайс'!#REF!)","v":{"$error":"#REF!"}},{"$f":"IF('Наш прайс'!#REF!=0,\"\",'Наш прайс'!#REF!)","v":{"$error":"#REF!"}},{"$f":"IF('Наш прайс'!#REF!=0,\"\",'Наш прайс'!#REF!)","v":{"$error":"#REF!"}},{"$f":"IF('Наш прайс'!#REF!=0,\"\",'Наш прайс'!#REF!)","v":{"$error":"#REF!"}},{"$f":"IF('Наш прайс'!J141=0,\"\",'Наш прайс'!J141)","v":""},{"$f":"IF('Наш прайс'!#REF!=0,\"\",'Наш прайс'!#REF!)","v":{"$error":"#REF!"}}]
[{"$f":"IF('Наш прайс'!B142=0,\"\",'Наш прайс'!B142)","v":""},{"$f":"IF('Наш прайс'!#REF!=0,\"\",'Наш прайс'!#REF!)","v":{"$error":"#REF!"}},{"$f":"IF('Наш прайс'!#REF!=0,\"\",'Наш прайс'!#REF!)","v":{"$error":"#REF!"}},"",null,null,{"$f":"IF('Наш прайс'!#REF!=0,\"\",'Наш прайс'!#REF!)","v":{"$error":"#REF!"}},{"$f":"IF('Наш прайс'!#REF!=0,\"\",'Наш прайс'!#REF!)","v":{"$error":"#REF!"}},{"$f":"IF('Наш прайс'!#REF!=0,\"\",'Наш прайс'!#REF!)","v":{"$error":"#REF!"}},{"$f":"IF('Наш прайс'!#REF!=0,\"\",'Наш прайс'!#REF!)","v":{"$error":"#REF!"}},{"$f":"IF('Наш прайс'!#REF!=0,\"\",'Наш прайс'!#REF!)","v":{"$error":"#REF!"}},{"$f":"IF('Наш прайс'!J142=0,\"\",'Наш прайс'!J142)","v":""},{"$f":"IF('Наш прайс'!#REF!=0,\"\",'Наш прайс'!#REF!)","v":{"$error":"#REF!"}}]
[{"$f":"IF('Наш прайс'!B143=0,\"\",'Наш прайс'!B143)","v":""},{"$f":"IF('Наш прайс'!#REF!=0,\"\",'Наш прайс'!#REF!)","v":{"$error":"#REF!"}},{"$f":"IF('Наш прайс'!#REF!=0,\"\",'Наш прайс'!#REF!)","v":{"$error":"#REF!"}},"",null,null,{"$f":"IF('Наш прайс'!#REF!=0,\"\",'Наш прайс'!#REF!)","v":{"$error":"#REF!"}},{"$f":"IF('Наш прайс'!#REF!=0,\"\",'Наш прайс'!#REF!)","v":{"$error":"#REF!"}},{"$f":"IF('Наш прайс'!#REF!=0,\"\",'Наш прайс'!#REF!)","v":{"$error":"#REF!"}},{"$f":"IF('Наш прайс'!#REF!=0,\"\",'Наш прайс'!#REF!)","v":{"$error":"#REF!"}},{"$f":"IF('Наш прайс'!#REF!=0,\"\",'Наш прайс'!#REF!)","v":{"$error":"#REF!"}},{"$f":"IF('Наш прайс'!J143=0,\"\",'Наш прайс'!J143)","v":""},{"$f":"IF('Наш прайс'!#REF!=0,\"\",'Наш прайс'!#REF!)","v":{"$error":"#REF!"}}]
[{"$f":"IF('Наш прайс'!B144=0,\"\",'Наш прайс'!B144)","v":""},{"$f":"IF('Наш прайс'!#REF!=0,\"\",'Наш прайс'!#REF!)","v":{"$error":"#REF!"}},{"$f":"IF('Наш прайс'!#REF!=0,\"\",'Наш прайс'!#REF!)","v":{"$error":"#REF!"}},"",null,null,{"$f":"IF('Наш прайс'!#REF!=0,\"\",'Наш прайс'!#REF!)","v":{"$error":"#REF!"}},{"$f":"IF('Наш прайс'!#REF!=0,\"\",'Наш прайс'!#REF!)","v":{"$error":"#REF!"}},{"$f":"IF('Наш прайс'!#REF!=0,\"\",'Наш прайс'!#REF!)","v":{"$error":"#REF!"}},{"$f":"IF('Наш прайс'!#REF!=0,\"\",'Наш прайс'!#REF!)","v":{"$error":"#REF!"}},{"$f":"IF('Наш прайс'!#REF!=0,\"\",'Наш прайс'!#REF!)","v":{"$error":"#REF!"}},{"$f":"IF('Наш прайс'!J144=0,\"\",'Наш прайс'!J144)","v":""},{"$f":"IF('Наш прайс'!#REF!=0,\"\",'Наш прайс'!#REF!)","v":{"$error":"#REF!"}}]
[{"$f":"IF('Наш прайс'!B145=0,\"\",'Наш прайс'!B145)","v":""},{"$f":"IF('Наш прайс'!#REF!=0,\"\",'Наш прайс'!#REF!)","v":{"$error":"#REF!"}},{"$f":"IF('Наш прайс'!#REF!=0,\"\",'Наш прайс'!#REF!)","v":{"$error":"#REF!"}},"",null,null,{"$f":"IF('Наш прайс'!#REF!=0,\"\",'Наш прайс'!#REF!)","v":{"$error":"#REF!"}},{"$f":"IF('Наш прайс'!#REF!=0,\"\",'Наш прайс'!#REF!)","v":{"$error":"#REF!"}},{"$f":"IF('Наш прайс'!#REF!=0,\"\",'Наш прайс'!#REF!)","v":{"$error":"#REF!"}},{"$f":"IF('Наш прайс'!#REF!=0,\"\",'Наш прайс'!#REF!)","v":{"$error":"#REF!"}},{"$f":"IF('Наш прайс'!#REF!=0,\"\",'Наш прайс'!#REF!)","v":{"$error":"#REF!"}},{"$f":"IF('Наш прайс'!J145=0,\"\",'Наш прайс'!J145)","v":""},{"$f":"IF('Наш прайс'!#REF!=0,\"\",'Наш прайс'!#REF!)","v":{"$error":"#REF!"}}]
[{"$f":"IF('Наш прайс'!B143=0,\"\",'Наш прайс'!B143)","v":""},{"$f":"IF('Наш прайс'!#REF!=0,\"\",'Наш прайс'!#REF!)","v":{"$error":"#REF!"}},{"$f":"IF('Наш прайс'!#REF!=0,\"\",'Наш прайс'!#REF!)","v":{"$error":"#REF!"}},{"$f":"L355","v":""},null,null,{"$f":"IF('Наш прайс'!#REF!=0,\"\",'Наш прайс'!#REF!)","v":{"$error":"#REF!"}},{"$f":"IF('Наш прайс'!#REF!=0,\"\",'Наш прайс'!#REF!)","v":{"$error":"#REF!"}},{"$f":"IF('Наш прайс'!#REF!=0,\"\",'Наш прайс'!#REF!)","v":{"$error":"#REF!"}},{"$f":"IF('Наш прайс'!#REF!=0,\"\",'Наш прайс'!#REF!)","v":{"$error":"#REF!"}},{"$f":"IF('Наш прайс'!#REF!=0,\"\",'Наш прайс'!#REF!)","v":{"$error":"#REF!"}},{"$f":"IF('Наш прайс'!J143=0,\"\",'Наш прайс'!J143)","v":""},{"$f":"IF('Наш прайс'!#REF!=0,\"\",'Наш прайс'!#REF!)","v":{"$error":"#REF!"}}]
[{"$f":"IF('Наш прайс'!B144=0,\"\",'Наш прайс'!B144)","v":""},{"$f":"IF('Наш прайс'!#REF!=0,\"\",'Наш прайс'!#REF!)","v":{"$error":"#REF!"}},{"$f":"IF('Наш прайс'!#REF!=0,\"\",'Наш прайс'!#REF!)","v":{"$error":"#REF!"}},"",null,null,{"$f":"IF('Наш прайс'!#REF!=0,\"\",'Наш прайс'!#REF!)","v":{"$error":"#REF!"}},{"$f":"IF('Наш прайс'!#REF!=0,\"\",'Наш прайс'!#REF!)","v":{"$error":"#REF!"}},{"$f":"IF('Наш прайс'!#REF!=0,\"\",'Наш прайс'!#REF!)","v":{"$error":"#REF!"}},{"$f":"IF('Наш прайс'!#REF!=0,\"\",'Наш прайс'!#REF!)","v":{"$error":"#REF!"}},{"$f":"IF('Наш прайс'!#REF!=0,\"\",'Наш прайс'!#REF!)","v":{"$error":"#REF!"}},{"$f":"IF('Наш прайс'!J144=0,\"\",'Наш прайс'!J144)","v":""},{"$f":"IF('Наш прайс'!#REF!=0,\"\",'Наш прайс'!#REF!)","v":{"$error":"#REF!"}}]
[{"$f":"IF('Наш прайс'!B145=0,\"\",'Наш прайс'!B145)","v":""},{"$f":"IF('Наш прайс'!#REF!=0,\"\",'Наш прайс'!#REF!)","v":{"$error":"#REF!"}},{"$f":"IF('Наш прайс'!#REF!=0,\"\",'Наш прайс'!#REF!)","v":{"$error":"#REF!"}},"",null,null,{"$f":"IF('Наш прайс'!#REF!=0,\"\",'Наш прайс'!#REF!)","v":{"$error":"#REF!"}},{"$f":"IF('Наш прайс'!#REF!=0,\"\",'Наш прайс'!#REF!)","v":{"$error":"#REF!"}},{"$f":"IF('Наш прайс'!#REF!=0,\"\",'Наш прайс'!#REF!)","v":{"$error":"#REF!"}},{"$f":"IF('Наш прайс'!#REF!=0,\"\",'Наш прайс'!#REF!)","v":{"$error":"#REF!"}},{"$f":"IF('Наш прайс'!#REF!=0,\"\",'Наш прайс'!#REF!)","v":{"$error":"#REF!"}},{"$f":"IF('Наш прайс'!J145=0,\"\",'Наш прайс'!J145)","v":""},{"$f":"IF('Наш прайс'!#REF!=0,\"\",'Наш прайс'!#REF!)","v":{"$error":"#REF!"}}]
[{"$f":"IF('Наш прайс'!B146=0,\"\",'Наш прайс'!B146)","v":""},{"$f":"IF('Наш прайс'!#REF!=0,\"\",'Наш прайс'!#REF!)","v":{"$error":"#REF!"}},{"$f":"IF('Наш прайс'!#REF!=0,\"\",'Наш прайс'!#REF!)","v":{"$error":"#REF!"}},"",null,null,{"$f":"IF('Наш прайс'!#REF!=0,\"\",'Наш прайс'!#REF!)","v":{"$error":"#REF!"}},{"$f":"IF('Наш прайс'!#REF!=0,\"\",'Наш прайс'!#REF!)","v":{"$error":"#REF!"}},{"$f":"IF('Наш прайс'!#REF!=0,\"\",'Наш прайс'!#REF!)","v":{"$error":"#REF!"}},{"$f":"IF('Наш прайс'!#REF!=0,\"\",'Наш прайс'!#REF!)","v":{"$error":"#REF!"}},{"$f":"IF('Наш прайс'!#REF!=0,\"\",'Наш прайс'!#REF!)","v":{"$error":"#REF!"}},{"$f":"IF('Наш прайс'!J146=0,\"\",'Наш прайс'!J146)","v":""},{"$f":"IF('Наш прайс'!#REF!=0,\"\",'Наш прайс'!#REF!)","v":{"$error":"#REF!"}}]
[{"$f":"IF('Наш прайс'!B147=0,\"\",'Наш прайс'!B147)","v":""},{"$f":"IF('Наш прайс'!#REF!=0,\"\",'Наш прайс'!#REF!)","v":{"$error":"#REF!"}},{"$f":"IF('Наш прайс'!#REF!=0,\"\",'Наш прайс'!#REF!)","v":{"$error":"#REF!"}},"",null,null,{"$f":"IF('Наш прайс'!#REF!=0,\"\",'Наш прайс'!#REF!)","v":{"$error":"#REF!"}},{"$f":"IF('Наш прайс'!#REF!=0,\"\",'Наш прайс'!#REF!)","v":{"$error":"#REF!"}},{"$f":"IF('Наш прайс'!#REF!=0,\"\",'Наш прайс'!#REF!)","v":{"$error":"#REF!"}},{"$f":"IF('Наш прайс'!#REF!=0,\"\",'Наш прайс'!#REF!)","v":{"$error":"#REF!"}},{"$f":"IF('Наш прайс'!#REF!=0,\"\",'Наш прайс'!#REF!)","v":{"$error":"#REF!"}},{"$f":"IF('Наш прайс'!J147=0,\"\",'Наш прайс'!J147)","v":""},{"$f":"IF('Наш прайс'!#REF!=0,\"\",'Наш прайс'!#REF!)","v":{"$error":"#REF!"}}]
[{"$f":"IF('Наш прайс'!B148=0,\"\",'Наш прайс'!B148)","v":""},{"$f":"IF('Наш прайс'!#REF!=0,\"\",'Наш прайс'!#REF!)","v":{"$error":"#REF!"}},{"$f":"IF('Наш прайс'!#REF!=0,\"\",'Наш прайс'!#REF!)","v":{"$error":"#REF!"}},"",null,null,{"$f":"IF('Наш прайс'!#REF!=0,\"\",'Наш прайс'!#REF!)","v":{"$error":"#REF!"}},{"$f":"IF('Наш прайс'!#REF!=0,\"\",'Наш прайс'!#REF!)","v":{"$error":"#REF!"}},{"$f":"IF('Наш прайс'!#REF!=0,\"\",'Наш прайс'!#REF!)","v":{"$error":"#REF!"}},{"$f":"IF('Наш прайс'!#REF!=0,\"\",'Наш прайс'!#REF!)","v":{"$error":"#REF!"}},{"$f":"IF('Наш прайс'!#REF!=0,\"\",'Наш прайс'!#REF!)","v":{"$error":"#REF!"}},{"$f":"IF('Наш прайс'!J148=0,\"\",'Наш прайс'!J148)","v":""},{"$f":"IF('Наш прайс'!#REF!=0,\"\",'Наш прайс'!#REF!)","v":{"$error":"#REF!"}}]
[{"$f":"IF('Наш прайс'!B149=0,\"\",'Наш прайс'!B149)","v":""},{"$f":"IF('Наш прайс'!#REF!=0,\"\",'Наш прайс'!#REF!)","v":{"$error":"#REF!"}},{"$f":"IF('Наш прайс'!#REF!=0,\"\",'Наш прайс'!#REF!)","v":{"$error":"#REF!"}},"",null,null,{"$f":"IF('Наш прайс'!#REF!=0,\"\",'Наш прайс'!#REF!)","v":{"$error":"#REF!"}},{"$f":"IF('Наш прайс'!#REF!=0,\"\",'Наш прайс'!#REF!)","v":{"$error":"#REF!"}},{"$f":"IF('Наш прайс'!#REF!=0,\"\",'Наш прайс'!#REF!)","v":{"$error":"#REF!"}},{"$f":"IF('Наш прайс'!#REF!=0,\"\",'Наш прайс'!#REF!)","v":{"$error":"#REF!"}},{"$f":"IF('Наш прайс'!#REF!=0,\"\",'Наш прайс'!#REF!)","v":{"$error":"#REF!"}},{"$f":"IF('Наш прайс'!J149=0,\"\",'Наш прайс'!J149)","v":""},{"$f":"IF('Наш прайс'!#REF!=0,\"\",'Наш прайс'!#REF!)","v":{"$error":"#REF!"}}]
[{"$f":"IF('Наш прайс'!B150=0,\"\",'Наш прайс'!B150)","v":""},{"$f":"IF('Наш прайс'!#REF!=0,\"\",'Наш прайс'!#REF!)","v":{"$error":"#REF!"}},{"$f":"IF('Наш прайс'!#REF!=0,\"\",'Наш прайс'!#REF!)","v":{"$error":"#REF!"}},"",null,null,{"$f":"IF('Наш прайс'!#REF!=0,\"\",'Наш прайс'!#REF!)","v":{"$error":"#REF!"}},{"$f":"IF('Наш прайс'!#REF!=0,\"\",'Наш прайс'!#REF!)","v":{"$error":"#REF!"}},{"$f":"IF('Наш прайс'!#REF!=0,\"\",'Наш прайс'!#REF!)","v":{"$error":"#REF!"}},{"$f":"IF('Наш прайс'!#REF!=0,\"\",'Наш прайс'!#REF!)","v":{"$error":"#REF!"}},{"$f":"IF('Наш прайс'!#REF!=0,\"\",'Наш прайс'!#REF!)","v":{"$error":"#REF!"}},{"$f":"IF('Наш прайс'!J150=0,\"\",'Наш прайс'!J150)","v":""},{"$f":"IF('Наш прайс'!#REF!=0,\"\",'Наш прайс'!#REF!)","v":{"$error":"#REF!"}}]
[{"$f":"IF('Наш прайс'!B151=0,\"\",'Наш прайс'!B151)","v":""},{"$f":"IF('Наш прайс'!#REF!=0,\"\",'Наш прайс'!#REF!)","v":{"$error":"#REF!"}},{"$f":"IF('Наш прайс'!#REF!=0,\"\",'Наш прайс'!#REF!)","v":{"$error":"#REF!"}},"",null,null,{"$f":"IF('Наш прайс'!#REF!=0,\"\",'Наш прайс'!#REF!)","v":{"$error":"#REF!"}},{"$f":"IF('Наш прайс'!#REF!=0,\"\",'Наш прайс'!#REF!)","v":{"$error":"#REF!"}},{"$f":"IF('Наш прайс'!#REF!=0,\"\",'Наш прайс'!#REF!)","v":{"$error":"#REF!"}},{"$f":"IF('Наш прайс'!#REF!=0,\"\",'Наш прайс'!#REF!)","v":{"$error":"#REF!"}},{"$f":"IF('Наш прайс'!#REF!=0,\"\",'Наш прайс'!#REF!)","v":{"$error":"#REF!"}},{"$f":"IF('Наш прайс'!J151=0,\"\",'Наш прайс'!J151)","v":""},{"$f":"IF('Наш прайс'!#REF!=0,\"\",'Наш прайс'!#REF!)","v":{"$error":"#REF!"}}]
[{"$f":"IF('Наш прайс'!B152=0,\"\",'Наш прайс'!B152)","v":""},{"$f":"IF('Наш прайс'!#REF!=0,\"\",'Наш прайс'!#REF!)","v":{"$error":"#REF!"}},{"$f":"IF('Наш прайс'!#REF!=0,\"\",'Наш прайс'!#REF!)","v":{"$error":"#REF!"}},"",null,null,{"$f":"IF('Наш прайс'!#REF!=0,\"\",'Наш прайс'!#REF!)","v":{"$error":"#REF!"}},{"$f":"IF('Наш прайс'!#REF!=0,\"\",'Наш прайс'!#REF!)","v":{"$error":"#REF!"}},{"$f":"IF('Наш прайс'!#REF!=0,\"\",'Наш прайс'!#REF!)","v":{"$error":"#REF!"}},{"$f":"IF('Наш прайс'!#REF!=0,\"\",'Наш прайс'!#REF!)","v":{"$error":"#REF!"}},{"$f":"IF('Наш прайс'!#REF!=0,\"\",'Наш прайс'!#REF!)","v":{"$error":"#REF!"}},{"$f":"IF('Наш прайс'!J152=0,\"\",'Наш прайс'!J152)","v":""},{"$f":"IF('Наш прайс'!#REF!=0,\"\",'Наш прайс'!#REF!)","v":{"$error":"#REF!"}}]
[{"$f":"IF('Наш прайс'!B153=0,\"\",'Наш прайс'!B153)","v":""},{"$f":"IF('Наш прайс'!#REF!=0,\"\",'Наш прайс'!#REF!)","v":{"$error":"#REF!"}},{"$f":"IF('Наш прайс'!#REF!=0,\"\",'Наш прайс'!#REF!)","v":{"$error":"#REF!"}},"",null,null,{"$f":"IF('Наш прайс'!#REF!=0,\"\",'Наш прайс'!#REF!)","v":{"$error":"#REF!"}},{"$f":"IF('Наш прайс'!#REF!=0,\"\",'Наш прайс'!#REF!)","v":{"$error":"#REF!"}},{"$f":"IF('Наш прайс'!#REF!=0,\"\",'Наш прайс'!#REF!)","v":{"$error":"#REF!"}},{"$f":"IF('Наш прайс'!#REF!=0,\"\",'Наш прайс'!#REF!)","v":{"$error":"#REF!"}},{"$f":"IF('Наш прайс'!#REF!=0,\"\",'Наш прайс'!#REF!)","v":{"$error":"#REF!"}},{"$f":"IF('Наш прайс'!J153=0,\"\",'Наш прайс'!J153)","v":""},{"$f":"IF('Наш прайс'!#REF!=0,\"\",'Наш прайс'!#REF!)","v":{"$error":"#REF!"}}]
[{"$f":"IF('Наш прайс'!B154=0,\"\",'Наш прайс'!B154)","v":""},{"$f":"IF('Наш прайс'!#REF!=0,\"\",'Наш прайс'!#REF!)","v":{"$error":"#REF!"}},{"$f":"IF('Наш прайс'!#REF!=0,\"\",'Наш прайс'!#REF!)","v":{"$error":"#REF!"}},"",null,null,{"$f":"IF('Наш прайс'!#REF!=0,\"\",'Наш прайс'!#REF!)","v":{"$error":"#REF!"}},{"$f":"IF('Наш прайс'!#REF!=0,\"\",'Наш прайс'!#REF!)","v":{"$error":"#REF!"}},{"$f":"IF('Наш прайс'!#REF!=0,\"\",'Наш прайс'!#REF!)","v":{"$error":"#REF!"}},{"$f":"IF('Наш прайс'!#REF!=0,\"\",'Наш прайс'!#REF!)","v":{"$error":"#REF!"}},{"$f":"IF('Наш прайс'!#REF!=0,\"\",'Наш прайс'!#REF!)","v":{"$error":"#REF!"}},{"$f":"IF('Наш прайс'!J154=0,\"\",'Наш прайс'!J154)","v":""},{"$f":"IF('Наш прайс'!#REF!=0,\"\",'Наш прайс'!#REF!)","v":{"$error":"#REF!"}}]
[{"$f":"IF('Наш прайс'!B155=0,\"\",'Наш прайс'!B155)","v":""},{"$f":"IF('Наш прайс'!#REF!=0,\"\",'Наш прайс'!#REF!)","v":{"$error":"#REF!"}},{"$f":"IF('Наш прайс'!#REF!=0,\"\",'Наш прайс'!#REF!)","v":{"$error":"#REF!"}},"",null,null,{"$f":"IF('Наш прайс'!#REF!=0,\"\",'Наш прайс'!#REF!)","v":{"$error":"#REF!"}},{"$f":"IF('Наш прайс'!#REF!=0,\"\",'Наш прайс'!#REF!)","v":{"$error":"#REF!"}},{"$f":"IF('Наш прайс'!#REF!=0,\"\",'Наш прайс'!#REF!)","v":{"$error":"#REF!"}},{"$f":"IF('Наш прайс'!#REF!=0,\"\",'Наш прайс'!#REF!)","v":{"$error":"#REF!"}},{"$f":"IF('Наш прайс'!#REF!=0,\"\",'Наш прайс'!#REF!)","v":{"$error":"#REF!"}},{"$f":"IF('Наш прайс'!J155=0,\"\",'Наш прайс'!J155)","v":""},{"$f":"IF('Наш прайс'!#REF!=0,\"\",'Наш прайс'!#REF!)","v":{"$error":"#REF!"}}]
[{"$f":"IF('Наш прайс'!B156=0,\"\",'Наш прайс'!B156)","v":""},{"$f":"IF('Наш прайс'!#REF!=0,\"\",'Наш прайс'!#REF!)","v":{"$error":"#REF!"}},{"$f":"IF('Наш прайс'!#REF!=0,\"\",'Наш прайс'!#REF!)","v":{"$error":"#REF!"}},"",null,null,{"$f":"IF('Наш прайс'!#REF!=0,\"\",'Наш прайс'!#REF!)","v":{"$error":"#REF!"}},{"$f":"IF('Наш прайс'!#REF!=0,\"\",'Наш прайс'!#REF!)","v":{"$error":"#REF!"}},{"$f":"IF('Наш прайс'!#REF!=0,\"\",'Наш прайс'!#REF!)","v":{"$error":"#REF!"}},{"$f":"IF('Наш прайс'!#REF!=0,\"\",'Наш прайс'!#REF!)","v":{"$error":"#REF!"}},{"$f":"IF('Наш прайс'!#REF!=0,\"\",'Наш прайс'!#REF!)","v":{"$error":"#REF!"}},{"$f":"IF('Наш прайс'!J156=0,\"\",'Наш прайс'!J156)","v":""},{"$f":"IF('Наш прайс'!#REF!=0,\"\",'Наш прайс'!#REF!)","v":{"$error":"#REF!"}}]
[{"$f":"IF('Наш прайс'!B157=0,\"\",'Наш прайс'!B157)","v":""},{"$f":"IF('Наш прайс'!#REF!=0,\"\",'Наш прайс'!#REF!)","v":{"$error":"#REF!"}},{"$f":"IF('Наш прайс'!#REF!=0,\"\",'Наш прайс'!#REF!)","v":{"$error":"#REF!"}},"",null,null,{"$f":"IF('Наш прайс'!#REF!=0,\"\",'Наш прайс'!#REF!)","v":{"$error":"#REF!"}},{"$f":"IF('Наш прайс'!#REF!=0,\"\",'Наш прайс'!#REF!)","v":{"$error":"#REF!"}},{"$f":"IF('Наш прайс'!#REF!=0,\"\",'Наш прайс'!#REF!)","v":{"$error":"#REF!"}},{"$f":"IF('Наш прайс'!#REF!=0,\"\",'Наш прайс'!#REF!)","v":{"$error":"#REF!"}},{"$f":"IF('Наш прайс'!#REF!=0,\"\",'Наш прайс'!#REF!)","v":{"$error":"#REF!"}},{"$f":"IF('Наш прайс'!J157=0,\"\",'Наш прайс'!J157)","v":""},{"$f":"IF('Наш прайс'!#REF!=0,\"\",'Наш прайс'!#REF!)","v":{"$error":"#REF!"}}]
[{"$f":"IF('Наш прайс'!B158=0,\"\",'Наш прайс'!B158)","v":""},{"$f":"IF('Наш прайс'!#REF!=0,\"\",'Наш прайс'!#REF!)","v":{"$error":"#REF!"}},{"$f":"IF('Наш прайс'!#REF!=0,\"\",'Наш прайс'!#REF!)","v":{"$error":"#REF!"}},"",null,null,{"$f":"IF('Наш прайс'!#REF!=0,\"\",'Наш прайс'!#REF!)","v":{"$error":"#REF!"}},{"$f":"IF('Наш прайс'!#REF!=0,\"\",'Наш прайс'!#REF!)","v":{"$error":"#REF!"}},{"$f":"IF('Наш прайс'!#REF!=0,\"\",'Наш прайс'!#REF!)","v":{"$error":"#REF!"}},{"$f":"IF('Наш прайс'!#REF!=0,\"\",'Наш прайс'!#REF!)","v":{"$error":"#REF!"}},{"$f":"IF('Наш прайс'!#REF!=0,\"\",'Наш прайс'!#REF!)","v":{"$error":"#REF!"}},{"$f":"IF('Наш прайс'!J158=0,\"\",'Наш прайс'!J158)","v":""},{"$f":"IF('Наш прайс'!#REF!=0,\"\",'Наш прайс'!#REF!)","v":{"$error":"#REF!"}}]
[{"$f":"IF('Наш прайс'!B159=0,\"\",'Наш прайс'!B159)","v":""},{"$f":"IF('Наш прайс'!#REF!=0,\"\",'Наш прайс'!#REF!)","v":{"$error":"#REF!"}},{"$f":"IF('Наш прайс'!#REF!=0,\"\",'Наш прайс'!#REF!)","v":{"$error":"#REF!"}},"",null,null,{"$f":"IF('Наш прайс'!#REF!=0,\"\",'Наш прайс'!#REF!)","v":{"$error":"#REF!"}},{"$f":"IF('Наш прайс'!#REF!=0,\"\",'Наш прайс'!#REF!)","v":{"$error":"#REF!"}},{"$f":"IF('Наш прайс'!#REF!=0,\"\",'Наш прайс'!#REF!)","v":{"$error":"#REF!"}},{"$f":"IF('Наш прайс'!#REF!=0,\"\",'Наш прайс'!#REF!)","v":{"$error":"#REF!"}},{"$f":"IF('Наш прайс'!#REF!=0,\"\",'Наш прайс'!#REF!)","v":{"$error":"#REF!"}},{"$f":"IF('Наш прайс'!J159=0,\"\",'Наш прайс'!J159)","v":""},{"$f":"IF('Наш прайс'!#REF!=0,\"\",'Наш прайс'!#REF!)","v":{"$error":"#REF!"}}]
[{"$f":"IF('Наш прайс'!B160=0,\"\",'Наш прайс'!B160)","v":""},{"$f":"IF('Наш прайс'!#REF!=0,\"\",'Наш прайс'!#REF!)","v":{"$error":"#REF!"}},{"$f":"IF('Наш прайс'!#REF!=0,\"\",'Наш прайс'!#REF!)","v":{"$error":"#REF!"}},"",null,null,{"$f":"IF('Наш прайс'!#REF!=0,\"\",'Наш прайс'!#REF!)","v":{"$error":"#REF!"}},{"$f":"IF('Наш прайс'!#REF!=0,\"\",'Наш прайс'!#REF!)","v":{"$error":"#REF!"}},{"$f":"IF('Наш прайс'!#REF!=0,\"\",'Наш прайс'!#REF!)","v":{"$error":"#REF!"}},{"$f":"IF('Наш прайс'!#REF!=0,\"\",'Наш прайс'!#REF!)","v":{"$error":"#REF!"}},{"$f":"IF('Наш прайс'!#REF!=0,\"\",'Наш прайс'!#REF!)","v":{"$error":"#REF!"}},{"$f":"IF('Наш прайс'!J160=0,\"\",'Наш прайс'!J160)","v":""},{"$f":"IF('Наш прайс'!#REF!=0,\"\",'Наш прайс'!#REF!)","v":{"$error":"#REF!"}}]
[{"$f":"IF('Наш прайс'!B161=0,\"\",'Наш прайс'!B161)","v":""},{"$f":"IF('Наш прайс'!#REF!=0,\"\",'Наш прайс'!#REF!)","v":{"$error":"#REF!"}},{"$f":"IF('Наш прайс'!#REF!=0,\"\",'Наш прайс'!#REF!)","v":{"$error":"#REF!"}},"",null,null,{"$f":"IF('Наш прайс'!#REF!=0,\"\",'Наш прайс'!#REF!)","v":{"$error":"#REF!"}},{"$f":"IF('Наш прайс'!#REF!=0,\"\",'Наш прайс'!#REF!)","v":{"$error":"#REF!"}},{"$f":"IF('Наш прайс'!#REF!=0,\"\",'Наш прайс'!#REF!)","v":{"$error":"#REF!"}},{"$f":"IF('Наш прайс'!#REF!=0,\"\",'Наш прайс'!#REF!)","v":{"$error":"#REF!"}},{"$f":"IF('Наш прайс'!#REF!=0,\"\",'Наш прайс'!#REF!)","v":{"$error":"#REF!"}},{"$f":"IF('Наш прайс'!J161=0,\"\",'Наш прайс'!J161)","v":""},{"$f":"IF('Наш прайс'!#REF!=0,\"\",'Наш прайс'!#REF!)","v":{"$error":"#REF!"}}]
[{"$f":"IF('Наш прайс'!B162=0,\"\",'Наш прайс'!B162)","v":""},{"$f":"IF('Наш прайс'!#REF!=0,\"\",'Наш прайс'!#REF!)","v":{"$error":"#REF!"}},{"$f":"IF('Наш прайс'!#REF!=0,\"\",'Наш прайс'!#REF!)","v":{"$error":"#REF!"}},"",null,null,{"$f":"IF('Наш прайс'!#REF!=0,\"\",'Наш прайс'!#REF!)","v":{"$error":"#REF!"}},{"$f":"IF('Наш прайс'!#REF!=0,\"\",'Наш прайс'!#REF!)","v":{"$error":"#REF!"}},{"$f":"IF('Наш прайс'!#REF!=0,\"\",'Наш прайс'!#REF!)","v":{"$error":"#REF!"}},{"$f":"IF('Наш прайс'!#REF!=0,\"\",'Наш прайс'!#REF!)","v":{"$error":"#REF!"}},{"$f":"IF('Наш прайс'!#REF!=0,\"\",'Наш прайс'!#REF!)","v":{"$error":"#REF!"}},{"$f":"IF('Наш прайс'!J162=0,\"\",'Наш прайс'!J162)","v":""},{"$f":"IF('Наш прайс'!#REF!=0,\"\",'Наш прайс'!#REF!)","v":{"$error":"#REF!"}}]
[{"$f":"IF('Наш прайс'!B163=0,\"\",'Наш прайс'!B163)","v":""},{"$f":"IF('Наш прайс'!#REF!=0,\"\",'Наш прайс'!#REF!)","v":{"$error":"#REF!"}},{"$f":"IF('Наш прайс'!#REF!=0,\"\",'Наш прайс'!#REF!)","v":{"$error":"#REF!"}},"",null,null,{"$f":"IF('Наш прайс'!#REF!=0,\"\",'Наш прайс'!#REF!)","v":{"$error":"#REF!"}},{"$f":"IF('Наш прайс'!#REF!=0,\"\",'Наш прайс'!#REF!)","v":{"$error":"#REF!"}},{"$f":"IF('Наш прайс'!#REF!=0,\"\",'Наш прайс'!#REF!)","v":{"$error":"#REF!"}},{"$f":"IF('Наш прайс'!#REF!=0,\"\",'Наш прайс'!#REF!)","v":{"$error":"#REF!"}},{"$f":"IF('Наш прайс'!#REF!=0,\"\",'Наш прайс'!#REF!)","v":{"$error":"#REF!"}},{"$f":"IF('Наш прайс'!J163=0,\"\",'Наш прайс'!J163)","v":""},{"$f":"IF('Наш прайс'!#REF!=0,\"\",'Наш прайс'!#REF!)","v":{"$error":"#REF!"}}]
[{"$f":"IF('Наш прайс'!B164=0,\"\",'Наш прайс'!B164)","v":""},{"$f":"IF('Наш прайс'!#REF!=0,\"\",'Наш прайс'!#REF!)","v":{"$error":"#REF!"}},{"$f":"IF('Наш прайс'!#REF!=0,\"\",'Наш прайс'!#REF!)","v":{"$error":"#REF!"}},"",null,null,{"$f":"IF('Наш прайс'!#REF!=0,\"\",'Наш прайс'!#REF!)","v":{"$error":"#REF!"}},{"$f":"IF('Наш прайс'!#REF!=0,\"\",'Наш прайс'!#REF!)","v":{"$error":"#REF!"}},{"$f":"IF('Наш прайс'!#REF!=0,\"\",'Наш прайс'!#REF!)","v":{"$error":"#REF!"}},{"$f":"IF('Наш прайс'!#REF!=0,\"\",'Наш прайс'!#REF!)","v":{"$error":"#REF!"}},{"$f":"IF('Наш прайс'!#REF!=0,\"\",'Наш прайс'!#REF!)","v":{"$error":"#REF!"}},{"$f":"IF('Наш прайс'!J164=0,\"\",'Наш прайс'!J164)","v":""},{"$f":"IF('Наш прайс'!#REF!=0,\"\",'Наш прайс'!#REF!)","v":{"$error":"#REF!"}}]
[{"$f":"IF('Наш прайс'!B165=0,\"\",'Наш прайс'!B165)","v":""},{"$f":"IF('Наш прайс'!#REF!=0,\"\",'Наш прайс'!#REF!)","v":{"$error":"#REF!"}},{"$f":"IF('Наш прайс'!#REF!=0,\"\",'Наш прайс'!#REF!)","v":{"$error":"#REF!"}},"",null,null,{"$f":"IF('Наш прайс'!#REF!=0,\"\",'Наш прайс'!#REF!)","v":{"$error":"#REF!"}},{"$f":"IF('Наш прайс'!#REF!=0,\"\",'Наш прайс'!#REF!)","v":{"$error":"#REF!"}},{"$f":"IF('Наш прайс'!#REF!=0,\"\",'Наш прайс'!#REF!)","v":{"$error":"#REF!"}},{"$f":"IF('Наш прайс'!#REF!=0,\"\",'Наш прайс'!#REF!)","v":{"$error":"#REF!"}},{"$f":"IF('Наш прайс'!#REF!=0,\"\",'Наш прайс'!#REF!)","v":{"$error":"#REF!"}},{"$f":"IF('Наш прайс'!J165=0,\"\",'Наш прайс'!J165)","v":""},{"$f":"IF('Наш прайс'!#REF!=0,\"\",'Наш прайс'!#REF!)","v":{"$error":"#REF!"}}]
[{"$f":"IF('Наш прайс'!B166=0,\"\",'Наш прайс'!B166)","v":""},{"$f":"IF('Наш прайс'!#REF!=0,\"\",'Наш прайс'!#REF!)","v":{"$error":"#REF!"}},{"$f":"IF('Наш прайс'!#REF!=0,\"\",'Наш прайс'!#REF!)","v":{"$error":"#REF!"}},"",null,null,{"$f":"IF('Наш прайс'!#REF!=0,\"\",'Наш прайс'!#REF!)","v":{"$error":"#REF!"}},{"$f":"IF('Наш прайс'!#REF!=0,\"\",'Наш прайс'!#REF!)","v":{"$error":"#REF!"}},{"$f":"IF('Наш прайс'!#REF!=0,\"\",'Наш прайс'!#REF!)","v":{"$error":"#REF!"}},{"$f":"IF('Наш прайс'!#REF!=0,\"\",'Наш прайс'!#REF!)","v":{"$error":"#REF!"}},{"$f":"IF('Наш прайс'!#REF!=0,\"\",'Наш прайс'!#REF!)","v":{"$error":"#REF!"}},{"$f":"IF('Наш прайс'!J166=0,\"\",'Наш прайс'!J166)","v":""},{"$f":"IF('Наш прайс'!#REF!=0,\"\",'Наш прайс'!#REF!)","v":{"$error":"#REF!"}}]
[{"$f":"IF('Наш прайс'!B167=0,\"\",'Наш прайс'!B167)","v":""},{"$f":"IF('Наш прайс'!#REF!=0,\"\",'Наш прайс'!#REF!)","v":{"$error":"#REF!"}},{"$f":"IF('Наш прайс'!#REF!=0,\"\",'Наш прайс'!#REF!)","v":{"$error":"#REF!"}},"",null,null,{"$f":"IF('Наш прайс'!#REF!=0,\"\",'Наш прайс'!#REF!)","v":{"$error":"#REF!"}},{"$f":"IF('Наш прайс'!#REF!=0,\"\",'Наш прайс'!#REF!)","v":{"$error":"#REF!"}},{"$f":"IF('Наш прайс'!#REF!=0,\"\",'Наш прайс'!#REF!)","v":{"$error":"#REF!"}},{"$f":"IF('Наш прайс'!#REF!=0,\"\",'Наш прайс'!#REF!)","v":{"$error":"#REF!"}},{"$f":"IF('Наш прайс'!#REF!=0,\"\",'Наш прайс'!#REF!)","v":{"$error":"#REF!"}},{"$f":"IF('Наш прайс'!J167=0,\"\",'Наш прайс'!J167)","v":""},{"$f":"IF('Наш прайс'!#REF!=0,\"\",'Наш прайс'!#REF!)","v":{"$error":"#REF!"}}]
[{"$f":"IF('Наш прайс'!B168=0,\"\",'Наш прайс'!B168)","v":""},{"$f":"IF('Наш прайс'!#REF!=0,\"\",'Наш прайс'!#REF!)","v":{"$error":"#REF!"}},{"$f":"IF('Наш прайс'!#REF!=0,\"\",'Наш прайс'!#REF!)","v":{"$error":"#REF!"}},"",null,null,{"$f":"IF('Наш прайс'!#REF!=0,\"\",'Наш прайс'!#REF!)","v":{"$error":"#REF!"}},{"$f":"IF('Наш прайс'!#REF!=0,\"\",'Наш прайс'!#REF!)","v":{"$error":"#REF!"}},{"$f":"IF('Наш прайс'!#REF!=0,\"\",'Наш прайс'!#REF!)","v":{"$error":"#REF!"}},{"$f":"IF('Наш прайс'!#REF!=0,\"\",'Наш прайс'!#REF!)","v":{"$error":"#REF!"}},{"$f":"IF('Наш прайс'!#REF!=0,\"\",'Наш прайс'!#REF!)","v":{"$error":"#REF!"}},{"$f":"IF('Наш прайс'!J168=0,\"\",'Наш прайс'!J168)","v":""},{"$f":"IF('Наш прайс'!#REF!=0,\"\",'Наш прайс'!#REF!)","v":{"$error":"#REF!"}}]
[{"$f":"IF('Наш прайс'!B169=0,\"\",'Наш прайс'!B169)","v":""},{"$f":"IF('Наш прайс'!#REF!=0,\"\",'Наш прайс'!#REF!)","v":{"$error":"#REF!"}},{"$f":"IF('Наш прайс'!#REF!=0,\"\",'Наш прайс'!#REF!)","v":{"$error":"#REF!"}},"",null,null,{"$f":"IF('Наш прайс'!#REF!=0,\"\",'Наш прайс'!#REF!)","v":{"$error":"#REF!"}},{"$f":"IF('Наш прайс'!#REF!=0,\"\",'Наш прайс'!#REF!)","v":{"$error":"#REF!"}},{"$f":"IF('Наш прайс'!#REF!=0,\"\",'Наш прайс'!#REF!)","v":{"$error":"#REF!"}},{"$f":"IF('Наш прайс'!#REF!=0,\"\",'Наш прайс'!#REF!)","v":{"$error":"#REF!"}},{"$f":"IF('Наш прайс'!#REF!=0,\"\",'Наш прайс'!#REF!)","v":{"$error":"#REF!"}},{"$f":"IF('Наш прайс'!J169=0,\"\",'Наш прайс'!J169)","v":""},{"$f":"IF('Наш прайс'!#REF!=0,\"\",'Наш прайс'!#REF!)","v":{"$error":"#REF!"}}]
[{"$f":"IF('Наш прайс'!B170=0,\"\",'Наш прайс'!B170)","v":""},{"$f":"IF('Наш прайс'!#REF!=0,\"\",'Наш прайс'!#REF!)","v":{"$error":"#REF!"}},{"$f":"IF('Наш прайс'!#REF!=0,\"\",'Наш прайс'!#REF!)","v":{"$error":"#REF!"}},"",null,null,{"$f":"IF('Наш прайс'!#REF!=0,\"\",'Наш прайс'!#REF!)","v":{"$error":"#REF!"}},{"$f":"IF('Наш прайс'!#REF!=0,\"\",'Наш прайс'!#REF!)","v":{"$error":"#REF!"}},{"$f":"IF('Наш прайс'!#REF!=0,\"\",'Наш прайс'!#REF!)","v":{"$error":"#REF!"}},{"$f":"IF('Наш прайс'!#REF!=0,\"\",'Наш прайс'!#REF!)","v":{"$error":"#REF!"}},{"$f":"IF('Наш прайс'!#REF!=0,\"\",'Наш прайс'!#REF!)","v":{"$error":"#REF!"}},{"$f":"IF('Наш прайс'!J170=0,\"\",'Наш прайс'!J170)","v":""},{"$f":"IF('Наш прайс'!#REF!=0,\"\",'Наш прайс'!#REF!)","v":{"$error":"#REF!"}}]
[{"$f":"IF('Наш прайс'!B171=0,\"\",'Наш прайс'!B171)","v":""},{"$f":"IF('Наш прайс'!#REF!=0,\"\",'Наш прайс'!#REF!)","v":{"$error":"#REF!"}},{"$f":"IF('Наш прайс'!#REF!=0,\"\",'Наш прайс'!#REF!)","v":{"$error":"#REF!"}},"",null,null,{"$f":"IF('Наш прайс'!#REF!=0,\"\",'Наш прайс'!#REF!)","v":{"$error":"#REF!"}},{"$f":"IF('Наш прайс'!#REF!=0,\"\",'Наш прайс'!#REF!)","v":{"$error":"#REF!"}},{"$f":"IF('Наш прайс'!#REF!=0,\"\",'Наш прайс'!#REF!)","v":{"$error":"#REF!"}},{"$f":"IF('Наш прайс'!#REF!=0,\"\",'Наш прайс'!#REF!)","v":{"$error":"#REF!"}},{"$f":"IF('Наш прайс'!#REF!=0,\"\",'Наш прайс'!#REF!)","v":{"$error":"#REF!"}},{"$f":"IF('Наш прайс'!J171=0,\"\",'Наш прайс'!J171)","v":""},{"$f":"IF('Наш прайс'!#REF!=0,\"\",'Наш прайс'!#REF!)","v":{"$error":"#REF!"}}]
[{"$f":"IF('Наш прайс'!B172=0,\"\",'Наш прайс'!B172)","v":""},{"$f":"IF('Наш прайс'!#REF!=0,\"\",'Наш прайс'!#REF!)","v":{"$error":"#REF!"}},{"$f":"IF('Наш прайс'!#REF!=0,\"\",'Наш прайс'!#REF!)","v":{"$error":"#REF!"}},"",null,null,{"$f":"IF('Наш прайс'!#REF!=0,\"\",'Наш прайс'!#REF!)","v":{"$error":"#REF!"}},{"$f":"IF('Наш прайс'!#REF!=0,\"\",'Наш прайс'!#REF!)","v":{"$error":"#REF!"}},{"$f":"IF('Наш прайс'!#REF!=0,\"\",'Наш прайс'!#REF!)","v":{"$error":"#REF!"}},{"$f":"IF('Наш прайс'!#REF!=0,\"\",'Наш прайс'!#REF!)","v":{"$error":"#REF!"}},{"$f":"IF('Наш прайс'!#REF!=0,\"\",'Наш прайс'!#REF!)","v":{"$error":"#REF!"}},{"$f":"IF('Наш прайс'!J172=0,\"\",'Наш прайс'!J172)","v":""},{"$f":"IF('Наш прайс'!#REF!=0,\"\",'Наш прайс'!#REF!)","v":{"$error":"#REF!"}}]
[{"$f":"IF('Наш прайс'!B173=0,\"\",'Наш прайс'!B173)","v":""},{"$f":"IF('Наш прайс'!#REF!=0,\"\",'Наш прайс'!#REF!)","v":{"$error":"#REF!"}},{"$f":"IF('Наш прайс'!#REF!=0,\"\",'Наш прайс'!#REF!)","v":{"$error":"#REF!"}},{"$f":"L385","v":""},null,null,{"$f":"IF('Наш прайс'!#REF!=0,\"\",'Наш прайс'!#REF!)","v":{"$error":"#REF!"}},{"$f":"IF('Наш прайс'!#REF!=0,\"\",'Наш прайс'!#REF!)","v":{"$error":"#REF!"}},{"$f":"IF('Наш прайс'!#REF!=0,\"\",'Наш прайс'!#REF!)","v":{"$error":"#REF!"}},{"$f":"IF('Наш прайс'!#REF!=0,\"\",'Наш прайс'!#REF!)","v":{"$error":"#REF!"}},{"$f":"IF('Наш прайс'!#REF!=0,\"\",'Наш прайс'!#REF!)","v":{"$error":"#REF!"}},{"$f":"IF('Наш прайс'!J173=0,\"\",'Наш прайс'!J173)","v":""},{"$f":"IF('Наш прайс'!#REF!=0,\"\",'Наш прайс'!#REF!)","v":{"$error":"#REF!"}}]
[{"$f":"IF('Наш прайс'!B174=0,\"\",'Наш прайс'!B174)","v":""},{"$f":"IF('Наш прайс'!#REF!=0,\"\",'Наш прайс'!#REF!)","v":{"$error":"#REF!"}},{"$f":"IF('Наш прайс'!#REF!=0,\"\",'Наш прайс'!#REF!)","v":{"$error":"#REF!"}},"",null,null,{"$f":"IF('Наш прайс'!#REF!=0,\"\",'Наш прайс'!#REF!)","v":{"$error":"#REF!"}},{"$f":"IF('Наш прайс'!#REF!=0,\"\",'Наш прайс'!#REF!)","v":{"$error":"#REF!"}},{"$f":"IF('Наш прайс'!#REF!=0,\"\",'Наш прайс'!#REF!)","v":{"$error":"#REF!"}},{"$f":"IF('Наш прайс'!#REF!=0,\"\",'Наш прайс'!#REF!)","v":{"$error":"#REF!"}},{"$f":"IF('Наш прайс'!#REF!=0,\"\",'Наш прайс'!#REF!)","v":{"$error":"#REF!"}},{"$f":"IF('Наш прайс'!J174=0,\"\",'Наш прайс'!J174)","v":""},{"$f":"IF('Наш прайс'!#REF!=0,\"\",'Наш прайс'!#REF!)","v":{"$error":"#REF!"}}]
[{"$f":"IF('Наш прайс'!B175=0,\"\",'Наш прайс'!B175)","v":""},{"$f":"IF('Наш прайс'!#REF!=0,\"\",'Наш прайс'!#REF!)","v":{"$error":"#REF!"}},{"$f":"IF('Наш прайс'!#REF!=0,\"\",'Наш прайс'!#REF!)","v":{"$error":"#REF!"}},"",null,null,{"$f":"IF('Наш прайс'!#REF!=0,\"\",'Наш прайс'!#REF!)","v":{"$error":"#REF!"}},{"$f":"IF('Наш прайс'!#REF!=0,\"\",'Наш прайс'!#REF!)","v":{"$error":"#REF!"}},{"$f":"IF('Наш прайс'!#REF!=0,\"\",'Наш прайс'!#REF!)","v":{"$error":"#REF!"}},{"$f":"IF('Наш прайс'!#REF!=0,\"\",'Наш прайс'!#REF!)","v":{"$error":"#REF!"}},{"$f":"IF('Наш прайс'!#REF!=0,\"\",'Наш прайс'!#REF!)","v":{"$error":"#REF!"}},{"$f":"IF('Наш прайс'!J175=0,\"\",'Наш прайс'!J175)","v":""},{"$f":"IF('Наш прайс'!#REF!=0,\"\",'Наш прайс'!#REF!)","v":{"$error":"#REF!"}}]
[{"$f":"IF('Наш прайс'!B176=0,\"\",'Наш прайс'!B176)","v":""},{"$f":"IF('Наш прайс'!#REF!=0,\"\",'Наш прайс'!#REF!)","v":{"$error":"#REF!"}},{"$f":"IF('Наш прайс'!#REF!=0,\"\",'Наш прайс'!#REF!)","v":{"$error":"#REF!"}},"",null,null,{"$f":"IF('Наш прайс'!#REF!=0,\"\",'Наш прайс'!#REF!)","v":{"$error":"#REF!"}},{"$f":"IF('Наш прайс'!#REF!=0,\"\",'Наш прайс'!#REF!)","v":{"$error":"#REF!"}},{"$f":"IF('Наш прайс'!#REF!=0,\"\",'Наш прайс'!#REF!)","v":{"$error":"#REF!"}},{"$f":"IF('Наш прайс'!#REF!=0,\"\",'Наш прайс'!#REF!)","v":{"$error":"#REF!"}},{"$f":"IF('Наш прайс'!#REF!=0,\"\",'Наш прайс'!#REF!)","v":{"$error":"#REF!"}},{"$f":"IF('Наш прайс'!J176=0,\"\",'Наш прайс'!J176)","v":""},{"$f":"IF('Наш прайс'!#REF!=0,\"\",'Наш прайс'!#REF!)","v":{"$error":"#REF!"}}]
[{"$f":"IF('Наш прайс'!B177=0,\"\",'Наш прайс'!B177)","v":""},{"$f":"IF('Наш прайс'!#REF!=0,\"\",'Наш прайс'!#REF!)","v":{"$error":"#REF!"}},{"$f":"IF('Наш прайс'!#REF!=0,\"\",'Наш прайс'!#REF!)","v":{"$error":"#REF!"}},"",null,null,{"$f":"IF('Наш прайс'!#REF!=0,\"\",'Наш прайс'!#REF!)","v":{"$error":"#REF!"}},{"$f":"IF('Наш прайс'!#REF!=0,\"\",'Наш прайс'!#REF!)","v":{"$error":"#REF!"}},{"$f":"IF('Наш прайс'!#REF!=0,\"\",'Наш прайс'!#REF!)","v":{"$error":"#REF!"}},{"$f":"IF('Наш прайс'!#REF!=0,\"\",'Наш прайс'!#REF!)","v":{"$error":"#REF!"}},{"$f":"IF('Наш прайс'!#REF!=0,\"\",'Наш прайс'!#REF!)","v":{"$error":"#REF!"}},{"$f":"IF('Наш прайс'!J177=0,\"\",'Наш прайс'!J177)","v":""},{"$f":"IF('Наш прайс'!#REF!=0,\"\",'Наш прайс'!#REF!)","v":{"$error":"#REF!"}}]
[{"$f":"IF('Наш прайс'!B178=0,\"\",'Наш прайс'!B178)","v":""},{"$f":"IF('Наш прайс'!#REF!=0,\"\",'Наш прайс'!#REF!)","v":{"$error":"#REF!"}},{"$f":"IF('Наш прайс'!#REF!=0,\"\",'Наш прайс'!#REF!)","v":{"$error":"#REF!"}},"",null,null,{"$f":"IF('Наш прайс'!#REF!=0,\"\",'Наш прайс'!#REF!)","v":{"$error":"#REF!"}},{"$f":"IF('Наш прайс'!#REF!=0,\"\",'Наш прайс'!#REF!)","v":{"$error":"#REF!"}},{"$f":"IF('Наш прайс'!#REF!=0,\"\",'Наш прайс'!#REF!)","v":{"$error":"#REF!"}},{"$f":"IF('Наш прайс'!#REF!=0,\"\",'Наш прайс'!#REF!)","v":{"$error":"#REF!"}},{"$f":"IF('Наш прайс'!#REF!=0,\"\",'Наш прайс'!#REF!)","v":{"$error":"#REF!"}},{"$f":"IF('Наш прайс'!J178=0,\"\",'Наш прайс'!J178)","v":""},{"$f":"IF('Наш прайс'!#REF!=0,\"\",'Наш прайс'!#REF!)","v":{"$error":"#REF!"}}]
[{"$f":"IF('Наш прайс'!B179=0,\"\",'Наш прайс'!B179)","v":""},{"$f":"IF('Наш прайс'!#REF!=0,\"\",'Наш прайс'!#REF!)","v":{"$error":"#REF!"}},{"$f":"IF('Наш прайс'!#REF!=0,\"\",'Наш прайс'!#REF!)","v":{"$error":"#REF!"}},"",null,null,{"$f":"IF('Наш прайс'!#REF!=0,\"\",'Наш прайс'!#REF!)","v":{"$error":"#REF!"}},{"$f":"IF('Наш прайс'!#REF!=0,\"\",'Наш прайс'!#REF!)","v":{"$error":"#REF!"}},{"$f":"IF('Наш прайс'!#REF!=0,\"\",'Наш прайс'!#REF!)","v":{"$error":"#REF!"}},{"$f":"IF('Наш прайс'!#REF!=0,\"\",'Наш прайс'!#REF!)","v":{"$error":"#REF!"}},{"$f":"IF('Наш прайс'!#REF!=0,\"\",'Наш прайс'!#REF!)","v":{"$error":"#REF!"}},{"$f":"IF('Наш прайс'!J179=0,\"\",'Наш прайс'!J179)","v":""},{"$f":"IF('Наш прайс'!#REF!=0,\"\",'Наш прайс'!#REF!)","v":{"$error":"#REF!"}}]
[{"$f":"IF('Наш прайс'!B180=0,\"\",'Наш прайс'!B180)","v":""},{"$f":"IF('Наш прайс'!#REF!=0,\"\",'Наш прайс'!#REF!)","v":{"$error":"#REF!"}},{"$f":"IF('Наш прайс'!#REF!=0,\"\",'Наш прайс'!#REF!)","v":{"$error":"#REF!"}},"",null,null,{"$f":"IF('Наш прайс'!#REF!=0,\"\",'Наш прайс'!#REF!)","v":{"$error":"#REF!"}},{"$f":"IF('Наш прайс'!#REF!=0,\"\",'Наш прайс'!#REF!)","v":{"$error":"#REF!"}},{"$f":"IF('Наш прайс'!#REF!=0,\"\",'Наш прайс'!#REF!)","v":{"$error":"#REF!"}},{"$f":"IF('Наш прайс'!#REF!=0,\"\",'Наш прайс'!#REF!)","v":{"$error":"#REF!"}},{"$f":"IF('Наш прайс'!#REF!=0,\"\",'Наш прайс'!#REF!)","v":{"$error":"#REF!"}},{"$f":"IF('Наш прайс'!J180=0,\"\",'Наш прайс'!J180)","v":""},{"$f":"IF('Наш прайс'!#REF!=0,\"\",'Наш прайс'!#REF!)","v":{"$error":"#REF!"}}]
[{"$f":"IF('Наш прайс'!B181=0,\"\",'Наш прайс'!B181)","v":""},{"$f":"IF('Наш прайс'!#REF!=0,\"\",'Наш прайс'!#REF!)","v":{"$error":"#REF!"}},{"$f":"IF('Наш прайс'!#REF!=0,\"\",'Наш прайс'!#REF!)","v":{"$error":"#REF!"}},"",null,null,{"$f":"IF('Наш прайс'!#REF!=0,\"\",'Наш прайс'!#REF!)","v":{"$error":"#REF!"}},{"$f":"IF('Наш прайс'!#REF!=0,\"\",'Наш прайс'!#REF!)","v":{"$error":"#REF!"}},{"$f":"IF('Наш прайс'!#REF!=0,\"\",'Наш прайс'!#REF!)","v":{"$error":"#REF!"}},{"$f":"IF('Наш прайс'!#REF!=0,\"\",'Наш прайс'!#REF!)","v":{"$error":"#REF!"}},{"$f":"IF('Наш прайс'!#REF!=0,\"\",'Наш прайс'!#REF!)","v":{"$error":"#REF!"}},{"$f":"IF('Наш прайс'!J181=0,\"\",'Наш прайс'!J181)","v":""},{"$f":"IF('Наш прайс'!#REF!=0,\"\",'Наш прайс'!#REF!)","v":{"$error":"#REF!"}}]
[{"$f":"IF('Наш прайс'!B182=0,\"\",'Наш прайс'!B182)","v":""},{"$f":"IF('Наш прайс'!#REF!=0,\"\",'Наш прайс'!#REF!)","v":{"$error":"#REF!"}},{"$f":"IF('Наш прайс'!#REF!=0,\"\",'Наш прайс'!#REF!)","v":{"$error":"#REF!"}},"",null,null,{"$f":"IF('Наш прайс'!#REF!=0,\"\",'Наш прайс'!#REF!)","v":{"$error":"#REF!"}},{"$f":"IF('Наш прайс'!#REF!=0,\"\",'Наш прайс'!#REF!)","v":{"$error":"#REF!"}},{"$f":"IF('Наш прайс'!#REF!=0,\"\",'Наш прайс'!#REF!)","v":{"$error":"#REF!"}},{"$f":"IF('Наш прайс'!#REF!=0,\"\",'Наш прайс'!#REF!)","v":{"$error":"#REF!"}},{"$f":"IF('Наш прайс'!#REF!=0,\"\",'Наш прайс'!#REF!)","v":{"$error":"#REF!"}},{"$f":"IF('Наш прайс'!J182=0,\"\",'Наш прайс'!J182)","v":""},{"$f":"IF('Наш прайс'!#REF!=0,\"\",'Наш прайс'!#REF!)","v":{"$error":"#REF!"}}]
[{"$f":"IF('Наш прайс'!B183=0,\"\",'Наш прайс'!B183)","v":""},{"$f":"IF('Наш прайс'!#REF!=0,\"\",'Наш прайс'!#REF!)","v":{"$error":"#REF!"}},{"$f":"IF('Наш прайс'!#REF!=0,\"\",'Наш прайс'!#REF!)","v":{"$error":"#REF!"}},"",null,null,{"$f":"IF('Наш прайс'!#REF!=0,\"\",'Наш прайс'!#REF!)","v":{"$error":"#REF!"}},{"$f":"IF('Наш прайс'!#REF!=0,\"\",'Наш прайс'!#REF!)","v":{"$error":"#REF!"}},{"$f":"IF('Наш прайс'!#REF!=0,\"\",'Наш прайс'!#REF!)","v":{"$error":"#REF!"}},{"$f":"IF('Наш прайс'!#REF!=0,\"\",'Наш прайс'!#REF!)","v":{"$error":"#REF!"}},{"$f":"IF('Наш прайс'!#REF!=0,\"\",'Наш прайс'!#REF!)","v":{"$error":"#REF!"}},{"$f":"IF('Наш прайс'!J183=0,\"\",'Наш прайс'!J183)","v":""},{"$f":"IF('Наш прайс'!#REF!=0,\"\",'Наш прайс'!#REF!)","v":{"$error":"#REF!"}}]
[{"$f":"IF('Наш прайс'!B184=0,\"\",'Наш прайс'!B184)","v":""},{"$f":"IF('Наш прайс'!#REF!=0,\"\",'Наш прайс'!#REF!)","v":{"$error":"#REF!"}},{"$f":"IF('Наш прайс'!#REF!=0,\"\",'Наш прайс'!#REF!)","v":{"$error":"#REF!"}},"",null,null,{"$f":"IF('Наш прайс'!#REF!=0,\"\",'Наш прайс'!#REF!)","v":{"$error":"#REF!"}},{"$f":"IF('Наш прайс'!#REF!=0,\"\",'Наш прайс'!#REF!)","v":{"$error":"#REF!"}},{"$f":"IF('Наш прайс'!#REF!=0,\"\",'Наш прайс'!#REF!)","v":{"$error":"#REF!"}},{"$f":"IF('Наш прайс'!#REF!=0,\"\",'Наш прайс'!#REF!)","v":{"$error":"#REF!"}},{"$f":"IF('Наш прайс'!#REF!=0,\"\",'Наш прайс'!#REF!)","v":{"$error":"#REF!"}},{"$f":"IF('Наш прайс'!J184=0,\"\",'Наш прайс'!J184)","v":""},{"$f":"IF('Наш прайс'!#REF!=0,\"\",'Наш прайс'!#REF!)","v":{"$error":"#REF!"}}]
[{"$f":"IF('Наш прайс'!B185=0,\"\",'Наш прайс'!B185)","v":""},{"$f":"IF('Наш прайс'!#REF!=0,\"\",'Наш прайс'!#REF!)","v":{"$error":"#REF!"}},{"$f":"IF('Наш прайс'!#REF!=0,\"\",'Наш прайс'!#REF!)","v":{"$error":"#REF!"}},"",null,null,{"$f":"IF('Наш прайс'!#REF!=0,\"\",'Наш прайс'!#REF!)","v":{"$error":"#REF!"}},{"$f":"IF('Наш прайс'!#REF!=0,\"\",'Наш прайс'!#REF!)","v":{"$error":"#REF!"}},{"$f":"IF('Наш прайс'!#REF!=0,\"\",'Наш прайс'!#REF!)","v":{"$error":"#REF!"}},{"$f":"IF('Наш прайс'!#REF!=0,\"\",'Наш прайс'!#REF!)","v":{"$error":"#REF!"}},{"$f":"IF('Наш прайс'!#REF!=0,\"\",'Наш прайс'!#REF!)","v":{"$error":"#REF!"}},{"$f":"IF('Наш прайс'!J185=0,\"\",'Наш прайс'!J185)","v":""},{"$f":"IF('Наш прайс'!#REF!=0,\"\",'Наш прайс'!#REF!)","v":{"$error":"#REF!"}}]
[{"$f":"IF('Наш прайс'!B186=0,\"\",'Наш прайс'!B186)","v":""},{"$f":"IF('Наш прайс'!#REF!=0,\"\",'Наш прайс'!#REF!)","v":{"$error":"#REF!"}},{"$f":"IF('Наш прайс'!#REF!=0,\"\",'Наш прайс'!#REF!)","v":{"$error":"#REF!"}},"",null,null,{"$f":"IF('Наш прайс'!#REF!=0,\"\",'Наш прайс'!#REF!)","v":{"$error":"#REF!"}},{"$f":"IF('Наш прайс'!#REF!=0,\"\",'Наш прайс'!#REF!)","v":{"$error":"#REF!"}},{"$f":"IF('Наш прайс'!#REF!=0,\"\",'Наш прайс'!#REF!)","v":{"$error":"#REF!"}},{"$f":"IF('Наш прайс'!#REF!=0,\"\",'Наш прайс'!#REF!)","v":{"$error":"#REF!"}},{"$f":"IF('Наш прайс'!#REF!=0,\"\",'Наш прайс'!#REF!)","v":{"$error":"#REF!"}},{"$f":"IF('Наш прайс'!J186=0,\"\",'Наш прайс'!J186)","v":""},{"$f":"IF('Наш прайс'!#REF!=0,\"\",'Наш прайс'!#REF!)","v":{"$error":"#REF!"}}]
[{"$f":"IF('Наш прайс'!B187=0,\"\",'Наш прайс'!B187)","v":""},{"$f":"IF('Наш прайс'!#REF!=0,\"\",'Наш прайс'!#REF!)","v":{"$error":"#REF!"}},{"$f":"IF('Наш прайс'!#REF!=0,\"\",'Наш прайс'!#REF!)","v":{"$error":"#REF!"}},"",null,null,{"$f":"IF('Наш прайс'!#REF!=0,\"\",'Наш прайс'!#REF!)","v":{"$error":"#REF!"}},{"$f":"IF('Наш прайс'!#REF!=0,\"\",'Наш прайс'!#REF!)","v":{"$error":"#REF!"}},{"$f":"IF('Наш прайс'!#REF!=0,\"\",'Наш прайс'!#REF!)","v":{"$error":"#REF!"}},{"$f":"IF('Наш прайс'!#REF!=0,\"\",'Наш прайс'!#REF!)","v":{"$error":"#REF!"}},{"$f":"IF('Наш прайс'!#REF!=0,\"\",'Наш прайс'!#REF!)","v":{"$error":"#REF!"}},{"$f":"IF('Наш прайс'!J187=0,\"\",'Наш прайс'!J187)","v":""},{"$f":"IF('Наш прайс'!#REF!=0,\"\",'Наш прайс'!#REF!)","v":{"$error":"#REF!"}}]
[{"$f":"IF('Наш прайс'!B188=0,\"\",'Наш прайс'!B188)","v":""},{"$f":"IF('Наш прайс'!#REF!=0,\"\",'Наш прайс'!#REF!)","v":{"$error":"#REF!"}},{"$f":"IF('Наш прайс'!#REF!=0,\"\",'Наш прайс'!#REF!)","v":{"$error":"#REF!"}},"",null,null,{"$f":"IF('Наш прайс'!#REF!=0,\"\",'Наш прайс'!#REF!)","v":{"$error":"#REF!"}},{"$f":"IF('Наш прайс'!#REF!=0,\"\",'Наш прайс'!#REF!)","v":{"$error":"#REF!"}},{"$f":"IF('Наш прайс'!#REF!=0,\"\",'Наш прайс'!#REF!)","v":{"$error":"#REF!"}},{"$f":"IF('Наш прайс'!#REF!=0,\"\",'Наш прайс'!#REF!)","v":{"$error":"#REF!"}},{"$f":"IF('Наш прайс'!#REF!=0,\"\",'Наш прайс'!#REF!)","v":{"$error":"#REF!"}},{"$f":"IF('Наш прайс'!J188=0,\"\",'Наш прайс'!J188)","v":""},{"$f":"IF('Наш прайс'!#REF!=0,\"\",'Наш прайс'!#REF!)","v":{"$error":"#REF!"}}]
[{"$f":"IF('Наш прайс'!B189=0,\"\",'Наш прайс'!B189)","v":""},{"$f":"IF('Наш прайс'!#REF!=0,\"\",'Наш прайс'!#REF!)","v":{"$error":"#REF!"}},{"$f":"IF('Наш прайс'!#REF!=0,\"\",'Наш прайс'!#REF!)","v":{"$error":"#REF!"}},"",null,null,{"$f":"IF('Наш прайс'!#REF!=0,\"\",'Наш прайс'!#REF!)","v":{"$error":"#REF!"}},{"$f":"IF('Наш прайс'!#REF!=0,\"\",'Наш прайс'!#REF!)","v":{"$error":"#REF!"}},{"$f":"IF('Наш прайс'!#REF!=0,\"\",'Наш прайс'!#REF!)","v":{"$error":"#REF!"}},{"$f":"IF('Наш прайс'!#REF!=0,\"\",'Наш прайс'!#REF!)","v":{"$error":"#REF!"}},{"$f":"IF('Наш прайс'!#REF!=0,\"\",'Наш прайс'!#REF!)","v":{"$error":"#REF!"}},{"$f":"IF('Наш прайс'!J189=0,\"\",'Наш прайс'!J189)","v":""},{"$f":"IF('Наш прайс'!#REF!=0,\"\",'Наш прайс'!#REF!)","v":{"$error":"#REF!"}}]
[{"$f":"IF('Наш прайс'!B190=0,\"\",'Наш прайс'!B190)","v":""},{"$f":"IF('Наш прайс'!#REF!=0,\"\",'Наш прайс'!#REF!)","v":{"$error":"#REF!"}},{"$f":"IF('Наш прайс'!#REF!=0,\"\",'Наш прайс'!#REF!)","v":{"$error":"#REF!"}},"",null,null,{"$f":"IF('Наш прайс'!#REF!=0,\"\",'Наш прайс'!#REF!)","v":{"$error":"#REF!"}},{"$f":"IF('Наш прайс'!#REF!=0,\"\",'Наш прайс'!#REF!)","v":{"$error":"#REF!"}},{"$f":"IF('Наш прайс'!#REF!=0,\"\",'Наш прайс'!#REF!)","v":{"$error":"#REF!"}},{"$f":"IF('Наш прайс'!#REF!=0,\"\",'Наш прайс'!#REF!)","v":{"$error":"#REF!"}},{"$f":"IF('Наш прайс'!#REF!=0,\"\",'Наш прайс'!#REF!)","v":{"$error":"#REF!"}},{"$f":"IF('Наш прайс'!J190=0,\"\",'Наш прайс'!J190)","v":""},{"$f":"IF('Наш прайс'!#REF!=0,\"\",'Наш прайс'!#REF!)","v":{"$error":"#REF!"}}]
[{"$f":"IF('Наш прайс'!B191=0,\"\",'Наш прайс'!B191)","v":""},{"$f":"IF('Наш прайс'!#REF!=0,\"\",'Наш прайс'!#REF!)","v":{"$error":"#REF!"}},{"$f":"IF('Наш прайс'!#REF!=0,\"\",'Наш прайс'!#REF!)","v":{"$error":"#REF!"}},"",null,null,{"$f":"IF('Наш прайс'!#REF!=0,\"\",'Наш прайс'!#REF!)","v":{"$error":"#REF!"}},{"$f":"IF('Наш прайс'!#REF!=0,\"\",'Наш прайс'!#REF!)","v":{"$error":"#REF!"}},{"$f":"IF('Наш прайс'!#REF!=0,\"\",'Наш прайс'!#REF!)","v":{"$error":"#REF!"}},{"$f":"IF('Наш прайс'!#REF!=0,\"\",'Наш прайс'!#REF!)","v":{"$error":"#REF!"}},{"$f":"IF('Наш прайс'!#REF!=0,\"\",'Наш прайс'!#REF!)","v":{"$error":"#REF!"}},{"$f":"IF('Наш прайс'!J191=0,\"\",'Наш прайс'!J191)","v":""},{"$f":"IF('Наш прайс'!#REF!=0,\"\",'Наш прайс'!#REF!)","v":{"$error":"#REF!"}}]
[{"$f":"IF('Наш прайс'!B192=0,\"\",'Наш прайс'!B192)","v":""},{"$f":"IF('Наш прайс'!#REF!=0,\"\",'Наш прайс'!#REF!)","v":{"$error":"#REF!"}},{"$f":"IF('Наш прайс'!#REF!=0,\"\",'Наш прайс'!#REF!)","v":{"$error":"#REF!"}},"",null,null,{"$f":"IF('Наш прайс'!#REF!=0,\"\",'Наш прайс'!#REF!)","v":{"$error":"#REF!"}},{"$f":"IF('Наш прайс'!#REF!=0,\"\",'Наш прайс'!#REF!)","v":{"$error":"#REF!"}},{"$f":"IF('Наш прайс'!#REF!=0,\"\",'Наш прайс'!#REF!)","v":{"$error":"#REF!"}},{"$f":"IF('Наш прайс'!#REF!=0,\"\",'Наш прайс'!#REF!)","v":{"$error":"#REF!"}},{"$f":"IF('Наш прайс'!#REF!=0,\"\",'Наш прайс'!#REF!)","v":{"$error":"#REF!"}},{"$f":"IF('Наш прайс'!J192=0,\"\",'Наш прайс'!J192)","v":""},{"$f":"IF('Наш прайс'!#REF!=0,\"\",'Наш прайс'!#REF!)","v":{"$error":"#REF!"}}]
[{"$f":"IF('Наш прайс'!B193=0,\"\",'Наш прайс'!B193)","v":""},{"$f":"IF('Наш прайс'!#REF!=0,\"\",'Наш прайс'!#REF!)","v":{"$error":"#REF!"}},{"$f":"IF('Наш прайс'!#REF!=0,\"\",'Наш прайс'!#REF!)","v":{"$error":"#REF!"}},"",null,null,{"$f":"IF('Наш прайс'!#REF!=0,\"\",'Наш прайс'!#REF!)","v":{"$error":"#REF!"}},{"$f":"IF('Наш прайс'!#REF!=0,\"\",'Наш прайс'!#REF!)","v":{"$error":"#REF!"}},{"$f":"IF('Наш прайс'!#REF!=0,\"\",'Наш прайс'!#REF!)","v":{"$error":"#REF!"}},{"$f":"IF('Наш прайс'!#REF!=0,\"\",'Наш прайс'!#REF!)","v":{"$error":"#REF!"}},{"$f":"IF('Наш прайс'!#REF!=0,\"\",'Наш прайс'!#REF!)","v":{"$error":"#REF!"}},{"$f":"IF('Наш прайс'!J193=0,\"\",'Наш прайс'!J193)","v":""},{"$f":"IF('Наш прайс'!#REF!=0,\"\",'Наш прайс'!#REF!)","v":{"$error":"#REF!"}}]
[{"$f":"IF('Наш прайс'!B194=0,\"\",'Наш прайс'!B194)","v":""},{"$f":"IF('Наш прайс'!#REF!=0,\"\",'Наш прайс'!#REF!)","v":{"$error":"#REF!"}},{"$f":"IF('Наш прайс'!#REF!=0,\"\",'Наш прайс'!#REF!)","v":{"$error":"#REF!"}},"",null,null,{"$f":"IF('Наш прайс'!#REF!=0,\"\",'Наш прайс'!#REF!)","v":{"$error":"#REF!"}},{"$f":"IF('Наш прайс'!#REF!=0,\"\",'Наш прайс'!#REF!)","v":{"$error":"#REF!"}},{"$f":"IF('Наш прайс'!#REF!=0,\"\",'Наш прайс'!#REF!)","v":{"$error":"#REF!"}},{"$f":"IF('Наш прайс'!#REF!=0,\"\",'Наш прайс'!#REF!)","v":{"$error":"#REF!"}},{"$f":"IF('Наш прайс'!#REF!=0,\"\",'Наш прайс'!#REF!)","v":{"$error":"#REF!"}},{"$f":"IF('Наш прайс'!J194=0,\"\",'Наш прайс'!J194)","v":""},{"$f":"IF('Наш прайс'!#REF!=0,\"\",'Наш прайс'!#REF!)","v":{"$error":"#REF!"}}]
[{"$f":"IF('Наш прайс'!B195=0,\"\",'Наш прайс'!B195)","v":""},{"$f":"IF('Наш прайс'!#REF!=0,\"\",'Наш прайс'!#REF!)","v":{"$error":"#REF!"}},{"$f":"IF('Наш прайс'!#REF!=0,\"\",'Наш прайс'!#REF!)","v":{"$error":"#REF!"}},"",null,null,{"$f":"IF('Наш прайс'!#REF!=0,\"\",'Наш прайс'!#REF!)","v":{"$error":"#REF!"}},{"$f":"IF('Наш прайс'!#REF!=0,\"\",'Наш прайс'!#REF!)","v":{"$error":"#REF!"}},{"$f":"IF('Наш прайс'!#REF!=0,\"\",'Наш прайс'!#REF!)","v":{"$error":"#REF!"}},{"$f":"IF('Наш прайс'!#REF!=0,\"\",'Наш прайс'!#REF!)","v":{"$error":"#REF!"}},{"$f":"IF('Наш прайс'!#REF!=0,\"\",'Наш прайс'!#REF!)","v":{"$error":"#REF!"}},{"$f":"IF('Наш прайс'!J195=0,\"\",'Наш прайс'!J195)","v":""},{"$f":"IF('Наш прайс'!#REF!=0,\"\",'Наш прайс'!#REF!)","v":{"$error":"#REF!"}}]
[{"$f":"IF('Наш прайс'!B196=0,\"\",'Наш прайс'!B196)","v":""},{"$f":"IF('Наш прайс'!#REF!=0,\"\",'Наш прайс'!#REF!)","v":{"$error":"#REF!"}},{"$f":"IF('Наш прайс'!#REF!=0,\"\",'Наш прайс'!#REF!)","v":{"$error":"#REF!"}},"",null,null,{"$f":"IF('Наш прайс'!#REF!=0,\"\",'Наш прайс'!#REF!)","v":{"$error":"#REF!"}},{"$f":"IF('Наш прайс'!#REF!=0,\"\",'Наш прайс'!#REF!)","v":{"$error":"#REF!"}},{"$f":"IF('Наш прайс'!#REF!=0,\"\",'Наш прайс'!#REF!)","v":{"$error":"#REF!"}},{"$f":"IF('Наш прайс'!#REF!=0,\"\",'Наш прайс'!#REF!)","v":{"$error":"#REF!"}},{"$f":"IF('Наш прайс'!#REF!=0,\"\",'Наш прайс'!#REF!)","v":{"$error":"#REF!"}},{"$f":"IF('Наш прайс'!J196=0,\"\",'Наш прайс'!J196)","v":""},{"$f":"IF('Наш прайс'!#REF!=0,\"\",'Наш прайс'!#REF!)","v":{"$error":"#REF!"}}]
[{"$f":"IF('Наш прайс'!B197=0,\"\",'Наш прайс'!B197)","v":""},{"$f":"IF('Наш прайс'!#REF!=0,\"\",'Наш прайс'!#REF!)","v":{"$error":"#REF!"}},{"$f":"IF('Наш прайс'!#REF!=0,\"\",'Наш прайс'!#REF!)","v":{"$error":"#REF!"}},"",null,null,{"$f":"IF('Наш прайс'!#REF!=0,\"\",'Наш прайс'!#REF!)","v":{"$error":"#REF!"}},{"$f":"IF('Наш прайс'!#REF!=0,\"\",'Наш прайс'!#REF!)","v":{"$error":"#REF!"}},{"$f":"IF('Наш прайс'!#REF!=0,\"\",'Наш прайс'!#REF!)","v":{"$error":"#REF!"}},{"$f":"IF('Наш прайс'!#REF!=0,\"\",'Наш прайс'!#REF!)","v":{"$error":"#REF!"}},{"$f":"IF('Наш прайс'!#REF!=0,\"\",'Наш прайс'!#REF!)","v":{"$error":"#REF!"}},{"$f":"IF('Наш прайс'!J197=0,\"\",'Наш прайс'!J197)","v":""},{"$f":"IF('Наш прайс'!#REF!=0,\"\",'Наш прайс'!#REF!)","v":{"$error":"#REF!"}}]
[{"$f":"IF('Наш прайс'!B198=0,\"\",'Наш прайс'!B198)","v":""},{"$f":"IF('Наш прайс'!#REF!=0,\"\",'Наш прайс'!#REF!)","v":{"$error":"#REF!"}},{"$f":"IF('Наш прайс'!#REF!=0,\"\",'Наш прайс'!#REF!)","v":{"$error":"#REF!"}},"",null,null,{"$f":"IF('Наш прайс'!#REF!=0,\"\",'Наш прайс'!#REF!)","v":{"$error":"#REF!"}},{"$f":"IF('Наш прайс'!#REF!=0,\"\",'Наш прайс'!#REF!)","v":{"$error":"#REF!"}},{"$f":"IF('Наш прайс'!#REF!=0,\"\",'Наш прайс'!#REF!)","v":{"$error":"#REF!"}},{"$f":"IF('Наш прайс'!#REF!=0,\"\",'Наш прайс'!#REF!)","v":{"$error":"#REF!"}},{"$f":"IF('Наш прайс'!#REF!=0,\"\",'Наш прайс'!#REF!)","v":{"$error":"#REF!"}},{"$f":"IF('Наш прайс'!J198=0,\"\",'Наш прайс'!J198)","v":""},{"$f":"IF('Наш прайс'!#REF!=0,\"\",'Наш прайс'!#REF!)","v":{"$error":"#REF!"}}]
[{"$f":"IF('Наш прайс'!B199=0,\"\",'Наш прайс'!B199)","v":""},{"$f":"IF('Наш прайс'!#REF!=0,\"\",'Наш прайс'!#REF!)","v":{"$error":"#REF!"}},{"$f":"IF('Наш прайс'!#REF!=0,\"\",'Наш прайс'!#REF!)","v":{"$error":"#REF!"}},"",null,null,{"$f":"IF('Наш прайс'!#REF!=0,\"\",'Наш прайс'!#REF!)","v":{"$error":"#REF!"}},{"$f":"IF('Наш прайс'!#REF!=0,\"\",'Наш прайс'!#REF!)","v":{"$error":"#REF!"}},{"$f":"IF('Наш прайс'!#REF!=0,\"\",'Наш прайс'!#REF!)","v":{"$error":"#REF!"}},{"$f":"IF('Наш прайс'!#REF!=0,\"\",'Наш прайс'!#REF!)","v":{"$error":"#REF!"}},{"$f":"IF('Наш прайс'!#REF!=0,\"\",'Наш прайс'!#REF!)","v":{"$error":"#REF!"}},{"$f":"IF('Наш прайс'!J199=0,\"\",'Наш прайс'!J199)","v":""},{"$f":"IF('Наш прайс'!#REF!=0,\"\",'Наш прайс'!#REF!)","v":{"$error":"#REF!"}}]
[{"$f":"IF('Наш прайс'!B200=0,\"\",'Наш прайс'!B200)","v":""},{"$f":"IF('Наш прайс'!#REF!=0,\"\",'Наш прайс'!#REF!)","v":{"$error":"#REF!"}},{"$f":"IF('Наш прайс'!#REF!=0,\"\",'Наш прайс'!#REF!)","v":{"$error":"#REF!"}},"",null,null,{"$f":"IF('Наш прайс'!#REF!=0,\"\",'Наш прайс'!#REF!)","v":{"$error":"#REF!"}},{"$f":"IF('Наш прайс'!#REF!=0,\"\",'Наш прайс'!#REF!)","v":{"$error":"#REF!"}},{"$f":"IF('Наш прайс'!#REF!=0,\"\",'Наш прайс'!#REF!)","v":{"$error":"#REF!"}},{"$f":"IF('Наш прайс'!#REF!=0,\"\",'Наш прайс'!#REF!)","v":{"$error":"#REF!"}},{"$f":"IF('Наш прайс'!#REF!=0,\"\",'Наш прайс'!#REF!)","v":{"$error":"#REF!"}},{"$f":"IF('Наш прайс'!J200=0,\"\",'Наш прайс'!J200)","v":""},{"$f":"IF('Наш прайс'!#REF!=0,\"\",'Наш прайс'!#REF!)","v":{"$error":"#REF!"}}]
[{"$f":"IF('Наш прайс'!B201=0,\"\",'Наш прайс'!B201)","v":""},{"$f":"IF('Наш прайс'!#REF!=0,\"\",'Наш прайс'!#REF!)","v":{"$error":"#REF!"}},{"$f":"IF('Наш прайс'!#REF!=0,\"\",'Наш прайс'!#REF!)","v":{"$error":"#REF!"}},"",null,null,{"$f":"IF('Наш прайс'!#REF!=0,\"\",'Наш прайс'!#REF!)","v":{"$error":"#REF!"}},{"$f":"IF('Наш прайс'!#REF!=0,\"\",'Наш прайс'!#REF!)","v":{"$error":"#REF!"}},{"$f":"IF('Наш прайс'!#REF!=0,\"\",'Наш прайс'!#REF!)","v":{"$error":"#REF!"}},{"$f":"IF('Наш прайс'!#REF!=0,\"\",'Наш прайс'!#REF!)","v":{"$error":"#REF!"}},{"$f":"IF('Наш прайс'!#REF!=0,\"\",'Наш прайс'!#REF!)","v":{"$error":"#REF!"}},{"$f":"IF('Наш прайс'!J201=0,\"\",'Наш прайс'!J201)","v":""},{"$f":"IF('Наш прайс'!#REF!=0,\"\",'Наш прайс'!#REF!)","v":{"$error":"#REF!"}}]
[{"$f":"IF('Наш прайс'!B202=0,\"\",'Наш прайс'!B202)","v":""},{"$f":"IF('Наш прайс'!#REF!=0,\"\",'Наш прайс'!#REF!)","v":{"$error":"#REF!"}},{"$f":"IF('Наш прайс'!#REF!=0,\"\",'Наш прайс'!#REF!)","v":{"$error":"#REF!"}},"",null,null,{"$f":"IF('Наш прайс'!#REF!=0,\"\",'Наш прайс'!#REF!)","v":{"$error":"#REF!"}},{"$f":"IF('Наш прайс'!#REF!=0,\"\",'Наш прайс'!#REF!)","v":{"$error":"#REF!"}},{"$f":"IF('Наш прайс'!#REF!=0,\"\",'Наш прайс'!#REF!)","v":{"$error":"#REF!"}},{"$f":"IF('Наш прайс'!#REF!=0,\"\",'Наш прайс'!#REF!)","v":{"$error":"#REF!"}},{"$f":"IF('Наш прайс'!#REF!=0,\"\",'Наш прайс'!#REF!)","v":{"$error":"#REF!"}},{"$f":"IF('Наш прайс'!J202=0,\"\",'Наш прайс'!J202)","v":""},{"$f":"IF('Наш прайс'!#REF!=0,\"\",'Наш прайс'!#REF!)","v":{"$error":"#REF!"}}]
[{"$f":"IF('Наш прайс'!B203=0,\"\",'Наш прайс'!B203)","v":""},{"$f":"IF('Наш прайс'!#REF!=0,\"\",'Наш прайс'!#REF!)","v":{"$error":"#REF!"}},{"$f":"IF('Наш прайс'!#REF!=0,\"\",'Наш прайс'!#REF!)","v":{"$error":"#REF!"}},"",null,null,{"$f":"IF('Наш прайс'!#REF!=0,\"\",'Наш прайс'!#REF!)","v":{"$error":"#REF!"}},{"$f":"IF('Наш прайс'!#REF!=0,\"\",'Наш прайс'!#REF!)","v":{"$error":"#REF!"}},{"$f":"IF('Наш прайс'!#REF!=0,\"\",'Наш прайс'!#REF!)","v":{"$error":"#REF!"}},{"$f":"IF('Наш прайс'!#REF!=0,\"\",'Наш прайс'!#REF!)","v":{"$error":"#REF!"}},{"$f":"IF('Наш прайс'!#REF!=0,\"\",'Наш прайс'!#REF!)","v":{"$error":"#REF!"}},{"$f":"IF('Наш прайс'!J203=0,\"\",'Наш прайс'!J203)","v":""},{"$f":"IF('Наш прайс'!#REF!=0,\"\",'Наш прайс'!#REF!)","v":{"$error":"#REF!"}}]
[{"$f":"IF('Наш прайс'!B204=0,\"\",'Наш прайс'!B204)","v":""},{"$f":"IF('Наш прайс'!#REF!=0,\"\",'Наш прайс'!#REF!)","v":{"$error":"#REF!"}},{"$f":"IF('Наш прайс'!#REF!=0,\"\",'Наш прайс'!#REF!)","v":{"$error":"#REF!"}},"",null,null,{"$f":"IF('Наш прайс'!#REF!=0,\"\",'Наш прайс'!#REF!)","v":{"$error":"#REF!"}},{"$f":"IF('Наш прайс'!#REF!=0,\"\",'Наш прайс'!#REF!)","v":{"$error":"#REF!"}},{"$f":"IF('Наш прайс'!#REF!=0,\"\",'Наш прайс'!#REF!)","v":{"$error":"#REF!"}},{"$f":"IF('Наш прайс'!#REF!=0,\"\",'Наш прайс'!#REF!)","v":{"$error":"#REF!"}},{"$f":"IF('Наш прайс'!#REF!=0,\"\",'Наш прайс'!#REF!)","v":{"$error":"#REF!"}},{"$f":"IF('Наш прайс'!J204=0,\"\",'Наш прайс'!J204)","v":""},{"$f":"IF('Наш прайс'!#REF!=0,\"\",'Наш прайс'!#REF!)","v":{"$error":"#REF!"}}]
[{"$f":"IF('Наш прайс'!B205=0,\"\",'Наш прайс'!B205)","v":""},{"$f":"IF('Наш прайс'!#REF!=0,\"\",'Наш прайс'!#REF!)","v":{"$error":"#REF!"}},{"$f":"IF('Наш прайс'!#REF!=0,\"\",'Наш прайс'!#REF!)","v":{"$error":"#REF!"}},"",null,null,{"$f":"IF('Наш прайс'!#REF!=0,\"\",'Наш прайс'!#REF!)","v":{"$error":"#REF!"}},{"$f":"IF('Наш прайс'!#REF!=0,\"\",'Наш прайс'!#REF!)","v":{"$error":"#REF!"}},{"$f":"IF('Наш прайс'!#REF!=0,\"\",'Наш прайс'!#REF!)","v":{"$error":"#REF!"}},{"$f":"IF('Наш прайс'!#REF!=0,\"\",'Наш прайс'!#REF!)","v":{"$error":"#REF!"}},{"$f":"IF('Наш прайс'!#REF!=0,\"\",'Наш прайс'!#REF!)","v":{"$error":"#REF!"}},{"$f":"IF('Наш прайс'!J205=0,\"\",'Наш прайс'!J205)","v":""},{"$f":"IF('Наш прайс'!#REF!=0,\"\",'Наш прайс'!#REF!)","v":{"$error":"#REF!"}}]
[{"$f":"IF('Наш прайс'!B206=0,\"\",'Наш прайс'!B206)","v":""},{"$f":"IF('Наш прайс'!#REF!=0,\"\",'Наш прайс'!#REF!)","v":{"$error":"#REF!"}},{"$f":"IF('Наш прайс'!#REF!=0,\"\",'Наш прайс'!#REF!)","v":{"$error":"#REF!"}},"",null,null,{"$f":"IF('Наш прайс'!#REF!=0,\"\",'Наш прайс'!#REF!)","v":{"$error":"#REF!"}},{"$f":"IF('Наш прайс'!#REF!=0,\"\",'Наш прайс'!#REF!)","v":{"$error":"#REF!"}},{"$f":"IF('Наш прайс'!#REF!=0,\"\",'Наш прайс'!#REF!)","v":{"$error":"#REF!"}},{"$f":"IF('Наш прайс'!#REF!=0,\"\",'Наш прайс'!#REF!)","v":{"$error":"#REF!"}},{"$f":"IF('Наш прайс'!#REF!=0,\"\",'Наш прайс'!#REF!)","v":{"$error":"#REF!"}},{"$f":"IF('Наш прайс'!J206=0,\"\",'Наш прайс'!J206)","v":""},{"$f":"IF('Наш прайс'!#REF!=0,\"\",'Наш прайс'!#REF!)","v":{"$error":"#REF!"}}]
[{"$f":"IF('Наш прайс'!B207=0,\"\",'Наш прайс'!B207)","v":""},{"$f":"IF('Наш прайс'!#REF!=0,\"\",'Наш прайс'!#REF!)","v":{"$error":"#REF!"}},{"$f":"IF('Наш прайс'!#REF!=0,\"\",'Наш прайс'!#REF!)","v":{"$error":"#REF!"}},"",null,null,{"$f":"IF('Наш прайс'!#REF!=0,\"\",'Наш прайс'!#REF!)","v":{"$error":"#REF!"}},{"$f":"IF('Наш прайс'!#REF!=0,\"\",'Наш прайс'!#REF!)","v":{"$error":"#REF!"}},{"$f":"IF('Наш прайс'!#REF!=0,\"\",'Наш прайс'!#REF!)","v":{"$error":"#REF!"}},{"$f":"IF('Наш прайс'!#REF!=0,\"\",'Наш прайс'!#REF!)","v":{"$error":"#REF!"}},{"$f":"IF('Наш прайс'!#REF!=0,\"\",'Наш прайс'!#REF!)","v":{"$error":"#REF!"}},{"$f":"IF('Наш прайс'!J207=0,\"\",'Наш прайс'!J207)","v":""},{"$f":"IF('Наш прайс'!#REF!=0,\"\",'Наш прайс'!#REF!)","v":{"$error":"#REF!"}}]
[{"$f":"IF('Наш прайс'!B208=0,\"\",'Наш прайс'!B208)","v":""},{"$f":"IF('Наш прайс'!#REF!=0,\"\",'Наш прайс'!#REF!)","v":{"$error":"#REF!"}},{"$f":"IF('Наш прайс'!#REF!=0,\"\",'Наш прайс'!#REF!)","v":{"$error":"#REF!"}},"",null,null,{"$f":"IF('Наш прайс'!#REF!=0,\"\",'Наш прайс'!#REF!)","v":{"$error":"#REF!"}},{"$f":"IF('Наш прайс'!#REF!=0,\"\",'Наш прайс'!#REF!)","v":{"$error":"#REF!"}},{"$f":"IF('Наш прайс'!#REF!=0,\"\",'Наш прайс'!#REF!)","v":{"$error":"#REF!"}},{"$f":"IF('Наш прайс'!#REF!=0,\"\",'Наш прайс'!#REF!)","v":{"$error":"#REF!"}},{"$f":"IF('Наш прайс'!#REF!=0,\"\",'Наш прайс'!#REF!)","v":{"$error":"#REF!"}},{"$f":"IF('Наш прайс'!J208=0,\"\",'Наш прайс'!J208)","v":""},{"$f":"IF('Наш прайс'!#REF!=0,\"\",'Наш прайс'!#REF!)","v":{"$error":"#REF!"}}]
[{"$f":"IF('Наш прайс'!B209=0,\"\",'Наш прайс'!B209)","v":""},{"$f":"IF('Наш прайс'!#REF!=0,\"\",'Наш прайс'!#REF!)","v":{"$error":"#REF!"}},{"$f":"IF('Наш прайс'!#REF!=0,\"\",'Наш прайс'!#REF!)","v":{"$error":"#REF!"}},"",null,null,{"$f":"IF('Наш прайс'!#REF!=0,\"\",'Наш прайс'!#REF!)","v":{"$error":"#REF!"}},{"$f":"IF('Наш прайс'!#REF!=0,\"\",'Наш прайс'!#REF!)","v":{"$error":"#REF!"}},{"$f":"IF('Наш прайс'!#REF!=0,\"\",'Наш прайс'!#REF!)","v":{"$error":"#REF!"}},{"$f":"IF('Наш прайс'!#REF!=0,\"\",'Наш прайс'!#REF!)","v":{"$error":"#REF!"}},{"$f":"IF('Наш прайс'!#REF!=0,\"\",'Наш прайс'!#REF!)","v":{"$error":"#REF!"}},{"$f":"IF('Наш прайс'!J209=0,\"\",'Наш прайс'!J209)","v":""},{"$f":"IF('Наш прайс'!#REF!=0,\"\",'Наш прайс'!#REF!)","v":{"$error":"#REF!"}}]
[{"$f":"IF('Наш прайс'!B210=0,\"\",'Наш прайс'!B210)","v":""},{"$f":"IF('Наш прайс'!#REF!=0,\"\",'Наш прайс'!#REF!)","v":{"$error":"#REF!"}},{"$f":"IF('Наш прайс'!#REF!=0,\"\",'Наш прайс'!#REF!)","v":{"$error":"#REF!"}},"",null,null,{"$f":"IF('Наш прайс'!#REF!=0,\"\",'Наш прайс'!#REF!)","v":{"$error":"#REF!"}},{"$f":"IF('Наш прайс'!#REF!=0,\"\",'Наш прайс'!#REF!)","v":{"$error":"#REF!"}},{"$f":"IF('Наш прайс'!#REF!=0,\"\",'Наш прайс'!#REF!)","v":{"$error":"#REF!"}},{"$f":"IF('Наш прайс'!#REF!=0,\"\",'Наш прайс'!#REF!)","v":{"$error":"#REF!"}},{"$f":"IF('Наш прайс'!#REF!=0,\"\",'Наш прайс'!#REF!)","v":{"$error":"#REF!"}},{"$f":"IF('Наш прайс'!J210=0,\"\",'Наш прайс'!J210)","v":""},{"$f":"IF('Наш прайс'!#REF!=0,\"\",'Наш прайс'!#REF!)","v":{"$error":"#REF!"}}]
[{"$f":"IF('Наш прайс'!B211=0,\"\",'Наш прайс'!B211)","v":""},{"$f":"IF('Наш прайс'!#REF!=0,\"\",'Наш прайс'!#REF!)","v":{"$error":"#REF!"}},{"$f":"IF('Наш прайс'!#REF!=0,\"\",'Наш прайс'!#REF!)","v":{"$error":"#REF!"}},"",null,null,{"$f":"IF('Наш прайс'!#REF!=0,\"\",'Наш прайс'!#REF!)","v":{"$error":"#REF!"}},{"$f":"IF('Наш прайс'!#REF!=0,\"\",'Наш прайс'!#REF!)","v":{"$error":"#REF!"}},{"$f":"IF('Наш прайс'!#REF!=0,\"\",'Наш прайс'!#REF!)","v":{"$error":"#REF!"}},{"$f":"IF('Наш прайс'!#REF!=0,\"\",'Наш прайс'!#REF!)","v":{"$error":"#REF!"}},{"$f":"IF('Наш прайс'!#REF!=0,\"\",'Наш прайс'!#REF!)","v":{"$error":"#REF!"}},{"$f":"IF('Наш прайс'!J211=0,\"\",'Наш прайс'!J211)","v":""},{"$f":"IF('Наш прайс'!#REF!=0,\"\",'Наш прайс'!#REF!)","v":{"$error":"#REF!"}}]
[{"$f":"IF('Наш прайс'!B212=0,\"\",'Наш прайс'!B212)","v":""},{"$f":"IF('Наш прайс'!#REF!=0,\"\",'Наш прайс'!#REF!)","v":{"$error":"#REF!"}},{"$f":"IF('Наш прайс'!#REF!=0,\"\",'Наш прайс'!#REF!)","v":{"$error":"#REF!"}},"",null,null,{"$f":"IF('Наш прайс'!#REF!=0,\"\",'Наш прайс'!#REF!)","v":{"$error":"#REF!"}},{"$f":"IF('Наш прайс'!#REF!=0,\"\",'Наш прайс'!#REF!)","v":{"$error":"#REF!"}},{"$f":"IF('Наш прайс'!#REF!=0,\"\",'Наш прайс'!#REF!)","v":{"$error":"#REF!"}},{"$f":"IF('Наш прайс'!#REF!=0,\"\",'Наш прайс'!#REF!)","v":{"$error":"#REF!"}},{"$f":"IF('Наш прайс'!#REF!=0,\"\",'Наш прайс'!#REF!)","v":{"$error":"#REF!"}},{"$f":"IF('Наш прайс'!J212=0,\"\",'Наш прайс'!J212)","v":""},{"$f":"IF('Наш прайс'!#REF!=0,\"\",'Наш прайс'!#REF!)","v":{"$error":"#REF!"}}]
[{"$f":"IF('Наш прайс'!B213=0,\"\",'Наш прайс'!B213)","v":""},{"$f":"IF('Наш прайс'!#REF!=0,\"\",'Наш прайс'!#REF!)","v":{"$error":"#REF!"}},{"$f":"IF('Наш прайс'!#REF!=0,\"\",'Наш прайс'!#REF!)","v":{"$error":"#REF!"}},"",null,null,{"$f":"IF('Наш прайс'!#REF!=0,\"\",'Наш прайс'!#REF!)","v":{"$error":"#REF!"}},{"$f":"IF('Наш прайс'!#REF!=0,\"\",'Наш прайс'!#REF!)","v":{"$error":"#REF!"}},{"$f":"IF('Наш прайс'!#REF!=0,\"\",'Наш прайс'!#REF!)","v":{"$error":"#REF!"}},{"$f":"IF('Наш прайс'!#REF!=0,\"\",'Наш прайс'!#REF!)","v":{"$error":"#REF!"}},{"$f":"IF('Наш прайс'!#REF!=0,\"\",'Наш прайс'!#REF!)","v":{"$error":"#REF!"}},{"$f":"IF('Наш прайс'!J213=0,\"\",'Наш прайс'!J213)","v":""},{"$f":"IF('Наш прайс'!#REF!=0,\"\",'Наш прайс'!#REF!)","v":{"$error":"#REF!"}}]
[{"$f":"IF('Наш прайс'!B214=0,\"\",'Наш прайс'!B214)","v":""},{"$f":"IF('Наш прайс'!#REF!=0,\"\",'Наш прайс'!#REF!)","v":{"$error":"#REF!"}},{"$f":"IF('Наш прайс'!#REF!=0,\"\",'Наш прайс'!#REF!)","v":{"$error":"#REF!"}},"",null,null,{"$f":"IF('Наш прайс'!#REF!=0,\"\",'Наш прайс'!#REF!)","v":{"$error":"#REF!"}},{"$f":"IF('Наш прайс'!#REF!=0,\"\",'Наш прайс'!#REF!)","v":{"$error":"#REF!"}},{"$f":"IF('Наш прайс'!#REF!=0,\"\",'Наш прайс'!#REF!)","v":{"$error":"#REF!"}},{"$f":"IF('Наш прайс'!#REF!=0,\"\",'Наш прайс'!#REF!)","v":{"$error":"#REF!"}},{"$f":"IF('Наш прайс'!#REF!=0,\"\",'Наш прайс'!#REF!)","v":{"$error":"#REF!"}},{"$f":"IF('Наш прайс'!J214=0,\"\",'Наш прайс'!J214)","v":""},{"$f":"IF('Наш прайс'!#REF!=0,\"\",'Наш прайс'!#REF!)","v":{"$error":"#REF!"}}]
[{"$f":"IF('Наш прайс'!B215=0,\"\",'Наш прайс'!B215)","v":""},{"$f":"IF('Наш прайс'!#REF!=0,\"\",'Наш прайс'!#REF!)","v":{"$error":"#REF!"}},{"$f":"IF('Наш прайс'!#REF!=0,\"\",'Наш прайс'!#REF!)","v":{"$error":"#REF!"}},"",null,null,{"$f":"IF('Наш прайс'!#REF!=0,\"\",'Наш прайс'!#REF!)","v":{"$error":"#REF!"}},{"$f":"IF('Наш прайс'!#REF!=0,\"\",'Наш прайс'!#REF!)","v":{"$error":"#REF!"}},{"$f":"IF('Наш прайс'!#REF!=0,\"\",'Наш прайс'!#REF!)","v":{"$error":"#REF!"}},{"$f":"IF('Наш прайс'!#REF!=0,\"\",'Наш прайс'!#REF!)","v":{"$error":"#REF!"}},{"$f":"IF('Наш прайс'!#REF!=0,\"\",'Наш прайс'!#REF!)","v":{"$error":"#REF!"}},{"$f":"IF('Наш прайс'!J215=0,\"\",'Наш прайс'!J215)","v":""},{"$f":"IF('Наш прайс'!#REF!=0,\"\",'Наш прайс'!#REF!)","v":{"$error":"#REF!"}}]
[{"$f":"IF('Наш прайс'!B216=0,\"\",'Наш прайс'!B216)","v":""},{"$f":"IF('Наш прайс'!#REF!=0,\"\",'Наш прайс'!#REF!)","v":{"$error":"#REF!"}},{"$f":"IF('Наш прайс'!#REF!=0,\"\",'Наш прайс'!#REF!)","v":{"$error":"#REF!"}},"",null,null,{"$f":"IF('Наш прайс'!#REF!=0,\"\",'Наш прайс'!#REF!)","v":{"$error":"#REF!"}},{"$f":"IF('Наш прайс'!#REF!=0,\"\",'Наш прайс'!#REF!)","v":{"$error":"#REF!"}},{"$f":"IF('Наш прайс'!#REF!=0,\"\",'Наш прайс'!#REF!)","v":{"$error":"#REF!"}},{"$f":"IF('Наш прайс'!#REF!=0,\"\",'Наш прайс'!#REF!)","v":{"$error":"#REF!"}},{"$f":"IF('Наш прайс'!#REF!=0,\"\",'Наш прайс'!#REF!)","v":{"$error":"#REF!"}},{"$f":"IF('Наш прайс'!J216=0,\"\",'Наш прайс'!J216)","v":""},{"$f":"IF('Наш прайс'!#REF!=0,\"\",'Наш прайс'!#REF!)","v":{"$error":"#REF!"}}]
[{"$f":"IF('Наш прайс'!B217=0,\"\",'Наш прайс'!B217)","v":""},{"$f":"IF('Наш прайс'!#REF!=0,\"\",'Наш прайс'!#REF!)","v":{"$error":"#REF!"}},{"$f":"IF('Наш прайс'!#REF!=0,\"\",'Наш прайс'!#REF!)","v":{"$error":"#REF!"}},"",null,null,{"$f":"IF('Наш прайс'!#REF!=0,\"\",'Наш прайс'!#REF!)","v":{"$error":"#REF!"}},{"$f":"IF('Наш прайс'!#REF!=0,\"\",'Наш прайс'!#REF!)","v":{"$error":"#REF!"}},{"$f":"IF('Наш прайс'!#REF!=0,\"\",'Наш прайс'!#REF!)","v":{"$error":"#REF!"}},{"$f":"IF('Наш прайс'!#REF!=0,\"\",'Наш прайс'!#REF!)","v":{"$error":"#REF!"}},{"$f":"IF('Наш прайс'!#REF!=0,\"\",'Наш прайс'!#REF!)","v":{"$error":"#REF!"}},{"$f":"IF('Наш прайс'!J217=0,\"\",'Наш прайс'!J217)","v":""},{"$f":"IF('Наш прайс'!#REF!=0,\"\",'Наш прайс'!#REF!)","v":{"$error":"#REF!"}}]
[{"$f":"IF('Наш прайс'!B218=0,\"\",'Наш прайс'!B218)","v":""},{"$f":"IF('Наш прайс'!#REF!=0,\"\",'Наш прайс'!#REF!)","v":{"$error":"#REF!"}},{"$f":"IF('Наш прайс'!#REF!=0,\"\",'Наш прайс'!#REF!)","v":{"$error":"#REF!"}},"",null,null,{"$f":"IF('Наш прайс'!#REF!=0,\"\",'Наш прайс'!#REF!)","v":{"$error":"#REF!"}},{"$f":"IF('Наш прайс'!#REF!=0,\"\",'Наш прайс'!#REF!)","v":{"$error":"#REF!"}},{"$f":"IF('Наш прайс'!#REF!=0,\"\",'Наш прайс'!#REF!)","v":{"$error":"#REF!"}},{"$f":"IF('Наш прайс'!#REF!=0,\"\",'Наш прайс'!#REF!)","v":{"$error":"#REF!"}},{"$f":"IF('Наш прайс'!#REF!=0,\"\",'Наш прайс'!#REF!)","v":{"$error":"#REF!"}},{"$f":"IF('Наш прайс'!J218=0,\"\",'Наш прайс'!J218)","v":""},{"$f":"IF('Наш прайс'!#REF!=0,\"\",'Наш прайс'!#REF!)","v":{"$error":"#REF!"}}]
[{"$f":"IF('Наш прайс'!B219=0,\"\",'Наш прайс'!B219)","v":""},{"$f":"IF('Наш прайс'!#REF!=0,\"\",'Наш прайс'!#REF!)","v":{"$error":"#REF!"}},{"$f":"IF('Наш прайс'!#REF!=0,\"\",'Наш прайс'!#REF!)","v":{"$error":"#REF!"}},"",null,null,{"$f":"IF('Наш прайс'!#REF!=0,\"\",'Наш прайс'!#REF!)","v":{"$error":"#REF!"}},{"$f":"IF('Наш прайс'!#REF!=0,\"\",'Наш прайс'!#REF!)","v":{"$error":"#REF!"}},{"$f":"IF('Наш прайс'!#REF!=0,\"\",'Наш прайс'!#REF!)","v":{"$error":"#REF!"}},{"$f":"IF('Наш прайс'!#REF!=0,\"\",'Наш прайс'!#REF!)","v":{"$error":"#REF!"}},{"$f":"IF('Наш прайс'!#REF!=0,\"\",'Наш прайс'!#REF!)","v":{"$error":"#REF!"}},{"$f":"IF('Наш прайс'!J219=0,\"\",'Наш прайс'!J219)","v":""},{"$f":"IF('Наш прайс'!#REF!=0,\"\",'Наш прайс'!#REF!)","v":{"$error":"#REF!"}}]
[{"$f":"IF('Наш прайс'!B220=0,\"\",'Наш прайс'!B220)","v":""},{"$f":"IF('Наш прайс'!#REF!=0,\"\",'Наш прайс'!#REF!)","v":{"$error":"#REF!"}},{"$f":"IF('Наш прайс'!#REF!=0,\"\",'Наш прайс'!#REF!)","v":{"$error":"#REF!"}},"",null,null,{"$f":"IF('Наш прайс'!#REF!=0,\"\",'Наш прайс'!#REF!)","v":{"$error":"#REF!"}},{"$f":"IF('Наш прайс'!#REF!=0,\"\",'Наш прайс'!#REF!)","v":{"$error":"#REF!"}},{"$f":"IF('Наш прайс'!#REF!=0,\"\",'Наш прайс'!#REF!)","v":{"$error":"#REF!"}},{"$f":"IF('Наш прайс'!#REF!=0,\"\",'Наш прайс'!#REF!)","v":{"$error":"#REF!"}},{"$f":"IF('Наш прайс'!#REF!=0,\"\",'Наш прайс'!#REF!)","v":{"$error":"#REF!"}},{"$f":"IF('Наш прайс'!J220=0,\"\",'Наш прайс'!J220)","v":""},{"$f":"IF('Наш прайс'!#REF!=0,\"\",'Наш прайс'!#REF!)","v":{"$error":"#REF!"}}]
[{"$f":"IF('Наш прайс'!B221=0,\"\",'Наш прайс'!B221)","v":""},{"$f":"IF('Наш прайс'!#REF!=0,\"\",'Наш прайс'!#REF!)","v":{"$error":"#REF!"}},{"$f":"IF('Наш прайс'!#REF!=0,\"\",'Наш прайс'!#REF!)","v":{"$error":"#REF!"}},"",null,null,{"$f":"IF('Наш прайс'!#REF!=0,\"\",'Наш прайс'!#REF!)","v":{"$error":"#REF!"}},{"$f":"IF('Наш прайс'!#REF!=0,\"\",'Наш прайс'!#REF!)","v":{"$error":"#REF!"}},{"$f":"IF('Наш прайс'!#REF!=0,\"\",'Наш прайс'!#REF!)","v":{"$error":"#REF!"}},{"$f":"IF('Наш прайс'!#REF!=0,\"\",'Наш прайс'!#REF!)","v":{"$error":"#REF!"}},{"$f":"IF('Наш прайс'!#REF!=0,\"\",'Наш прайс'!#REF!)","v":{"$error":"#REF!"}},{"$f":"IF('Наш прайс'!J221=0,\"\",'Наш прайс'!J221)","v":""},{"$f":"IF('Наш прайс'!#REF!=0,\"\",'Наш прайс'!#REF!)","v":{"$error":"#REF!"}}]
[{"$f":"IF('Наш прайс'!B222=0,\"\",'Наш прайс'!B222)","v":""},{"$f":"IF('Наш прайс'!#REF!=0,\"\",'Наш прайс'!#REF!)","v":{"$error":"#REF!"}},{"$f":"IF('Наш прайс'!#REF!=0,\"\",'Наш прайс'!#REF!)","v":{"$error":"#REF!"}},"",null,null,{"$f":"IF('Наш прайс'!#REF!=0,\"\",'Наш прайс'!#REF!)","v":{"$error":"#REF!"}},{"$f":"IF('Наш прайс'!#REF!=0,\"\",'Наш прайс'!#REF!)","v":{"$error":"#REF!"}},{"$f":"IF('Наш прайс'!#REF!=0,\"\",'Наш прайс'!#REF!)","v":{"$error":"#REF!"}},{"$f":"IF('Наш прайс'!#REF!=0,\"\",'Наш прайс'!#REF!)","v":{"$error":"#REF!"}},{"$f":"IF('Наш прайс'!#REF!=0,\"\",'Наш прайс'!#REF!)","v":{"$error":"#REF!"}},{"$f":"IF('Наш прайс'!J222=0,\"\",'Наш прайс'!J222)","v":""},{"$f":"IF('Наш прайс'!#REF!=0,\"\",'Наш прайс'!#REF!)","v":{"$error":"#REF!"}}]
[{"$f":"IF('Наш прайс'!B223=0,\"\",'Наш прайс'!B223)","v":""},{"$f":"IF('Наш прайс'!#REF!=0,\"\",'Наш прайс'!#REF!)","v":{"$error":"#REF!"}},{"$f":"IF('Наш прайс'!#REF!=0,\"\",'Наш прайс'!#REF!)","v":{"$error":"#REF!"}},"",null,null,{"$f":"IF('Наш прайс'!#REF!=0,\"\",'Наш прайс'!#REF!)","v":{"$error":"#REF!"}},{"$f":"IF('Наш прайс'!#REF!=0,\"\",'Наш прайс'!#REF!)","v":{"$error":"#REF!"}},{"$f":"IF('Наш прайс'!#REF!=0,\"\",'Наш прайс'!#REF!)","v":{"$error":"#REF!"}},{"$f":"IF('Наш прайс'!#REF!=0,\"\",'Наш прайс'!#REF!)","v":{"$error":"#REF!"}},{"$f":"IF('Наш прайс'!#REF!=0,\"\",'Наш прайс'!#REF!)","v":{"$error":"#REF!"}},{"$f":"IF('Наш прайс'!J223=0,\"\",'Наш прайс'!J223)","v":""},{"$f":"IF('Наш прайс'!#REF!=0,\"\",'Наш прайс'!#REF!)","v":{"$error":"#REF!"}}]
[{"$f":"IF('Наш прайс'!B224=0,\"\",'Наш прайс'!B224)","v":""},{"$f":"IF('Наш прайс'!#REF!=0,\"\",'Наш прайс'!#REF!)","v":{"$error":"#REF!"}},{"$f":"IF('Наш прайс'!#REF!=0,\"\",'Наш прайс'!#REF!)","v":{"$error":"#REF!"}},"",null,null,{"$f":"IF('Наш прайс'!#REF!=0,\"\",'Наш прайс'!#REF!)","v":{"$error":"#REF!"}},{"$f":"IF('Наш прайс'!#REF!=0,\"\",'Наш прайс'!#REF!)","v":{"$error":"#REF!"}},{"$f":"IF('Наш прайс'!#REF!=0,\"\",'Наш прайс'!#REF!)","v":{"$error":"#REF!"}},{"$f":"IF('Наш прайс'!#REF!=0,\"\",'Наш прайс'!#REF!)","v":{"$error":"#REF!"}},{"$f":"IF('Наш прайс'!#REF!=0,\"\",'Наш прайс'!#REF!)","v":{"$error":"#REF!"}},{"$f":"IF('Наш прайс'!J224=0,\"\",'Наш прайс'!J224)","v":""},{"$f":"IF('Наш прайс'!#REF!=0,\"\",'Наш прайс'!#REF!)","v":{"$error":"#REF!"}}]
[{"$f":"IF('Наш прайс'!B225=0,\"\",'Наш прайс'!B225)","v":""},{"$f":"IF('Наш прайс'!#REF!=0,\"\",'Наш прайс'!#REF!)","v":{"$error":"#REF!"}},{"$f":"IF('Наш прайс'!#REF!=0,\"\",'Наш прайс'!#REF!)","v":{"$error":"#REF!"}},"",null,null,{"$f":"IF('Наш прайс'!#REF!=0,\"\",'Наш прайс'!#REF!)","v":{"$error":"#REF!"}},{"$f":"IF('Наш прайс'!#REF!=0,\"\",'Наш прайс'!#REF!)","v":{"$error":"#REF!"}},{"$f":"IF('Наш прайс'!#REF!=0,\"\",'Наш прайс'!#REF!)","v":{"$error":"#REF!"}},{"$f":"IF('Наш прайс'!#REF!=0,\"\",'Наш прайс'!#REF!)","v":{"$error":"#REF!"}},{"$f":"IF('Наш прайс'!#REF!=0,\"\",'Наш прайс'!#REF!)","v":{"$error":"#REF!"}},{"$f":"IF('Наш прайс'!J225=0,\"\",'Наш прайс'!J225)","v":""},{"$f":"IF('Наш прайс'!#REF!=0,\"\",'Наш прайс'!#REF!)","v":{"$error":"#REF!"}}]
[{"$f":"IF('Наш прайс'!B226=0,\"\",'Наш прайс'!B226)","v":""},{"$f":"IF('Наш прайс'!#REF!=0,\"\",'Наш прайс'!#REF!)","v":{"$error":"#REF!"}},{"$f":"IF('Наш прайс'!#REF!=0,\"\",'Наш прайс'!#REF!)","v":{"$error":"#REF!"}},"",null,null,{"$f":"IF('Наш прайс'!#REF!=0,\"\",'Наш прайс'!#REF!)","v":{"$error":"#REF!"}},{"$f":"IF('Наш прайс'!#REF!=0,\"\",'Наш прайс'!#REF!)","v":{"$error":"#REF!"}},{"$f":"IF('Наш прайс'!#REF!=0,\"\",'Наш прайс'!#REF!)","v":{"$error":"#REF!"}},{"$f":"IF('Наш прайс'!#REF!=0,\"\",'Наш прайс'!#REF!)","v":{"$error":"#REF!"}},{"$f":"IF('Наш прайс'!#REF!=0,\"\",'Наш прайс'!#REF!)","v":{"$error":"#REF!"}},{"$f":"IF('Наш прайс'!J226=0,\"\",'Наш прайс'!J226)","v":""},{"$f":"IF('Наш прайс'!#REF!=0,\"\",'Наш прайс'!#REF!)","v":{"$error":"#REF!"}}]
[{"$f":"IF('Наш прайс'!B227=0,\"\",'Наш прайс'!B227)","v":""},{"$f":"IF('Наш прайс'!#REF!=0,\"\",'Наш прайс'!#REF!)","v":{"$error":"#REF!"}},{"$f":"IF('Наш прайс'!#REF!=0,\"\",'Наш прайс'!#REF!)","v":{"$error":"#REF!"}},"",null,null,{"$f":"IF('Наш прайс'!#REF!=0,\"\",'Наш прайс'!#REF!)","v":{"$error":"#REF!"}},{"$f":"IF('Наш прайс'!#REF!=0,\"\",'Наш прайс'!#REF!)","v":{"$error":"#REF!"}},{"$f":"IF('Наш прайс'!#REF!=0,\"\",'Наш прайс'!#REF!)","v":{"$error":"#REF!"}},{"$f":"IF('Наш прайс'!#REF!=0,\"\",'Наш прайс'!#REF!)","v":{"$error":"#REF!"}},{"$f":"IF('Наш прайс'!#REF!=0,\"\",'Наш прайс'!#REF!)","v":{"$error":"#REF!"}},{"$f":"IF('Наш прайс'!J227=0,\"\",'Наш прайс'!J227)","v":""},{"$f":"IF('Наш прайс'!#REF!=0,\"\",'Наш прайс'!#REF!)","v":{"$error":"#REF!"}}]
[{"$f":"IF('Наш прайс'!B228=0,\"\",'Наш прайс'!B228)","v":""},{"$f":"IF('Наш прайс'!#REF!=0,\"\",'Наш прайс'!#REF!)","v":{"$error":"#REF!"}},{"$f":"IF('Наш прайс'!#REF!=0,\"\",'Наш прайс'!#REF!)","v":{"$error":"#REF!"}},"",null,null,{"$f":"IF('Наш прайс'!#REF!=0,\"\",'Наш прайс'!#REF!)","v":{"$error":"#REF!"}},{"$f":"IF('Наш прайс'!#REF!=0,\"\",'Наш прайс'!#REF!)","v":{"$error":"#REF!"}},{"$f":"IF('Наш прайс'!#REF!=0,\"\",'Наш прайс'!#REF!)","v":{"$error":"#REF!"}},{"$f":"IF('Наш прайс'!#REF!=0,\"\",'Наш прайс'!#REF!)","v":{"$error":"#REF!"}},{"$f":"IF('Наш прайс'!#REF!=0,\"\",'Наш прайс'!#REF!)","v":{"$error":"#REF!"}},{"$f":"IF('Наш прайс'!J228=0,\"\",'Наш прайс'!J228)","v":""},{"$f":"IF('Наш прайс'!#REF!=0,\"\",'Наш прайс'!#REF!)","v":{"$error":"#REF!"}}]
[{"$f":"IF('Наш прайс'!B229=0,\"\",'Наш прайс'!B229)","v":""},{"$f":"IF('Наш прайс'!#REF!=0,\"\",'Наш прайс'!#REF!)","v":{"$error":"#REF!"}},{"$f":"IF('Наш прайс'!#REF!=0,\"\",'Наш прайс'!#REF!)","v":{"$error":"#REF!"}},"",null,null,{"$f":"IF('Наш прайс'!#REF!=0,\"\",'Наш прайс'!#REF!)","v":{"$error":"#REF!"}},{"$f":"IF('Наш прайс'!#REF!=0,\"\",'Наш прайс'!#REF!)","v":{"$error":"#REF!"}},{"$f":"IF('Наш прайс'!#REF!=0,\"\",'Наш прайс'!#REF!)","v":{"$error":"#REF!"}},{"$f":"IF('Наш прайс'!#REF!=0,\"\",'Наш прайс'!#REF!)","v":{"$error":"#REF!"}},{"$f":"IF('Наш прайс'!#REF!=0,\"\",'Наш прайс'!#REF!)","v":{"$error":"#REF!"}},{"$f":"IF('Наш прайс'!J229=0,\"\",'Наш прайс'!J229)","v":""},{"$f":"IF('Наш прайс'!#REF!=0,\"\",'Наш прайс'!#REF!)","v":{"$error":"#REF!"}}]
[{"$f":"IF('Наш прайс'!B230=0,\"\",'Наш прайс'!B230)","v":""},{"$f":"IF('Наш прайс'!#REF!=0,\"\",'Наш прайс'!#REF!)","v":{"$error":"#REF!"}},{"$f":"IF('Наш прайс'!#REF!=0,\"\",'Наш прайс'!#REF!)","v":{"$error":"#REF!"}},"",null,null,{"$f":"IF('Наш прайс'!#REF!=0,\"\",'Наш прайс'!#REF!)","v":{"$error":"#REF!"}},{"$f":"IF('Наш прайс'!#REF!=0,\"\",'Наш прайс'!#REF!)","v":{"$error":"#REF!"}},{"$f":"IF('Наш прайс'!#REF!=0,\"\",'Наш прайс'!#REF!)","v":{"$error":"#REF!"}},{"$f":"IF('Наш прайс'!#REF!=0,\"\",'Наш прайс'!#REF!)","v":{"$error":"#REF!"}},{"$f":"IF('Наш прайс'!#REF!=0,\"\",'Наш прайс'!#REF!)","v":{"$error":"#REF!"}},{"$f":"IF('Наш прайс'!J230=0,\"\",'Наш прайс'!J230)","v":""},{"$f":"IF('Наш прайс'!#REF!=0,\"\",'Наш прайс'!#REF!)","v":{"$error":"#REF!"}}]
[{"$f":"IF('Наш прайс'!B231=0,\"\",'Наш прайс'!B231)","v":""},{"$f":"IF('Наш прайс'!#REF!=0,\"\",'Наш прайс'!#REF!)","v":{"$error":"#REF!"}},{"$f":"IF('Наш прайс'!#REF!=0,\"\",'Наш прайс'!#REF!)","v":{"$error":"#REF!"}},"",null,null,{"$f":"IF('Наш прайс'!#REF!=0,\"\",'Наш прайс'!#REF!)","v":{"$error":"#REF!"}},{"$f":"IF('Наш прайс'!#REF!=0,\"\",'Наш прайс'!#REF!)","v":{"$error":"#REF!"}},{"$f":"IF('Наш прайс'!#REF!=0,\"\",'Наш прайс'!#REF!)","v":{"$error":"#REF!"}},{"$f":"IF('Наш прайс'!#REF!=0,\"\",'Наш прайс'!#REF!)","v":{"$error":"#REF!"}},{"$f":"IF('Наш прайс'!#REF!=0,\"\",'Наш прайс'!#REF!)","v":{"$error":"#REF!"}},{"$f":"IF('Наш прайс'!J231=0,\"\",'Наш прайс'!J231)","v":""},{"$f":"IF('Наш прайс'!#REF!=0,\"\",'Наш прайс'!#REF!)","v":{"$error":"#REF!"}}]
[{"$f":"IF('Наш прайс'!B232=0,\"\",'Наш прайс'!B232)","v":""},{"$f":"IF('Наш прайс'!#REF!=0,\"\",'Наш прайс'!#REF!)","v":{"$error":"#REF!"}},{"$f":"IF('Наш прайс'!#REF!=0,\"\",'Наш прайс'!#REF!)","v":{"$error":"#REF!"}},"",null,null,{"$f":"IF('Наш прайс'!#REF!=0,\"\",'Наш прайс'!#REF!)","v":{"$error":"#REF!"}},{"$f":"IF('Наш прайс'!#REF!=0,\"\",'Наш прайс'!#REF!)","v":{"$error":"#REF!"}},{"$f":"IF('Наш прайс'!#REF!=0,\"\",'Наш прайс'!#REF!)","v":{"$error":"#REF!"}},{"$f":"IF('Наш прайс'!#REF!=0,\"\",'Наш прайс'!#REF!)","v":{"$error":"#REF!"}},{"$f":"IF('Наш прайс'!#REF!=0,\"\",'Наш прайс'!#REF!)","v":{"$error":"#REF!"}},{"$f":"IF('Наш прайс'!J232=0,\"\",'Наш прайс'!J232)","v":""},{"$f":"IF('Наш прайс'!#REF!=0,\"\",'Наш прайс'!#REF!)","v":{"$error":"#REF!"}}]
[{"$f":"IF('Наш прайс'!B233=0,\"\",'Наш прайс'!B233)","v":""},{"$f":"IF('Наш прайс'!#REF!=0,\"\",'Наш прайс'!#REF!)","v":{"$error":"#REF!"}},{"$f":"IF('Наш прайс'!#REF!=0,\"\",'Наш прайс'!#REF!)","v":{"$error":"#REF!"}},"",null,null,{"$f":"IF('Наш прайс'!#REF!=0,\"\",'Наш прайс'!#REF!)","v":{"$error":"#REF!"}},{"$f":"IF('Наш прайс'!#REF!=0,\"\",'Наш прайс'!#REF!)","v":{"$error":"#REF!"}},{"$f":"IF('Наш прайс'!#REF!=0,\"\",'Наш прайс'!#REF!)","v":{"$error":"#REF!"}},{"$f":"IF('Наш прайс'!#REF!=0,\"\",'Наш прайс'!#REF!)","v":{"$error":"#REF!"}},{"$f":"IF('Наш прайс'!#REF!=0,\"\",'Наш прайс'!#REF!)","v":{"$error":"#REF!"}},{"$f":"IF('Наш прайс'!J233=0,\"\",'Наш прайс'!J233)","v":""},{"$f":"IF('Наш прайс'!#REF!=0,\"\",'Наш прайс'!#REF!)","v":{"$error":"#REF!"}}]
[{"$f":"IF('Наш прайс'!B234=0,\"\",'Наш прайс'!B234)","v":""},{"$f":"IF('Наш прайс'!#REF!=0,\"\",'Наш прайс'!#REF!)","v":{"$error":"#REF!"}},{"$f":"IF('Наш прайс'!#REF!=0,\"\",'Наш прайс'!#REF!)","v":{"$error":"#REF!"}},"",null,null,{"$f":"IF('Наш прайс'!#REF!=0,\"\",'Наш прайс'!#REF!)","v":{"$error":"#REF!"}},{"$f":"IF('Наш прайс'!#REF!=0,\"\",'Наш прайс'!#REF!)","v":{"$error":"#REF!"}},{"$f":"IF('Наш прайс'!#REF!=0,\"\",'Наш прайс'!#REF!)","v":{"$error":"#REF!"}},{"$f":"IF('Наш прайс'!#REF!=0,\"\",'Наш прайс'!#REF!)","v":{"$error":"#REF!"}},{"$f":"IF('Наш прайс'!#REF!=0,\"\",'Наш прайс'!#REF!)","v":{"$error":"#REF!"}},{"$f":"IF('Наш прайс'!J234=0,\"\",'Наш прайс'!J234)","v":""},{"$f":"IF('Наш прайс'!#REF!=0,\"\",'Наш прайс'!#REF!)","v":{"$error":"#REF!"}}]
[{"$f":"IF('Наш прайс'!B235=0,\"\",'Наш прайс'!B235)","v":""},{"$f":"IF('Наш прайс'!#REF!=0,\"\",'Наш прайс'!#REF!)","v":{"$error":"#REF!"}},{"$f":"IF('Наш прайс'!#REF!=0,\"\",'Наш прайс'!#REF!)","v":{"$error":"#REF!"}},"",null,null,{"$f":"IF('Наш прайс'!#REF!=0,\"\",'Наш прайс'!#REF!)","v":{"$error":"#REF!"}},{"$f":"IF('Наш прайс'!#REF!=0,\"\",'Наш прайс'!#REF!)","v":{"$error":"#REF!"}},{"$f":"IF('Наш прайс'!#REF!=0,\"\",'Наш прайс'!#REF!)","v":{"$error":"#REF!"}},{"$f":"IF('Наш прайс'!#REF!=0,\"\",'Наш прайс'!#REF!)","v":{"$error":"#REF!"}},{"$f":"IF('Наш прайс'!#REF!=0,\"\",'Наш прайс'!#REF!)","v":{"$error":"#REF!"}},{"$f":"IF('Наш прайс'!J235=0,\"\",'Наш прайс'!J235)","v":""},{"$f":"IF('Наш прайс'!#REF!=0,\"\",'Наш прайс'!#REF!)","v":{"$error":"#REF!"}}]
[{"$f":"IF('Наш прайс'!B236=0,\"\",'Наш прайс'!B236)","v":""},{"$f":"IF('Наш прайс'!#REF!=0,\"\",'Наш прайс'!#REF!)","v":{"$error":"#REF!"}},{"$f":"IF('Наш прайс'!#REF!=0,\"\",'Наш прайс'!#REF!)","v":{"$error":"#REF!"}},"",null,null,{"$f":"IF('Наш прайс'!#REF!=0,\"\",'Наш прайс'!#REF!)","v":{"$error":"#REF!"}},{"$f":"IF('Наш прайс'!#REF!=0,\"\",'Наш прайс'!#REF!)","v":{"$error":"#REF!"}},{"$f":"IF('Наш прайс'!#REF!=0,\"\",'Наш прайс'!#REF!)","v":{"$error":"#REF!"}},{"$f":"IF('Наш прайс'!#REF!=0,\"\",'Наш прайс'!#REF!)","v":{"$error":"#REF!"}},{"$f":"IF('Наш прайс'!#REF!=0,\"\",'Наш прайс'!#REF!)","v":{"$error":"#REF!"}},{"$f":"IF('Наш прайс'!J236=0,\"\",'Наш прайс'!J236)","v":""},{"$f":"IF('Наш прайс'!#REF!=0,\"\",'Наш прайс'!#REF!)","v":{"$error":"#REF!"}}]
[{"$f":"IF('Наш прайс'!B237=0,\"\",'Наш прайс'!B237)","v":""},{"$f":"IF('Наш прайс'!#REF!=0,\"\",'Наш прайс'!#REF!)","v":{"$error":"#REF!"}},{"$f":"IF('Наш прайс'!#REF!=0,\"\",'Наш прайс'!#REF!)","v":{"$error":"#REF!"}},{"$f":"L449","v":""},null,null,{"$f":"IF('Наш прайс'!#REF!=0,\"\",'Наш прайс'!#REF!)","v":{"$error":"#REF!"}},{"$f":"IF('Наш прайс'!#REF!=0,\"\",'Наш прайс'!#REF!)","v":{"$error":"#REF!"}},{"$f":"IF('Наш прайс'!#REF!=0,\"\",'Наш прайс'!#REF!)","v":{"$error":"#REF!"}},{"$f":"IF('Наш прайс'!#REF!=0,\"\",'Наш прайс'!#REF!)","v":{"$error":"#REF!"}},{"$f":"IF('Наш прайс'!#REF!=0,\"\",'Наш прайс'!#REF!)","v":{"$error":"#REF!"}},{"$f":"IF('Наш прайс'!J237=0,\"\",'Наш прайс'!J237)","v":""},{"$f":"IF('Наш прайс'!#REF!=0,\"\",'Наш прайс'!#REF!)","v":{"$error":"#REF!"}}]
[{"$f":"IF('Наш прайс'!B238=0,\"\",'Наш прайс'!B238)","v":""},{"$f":"IF('Наш прайс'!#REF!=0,\"\",'Наш прайс'!#REF!)","v":{"$error":"#REF!"}},{"$f":"IF('Наш прайс'!#REF!=0,\"\",'Наш прайс'!#REF!)","v":{"$error":"#REF!"}},"",null,null,{"$f":"IF('Наш прайс'!#REF!=0,\"\",'Наш прайс'!#REF!)","v":{"$error":"#REF!"}},{"$f":"IF('Наш прайс'!#REF!=0,\"\",'Наш прайс'!#REF!)","v":{"$error":"#REF!"}},{"$f":"IF('Наш прайс'!#REF!=0,\"\",'Наш прайс'!#REF!)","v":{"$error":"#REF!"}},{"$f":"IF('Наш прайс'!#REF!=0,\"\",'Наш прайс'!#REF!)","v":{"$error":"#REF!"}},{"$f":"IF('Наш прайс'!#REF!=0,\"\",'Наш прайс'!#REF!)","v":{"$error":"#REF!"}},{"$f":"IF('Наш прайс'!J238=0,\"\",'Наш прайс'!J238)","v":""},{"$f":"IF('Наш прайс'!#REF!=0,\"\",'Наш прайс'!#REF!)","v":{"$error":"#REF!"}}]
[{"$f":"IF('Наш прайс'!B239=0,\"\",'Наш прайс'!B239)","v":""},{"$f":"IF('Наш прайс'!#REF!=0,\"\",'Наш прайс'!#REF!)","v":{"$error":"#REF!"}},{"$f":"IF('Наш прайс'!#REF!=0,\"\",'Наш прайс'!#REF!)","v":{"$error":"#REF!"}},"",null,null,{"$f":"IF('Наш прайс'!#REF!=0,\"\",'Наш прайс'!#REF!)","v":{"$error":"#REF!"}},{"$f":"IF('Наш прайс'!#REF!=0,\"\",'Наш прайс'!#REF!)","v":{"$error":"#REF!"}},{"$f":"IF('Наш прайс'!#REF!=0,\"\",'Наш прайс'!#REF!)","v":{"$error":"#REF!"}},{"$f":"IF('Наш прайс'!#REF!=0,\"\",'Наш прайс'!#REF!)","v":{"$error":"#REF!"}},{"$f":"IF('Наш прайс'!#REF!=0,\"\",'Наш прайс'!#REF!)","v":{"$error":"#REF!"}},{"$f":"IF('Наш прайс'!J239=0,\"\",'Наш прайс'!J239)","v":""},{"$f":"IF('Наш прайс'!#REF!=0,\"\",'Наш прайс'!#REF!)","v":{"$error":"#REF!"}}]
[{"$f":"IF('Наш прайс'!B240=0,\"\",'Наш прайс'!B240)","v":""},{"$f":"IF('Наш прайс'!#REF!=0,\"\",'Наш прайс'!#REF!)","v":{"$error":"#REF!"}},{"$f":"IF('Наш прайс'!#REF!=0,\"\",'Наш прайс'!#REF!)","v":{"$error":"#REF!"}},"",null,null,{"$f":"IF('Наш прайс'!#REF!=0,\"\",'Наш прайс'!#REF!)","v":{"$error":"#REF!"}},{"$f":"IF('Наш прайс'!#REF!=0,\"\",'Наш прайс'!#REF!)","v":{"$error":"#REF!"}},{"$f":"IF('Наш прайс'!#REF!=0,\"\",'Наш прайс'!#REF!)","v":{"$error":"#REF!"}},{"$f":"IF('Наш прайс'!#REF!=0,\"\",'Наш прайс'!#REF!)","v":{"$error":"#REF!"}},{"$f":"IF('Наш прайс'!#REF!=0,\"\",'Наш прайс'!#REF!)","v":{"$error":"#REF!"}},{"$f":"IF('Наш прайс'!J240=0,\"\",'Наш прайс'!J240)","v":""},{"$f":"IF('Наш прайс'!#REF!=0,\"\",'Наш прайс'!#REF!)","v":{"$error":"#REF!"}}]
[{"$f":"IF('Наш прайс'!B241=0,\"\",'Наш прайс'!B241)","v":""},{"$f":"IF('Наш прайс'!#REF!=0,\"\",'Наш прайс'!#REF!)","v":{"$error":"#REF!"}},{"$f":"IF('Наш прайс'!#REF!=0,\"\",'Наш прайс'!#REF!)","v":{"$error":"#REF!"}},"",null,null,{"$f":"IF('Наш прайс'!#REF!=0,\"\",'Наш прайс'!#REF!)","v":{"$error":"#REF!"}},{"$f":"IF('Наш прайс'!#REF!=0,\"\",'Наш прайс'!#REF!)","v":{"$error":"#REF!"}},{"$f":"IF('Наш прайс'!#REF!=0,\"\",'Наш прайс'!#REF!)","v":{"$error":"#REF!"}},{"$f":"IF('Наш прайс'!#REF!=0,\"\",'Наш прайс'!#REF!)","v":{"$error":"#REF!"}},{"$f":"IF('Наш прайс'!#REF!=0,\"\",'Наш прайс'!#REF!)","v":{"$error":"#REF!"}},{"$f":"IF('Наш прайс'!J241=0,\"\",'Наш прайс'!J241)","v":""},{"$f":"IF('Наш прайс'!#REF!=0,\"\",'Наш прайс'!#REF!)","v":{"$error":"#REF!"}}]
[{"$f":"IF('Наш прайс'!B242=0,\"\",'Наш прайс'!B242)","v":""},{"$f":"IF('Наш прайс'!#REF!=0,\"\",'Наш прайс'!#REF!)","v":{"$error":"#REF!"}},{"$f":"IF('Наш прайс'!#REF!=0,\"\",'Наш прайс'!#REF!)","v":{"$error":"#REF!"}},"",null,null,{"$f":"IF('Наш прайс'!#REF!=0,\"\",'Наш прайс'!#REF!)","v":{"$error":"#REF!"}},{"$f":"IF('Наш прайс'!#REF!=0,\"\",'Наш прайс'!#REF!)","v":{"$error":"#REF!"}},{"$f":"IF('Наш прайс'!#REF!=0,\"\",'Наш прайс'!#REF!)","v":{"$error":"#REF!"}},{"$f":"IF('Наш прайс'!#REF!=0,\"\",'Наш прайс'!#REF!)","v":{"$error":"#REF!"}},{"$f":"IF('Наш прайс'!#REF!=0,\"\",'Наш прайс'!#REF!)","v":{"$error":"#REF!"}},{"$f":"IF('Наш прайс'!J242=0,\"\",'Наш прайс'!J242)","v":""},{"$f":"IF('Наш прайс'!#REF!=0,\"\",'Наш прайс'!#REF!)","v":{"$error":"#REF!"}}]
[{"$f":"IF('Наш прайс'!B243=0,\"\",'Наш прайс'!B243)","v":""},{"$f":"IF('Наш прайс'!#REF!=0,\"\",'Наш прайс'!#REF!)","v":{"$error":"#REF!"}},{"$f":"IF('Наш прайс'!#REF!=0,\"\",'Наш прайс'!#REF!)","v":{"$error":"#REF!"}},"",null,null,{"$f":"IF('Наш прайс'!#REF!=0,\"\",'Наш прайс'!#REF!)","v":{"$error":"#REF!"}},{"$f":"IF('Наш прайс'!#REF!=0,\"\",'Наш прайс'!#REF!)","v":{"$error":"#REF!"}},{"$f":"IF('Наш прайс'!#REF!=0,\"\",'Наш прайс'!#REF!)","v":{"$error":"#REF!"}},{"$f":"IF('Наш прайс'!#REF!=0,\"\",'Наш прайс'!#REF!)","v":{"$error":"#REF!"}},{"$f":"IF('Наш прайс'!#REF!=0,\"\",'Наш прайс'!#REF!)","v":{"$error":"#REF!"}},{"$f":"IF('Наш прайс'!J243=0,\"\",'Наш прайс'!J243)","v":""},{"$f":"IF('Наш прайс'!#REF!=0,\"\",'Наш прайс'!#REF!)","v":{"$error":"#REF!"}}]
[{"$f":"IF('Наш прайс'!B244=0,\"\",'Наш прайс'!B244)","v":""},{"$f":"IF('Наш прайс'!#REF!=0,\"\",'Наш прайс'!#REF!)","v":{"$error":"#REF!"}},{"$f":"IF('Наш прайс'!#REF!=0,\"\",'Наш прайс'!#REF!)","v":{"$error":"#REF!"}},"",null,null,{"$f":"IF('Наш прайс'!#REF!=0,\"\",'Наш прайс'!#REF!)","v":{"$error":"#REF!"}},{"$f":"IF('Наш прайс'!#REF!=0,\"\",'Наш прайс'!#REF!)","v":{"$error":"#REF!"}},{"$f":"IF('Наш прайс'!#REF!=0,\"\",'Наш прайс'!#REF!)","v":{"$error":"#REF!"}},{"$f":"IF('Наш прайс'!#REF!=0,\"\",'Наш прайс'!#REF!)","v":{"$error":"#REF!"}},{"$f":"IF('Наш прайс'!#REF!=0,\"\",'Наш прайс'!#REF!)","v":{"$error":"#REF!"}},{"$f":"IF('Наш прайс'!J244=0,\"\",'Наш прайс'!J244)","v":""},{"$f":"IF('Наш прайс'!#REF!=0,\"\",'Наш прайс'!#REF!)","v":{"$error":"#REF!"}}]
[{"$f":"IF('Наш прайс'!B245=0,\"\",'Наш прайс'!B245)","v":""},{"$f":"IF('Наш прайс'!#REF!=0,\"\",'Наш прайс'!#REF!)","v":{"$error":"#REF!"}},{"$f":"IF('Наш прайс'!#REF!=0,\"\",'Наш прайс'!#REF!)","v":{"$error":"#REF!"}},"",null,null,{"$f":"IF('Наш прайс'!#REF!=0,\"\",'Наш прайс'!#REF!)","v":{"$error":"#REF!"}},{"$f":"IF('Наш прайс'!#REF!=0,\"\",'Наш прайс'!#REF!)","v":{"$error":"#REF!"}},{"$f":"IF('Наш прайс'!#REF!=0,\"\",'Наш прайс'!#REF!)","v":{"$error":"#REF!"}},{"$f":"IF('Наш прайс'!#REF!=0,\"\",'Наш прайс'!#REF!)","v":{"$error":"#REF!"}},{"$f":"IF('Наш прайс'!#REF!=0,\"\",'Наш прайс'!#REF!)","v":{"$error":"#REF!"}},{"$f":"IF('Наш прайс'!J245=0,\"\",'Наш прайс'!J245)","v":""},{"$f":"IF('Наш прайс'!#REF!=0,\"\",'Наш прайс'!#REF!)","v":{"$error":"#REF!"}}]
[{"$f":"IF('Наш прайс'!B246=0,\"\",'Наш прайс'!B246)","v":""},{"$f":"IF('Наш прайс'!#REF!=0,\"\",'Наш прайс'!#REF!)","v":{"$error":"#REF!"}},{"$f":"IF('Наш прайс'!#REF!=0,\"\",'Наш прайс'!#REF!)","v":{"$error":"#REF!"}},"",null,null,{"$f":"IF('Наш прайс'!#REF!=0,\"\",'Наш прайс'!#REF!)","v":{"$error":"#REF!"}},{"$f":"IF('Наш прайс'!#REF!=0,\"\",'Наш прайс'!#REF!)","v":{"$error":"#REF!"}},{"$f":"IF('Наш прайс'!#REF!=0,\"\",'Наш прайс'!#REF!)","v":{"$error":"#REF!"}},{"$f":"IF('Наш прайс'!#REF!=0,\"\",'Наш прайс'!#REF!)","v":{"$error":"#REF!"}},{"$f":"IF('Наш прайс'!#REF!=0,\"\",'Наш прайс'!#REF!)","v":{"$error":"#REF!"}},{"$f":"IF('Наш прайс'!J246=0,\"\",'Наш прайс'!J246)","v":""},{"$f":"IF('Наш прайс'!#REF!=0,\"\",'Наш прайс'!#REF!)","v":{"$error":"#REF!"}}]
[{"$f":"IF('Наш прайс'!B247=0,\"\",'Наш прайс'!B247)","v":""},{"$f":"IF('Наш прайс'!#REF!=0,\"\",'Наш прайс'!#REF!)","v":{"$error":"#REF!"}},{"$f":"IF('Наш прайс'!#REF!=0,\"\",'Наш прайс'!#REF!)","v":{"$error":"#REF!"}},"",null,null,{"$f":"IF('Наш прайс'!#REF!=0,\"\",'Наш прайс'!#REF!)","v":{"$error":"#REF!"}},{"$f":"IF('Наш прайс'!#REF!=0,\"\",'Наш прайс'!#REF!)","v":{"$error":"#REF!"}},{"$f":"IF('Наш прайс'!#REF!=0,\"\",'Наш прайс'!#REF!)","v":{"$error":"#REF!"}},{"$f":"IF('Наш прайс'!#REF!=0,\"\",'Наш прайс'!#REF!)","v":{"$error":"#REF!"}},{"$f":"IF('Наш прайс'!#REF!=0,\"\",'Наш прайс'!#REF!)","v":{"$error":"#REF!"}},{"$f":"IF('Наш прайс'!J247=0,\"\",'Наш прайс'!J247)","v":""},{"$f":"IF('Наш прайс'!#REF!=0,\"\",'Наш прайс'!#REF!)","v":{"$error":"#REF!"}}]
[{"$f":"IF('Наш прайс'!B248=0,\"\",'Наш прайс'!B248)","v":""},{"$f":"IF('Наш прайс'!#REF!=0,\"\",'Наш прайс'!#REF!)","v":{"$error":"#REF!"}},{"$f":"IF('Наш прайс'!#REF!=0,\"\",'Наш прайс'!#REF!)","v":{"$error":"#REF!"}},"",null,null,{"$f":"IF('Наш прайс'!#REF!=0,\"\",'Наш прайс'!#REF!)","v":{"$error":"#REF!"}},{"$f":"IF('Наш прайс'!#REF!=0,\"\",'Наш прайс'!#REF!)","v":{"$error":"#REF!"}},{"$f":"IF('Наш прайс'!#REF!=0,\"\",'Наш прайс'!#REF!)","v":{"$error":"#REF!"}},{"$f":"IF('Наш прайс'!#REF!=0,\"\",'Наш прайс'!#REF!)","v":{"$error":"#REF!"}},{"$f":"IF('Наш прайс'!#REF!=0,\"\",'Наш прайс'!#REF!)","v":{"$error":"#REF!"}},{"$f":"IF('Наш прайс'!J248=0,\"\",'Наш прайс'!J248)","v":""},{"$f":"IF('Наш прайс'!#REF!=0,\"\",'Наш прайс'!#REF!)","v":{"$error":"#REF!"}}]
[{"$f":"IF('Наш прайс'!B249=0,\"\",'Наш прайс'!B249)","v":""},{"$f":"IF('Наш прайс'!#REF!=0,\"\",'Наш прайс'!#REF!)","v":{"$error":"#REF!"}},{"$f":"IF('Наш прайс'!#REF!=0,\"\",'Наш прайс'!#REF!)","v":{"$error":"#REF!"}},"",null,null,{"$f":"IF('Наш прайс'!#REF!=0,\"\",'Наш прайс'!#REF!)","v":{"$error":"#REF!"}},{"$f":"IF('Наш прайс'!#REF!=0,\"\",'Наш прайс'!#REF!)","v":{"$error":"#REF!"}},{"$f":"IF('Наш прайс'!#REF!=0,\"\",'Наш прайс'!#REF!)","v":{"$error":"#REF!"}},{"$f":"IF('Наш прайс'!#REF!=0,\"\",'Наш прайс'!#REF!)","v":{"$error":"#REF!"}},{"$f":"IF('Наш прайс'!#REF!=0,\"\",'Наш прайс'!#REF!)","v":{"$error":"#REF!"}},{"$f":"IF('Наш прайс'!J249=0,\"\",'Наш прайс'!J249)","v":""},{"$f":"IF('Наш прайс'!#REF!=0,\"\",'Наш прайс'!#REF!)","v":{"$error":"#REF!"}}]
[{"$f":"IF('Наш прайс'!B250=0,\"\",'Наш прайс'!B250)","v":""},{"$f":"IF('Наш прайс'!#REF!=0,\"\",'Наш прайс'!#REF!)","v":{"$error":"#REF!"}},{"$f":"IF('Наш прайс'!#REF!=0,\"\",'Наш прайс'!#REF!)","v":{"$error":"#REF!"}},"",null,null,{"$f":"IF('Наш прайс'!#REF!=0,\"\",'Наш прайс'!#REF!)","v":{"$error":"#REF!"}},{"$f":"IF('Наш прайс'!#REF!=0,\"\",'Наш прайс'!#REF!)","v":{"$error":"#REF!"}},{"$f":"IF('Наш прайс'!#REF!=0,\"\",'Наш прайс'!#REF!)","v":{"$error":"#REF!"}},{"$f":"IF('Наш прайс'!#REF!=0,\"\",'Наш прайс'!#REF!)","v":{"$error":"#REF!"}},{"$f":"IF('Наш прайс'!#REF!=0,\"\",'Наш прайс'!#REF!)","v":{"$error":"#REF!"}},{"$f":"IF('Наш прайс'!J250=0,\"\",'Наш прайс'!J250)","v":""},{"$f":"IF('Наш прайс'!#REF!=0,\"\",'Наш прайс'!#REF!)","v":{"$error":"#REF!"}}]
[{"$f":"IF('Наш прайс'!B251=0,\"\",'Наш прайс'!B251)","v":""},{"$f":"IF('Наш прайс'!#REF!=0,\"\",'Наш прайс'!#REF!)","v":{"$error":"#REF!"}},{"$f":"IF('Наш прайс'!#REF!=0,\"\",'Наш прайс'!#REF!)","v":{"$error":"#REF!"}},"",null,null,{"$f":"IF('Наш прайс'!#REF!=0,\"\",'Наш прайс'!#REF!)","v":{"$error":"#REF!"}},{"$f":"IF('Наш прайс'!#REF!=0,\"\",'Наш прайс'!#REF!)","v":{"$error":"#REF!"}},{"$f":"IF('Наш прайс'!#REF!=0,\"\",'Наш прайс'!#REF!)","v":{"$error":"#REF!"}},{"$f":"IF('Наш прайс'!#REF!=0,\"\",'Наш прайс'!#REF!)","v":{"$error":"#REF!"}},{"$f":"IF('Наш прайс'!#REF!=0,\"\",'Наш прайс'!#REF!)","v":{"$error":"#REF!"}},{"$f":"IF('Наш прайс'!J251=0,\"\",'Наш прайс'!J251)","v":""},{"$f":"IF('Наш прайс'!#REF!=0,\"\",'Наш прайс'!#REF!)","v":{"$error":"#REF!"}}]
[{"$f":"IF('Наш прайс'!B252=0,\"\",'Наш прайс'!B252)","v":""},{"$f":"IF('Наш прайс'!#REF!=0,\"\",'Наш прайс'!#REF!)","v":{"$error":"#REF!"}},{"$f":"IF('Наш прайс'!#REF!=0,\"\",'Наш прайс'!#REF!)","v":{"$error":"#REF!"}},"",null,null,{"$f":"IF('Наш прайс'!#REF!=0,\"\",'Наш прайс'!#REF!)","v":{"$error":"#REF!"}},{"$f":"IF('Наш прайс'!#REF!=0,\"\",'Наш прайс'!#REF!)","v":{"$error":"#REF!"}},{"$f":"IF('Наш прайс'!#REF!=0,\"\",'Наш прайс'!#REF!)","v":{"$error":"#REF!"}},{"$f":"IF('Наш прайс'!#REF!=0,\"\",'Наш прайс'!#REF!)","v":{"$error":"#REF!"}},{"$f":"IF('Наш прайс'!#REF!=0,\"\",'Наш прайс'!#REF!)","v":{"$error":"#REF!"}},{"$f":"IF('Наш прайс'!J252=0,\"\",'Наш прайс'!J252)","v":""},{"$f":"IF('Наш прайс'!#REF!=0,\"\",'Наш прайс'!#REF!)","v":{"$error":"#REF!"}}]
[{"$f":"IF('Наш прайс'!B253=0,\"\",'Наш прайс'!B253)","v":""},{"$f":"IF('Наш прайс'!#REF!=0,\"\",'Наш прайс'!#REF!)","v":{"$error":"#REF!"}},{"$f":"IF('Наш прайс'!#REF!=0,\"\",'Наш прайс'!#REF!)","v":{"$error":"#REF!"}},"",null,null,{"$f":"IF('Наш прайс'!#REF!=0,\"\",'Наш прайс'!#REF!)","v":{"$error":"#REF!"}},{"$f":"IF('Наш прайс'!#REF!=0,\"\",'Наш прайс'!#REF!)","v":{"$error":"#REF!"}},{"$f":"IF('Наш прайс'!#REF!=0,\"\",'Наш прайс'!#REF!)","v":{"$error":"#REF!"}},{"$f":"IF('Наш прайс'!#REF!=0,\"\",'Наш прайс'!#REF!)","v":{"$error":"#REF!"}},{"$f":"IF('Наш прайс'!#REF!=0,\"\",'Наш прайс'!#REF!)","v":{"$error":"#REF!"}},{"$f":"IF('Наш прайс'!J253=0,\"\",'Наш прайс'!J253)","v":""},{"$f":"IF('Наш прайс'!#REF!=0,\"\",'Наш прайс'!#REF!)","v":{"$error":"#REF!"}}]
[{"$f":"IF('Наш прайс'!B254=0,\"\",'Наш прайс'!B254)","v":""},{"$f":"IF('Наш прайс'!#REF!=0,\"\",'Наш прайс'!#REF!)","v":{"$error":"#REF!"}},{"$f":"IF('Наш прайс'!#REF!=0,\"\",'Наш прайс'!#REF!)","v":{"$error":"#REF!"}},"",null,null,{"$f":"IF('Наш прайс'!#REF!=0,\"\",'Наш прайс'!#REF!)","v":{"$error":"#REF!"}},{"$f":"IF('Наш прайс'!#REF!=0,\"\",'Наш прайс'!#REF!)","v":{"$error":"#REF!"}},{"$f":"IF('Наш прайс'!#REF!=0,\"\",'Наш прайс'!#REF!)","v":{"$error":"#REF!"}},{"$f":"IF('Наш прайс'!#REF!=0,\"\",'Наш прайс'!#REF!)","v":{"$error":"#REF!"}},{"$f":"IF('Наш прайс'!#REF!=0,\"\",'Наш прайс'!#REF!)","v":{"$error":"#REF!"}},{"$f":"IF('Наш прайс'!J254=0,\"\",'Наш прайс'!J254)","v":""},{"$f":"IF('Наш прайс'!#REF!=0,\"\",'Наш прайс'!#REF!)","v":{"$error":"#REF!"}}]
[{"$f":"IF('Наш прайс'!B255=0,\"\",'Наш прайс'!B255)","v":""},{"$f":"IF('Наш прайс'!#REF!=0,\"\",'Наш прайс'!#REF!)","v":{"$error":"#REF!"}},{"$f":"IF('Наш прайс'!#REF!=0,\"\",'Наш прайс'!#REF!)","v":{"$error":"#REF!"}},"",null,null,{"$f":"IF('Наш прайс'!#REF!=0,\"\",'Наш прайс'!#REF!)","v":{"$error":"#REF!"}},{"$f":"IF('Наш прайс'!#REF!=0,\"\",'Наш прайс'!#REF!)","v":{"$error":"#REF!"}},{"$f":"IF('Наш прайс'!#REF!=0,\"\",'Наш прайс'!#REF!)","v":{"$error":"#REF!"}},{"$f":"IF('Наш прайс'!#REF!=0,\"\",'Наш прайс'!#REF!)","v":{"$error":"#REF!"}},{"$f":"IF('Наш прайс'!#REF!=0,\"\",'Наш прайс'!#REF!)","v":{"$error":"#REF!"}},{"$f":"IF('Наш прайс'!J255=0,\"\",'Наш прайс'!J255)","v":""},{"$f":"IF('Наш прайс'!#REF!=0,\"\",'Наш прайс'!#REF!)","v":{"$error":"#REF!"}}]
[{"$f":"IF('Наш прайс'!B256=0,\"\",'Наш прайс'!B256)","v":""},{"$f":"IF('Наш прайс'!#REF!=0,\"\",'Наш прайс'!#REF!)","v":{"$error":"#REF!"}},{"$f":"IF('Наш прайс'!#REF!=0,\"\",'Наш прайс'!#REF!)","v":{"$error":"#REF!"}},"",null,null,{"$f":"IF('Наш прайс'!#REF!=0,\"\",'Наш прайс'!#REF!)","v":{"$error":"#REF!"}},{"$f":"IF('Наш прайс'!#REF!=0,\"\",'Наш прайс'!#REF!)","v":{"$error":"#REF!"}},{"$f":"IF('Наш прайс'!#REF!=0,\"\",'Наш прайс'!#REF!)","v":{"$error":"#REF!"}},{"$f":"IF('Наш прайс'!#REF!=0,\"\",'Наш прайс'!#REF!)","v":{"$error":"#REF!"}},{"$f":"IF('Наш прайс'!#REF!=0,\"\",'Наш прайс'!#REF!)","v":{"$error":"#REF!"}},{"$f":"IF('Наш прайс'!J256=0,\"\",'Наш прайс'!J256)","v":""},{"$f":"IF('Наш прайс'!#REF!=0,\"\",'Наш прайс'!#REF!)","v":{"$error":"#REF!"}}]
[{"$f":"IF('Наш прайс'!B257=0,\"\",'Наш прайс'!B257)","v":""},{"$f":"IF('Наш прайс'!#REF!=0,\"\",'Наш прайс'!#REF!)","v":{"$error":"#REF!"}},{"$f":"IF('Наш прайс'!#REF!=0,\"\",'Наш прайс'!#REF!)","v":{"$error":"#REF!"}},"",null,null,{"$f":"IF('Наш прайс'!#REF!=0,\"\",'Наш прайс'!#REF!)","v":{"$error":"#REF!"}},{"$f":"IF('Наш прайс'!#REF!=0,\"\",'Наш прайс'!#REF!)","v":{"$error":"#REF!"}},{"$f":"IF('Наш прайс'!#REF!=0,\"\",'Наш прайс'!#REF!)","v":{"$error":"#REF!"}},{"$f":"IF('Наш прайс'!#REF!=0,\"\",'Наш прайс'!#REF!)","v":{"$error":"#REF!"}},{"$f":"IF('Наш прайс'!#REF!=0,\"\",'Наш прайс'!#REF!)","v":{"$error":"#REF!"}},{"$f":"IF('Наш прайс'!J257=0,\"\",'Наш прайс'!J257)","v":""},{"$f":"IF('Наш прайс'!#REF!=0,\"\",'Наш прайс'!#REF!)","v":{"$error":"#REF!"}}]
[{"$f":"IF('Наш прайс'!B258=0,\"\",'Наш прайс'!B258)","v":""},{"$f":"IF('Наш прайс'!#REF!=0,\"\",'Наш прайс'!#REF!)","v":{"$error":"#REF!"}},{"$f":"IF('Наш прайс'!#REF!=0,\"\",'Наш прайс'!#REF!)","v":{"$error":"#REF!"}},"",null,null,{"$f":"IF('Наш прайс'!#REF!=0,\"\",'Наш прайс'!#REF!)","v":{"$error":"#REF!"}},{"$f":"IF('Наш прайс'!#REF!=0,\"\",'Наш прайс'!#REF!)","v":{"$error":"#REF!"}},{"$f":"IF('Наш прайс'!#REF!=0,\"\",'Наш прайс'!#REF!)","v":{"$error":"#REF!"}},{"$f":"IF('Наш прайс'!#REF!=0,\"\",'Наш прайс'!#REF!)","v":{"$error":"#REF!"}},{"$f":"IF('Наш прайс'!#REF!=0,\"\",'Наш прайс'!#REF!)","v":{"$error":"#REF!"}},{"$f":"IF('Наш прайс'!J258=0,\"\",'Наш прайс'!J258)","v":""},{"$f":"IF('Наш прайс'!#REF!=0,\"\",'Наш прайс'!#REF!)","v":{"$error":"#REF!"}}]
[{"$f":"IF('Наш прайс'!B259=0,\"\",'Наш прайс'!B259)","v":""},{"$f":"IF('Наш прайс'!#REF!=0,\"\",'Наш прайс'!#REF!)","v":{"$error":"#REF!"}},{"$f":"IF('Наш прайс'!#REF!=0,\"\",'Наш прайс'!#REF!)","v":{"$error":"#REF!"}},"",null,null,{"$f":"IF('Наш прайс'!#REF!=0,\"\",'Наш прайс'!#REF!)","v":{"$error":"#REF!"}},{"$f":"IF('Наш прайс'!#REF!=0,\"\",'Наш прайс'!#REF!)","v":{"$error":"#REF!"}},{"$f":"IF('Наш прайс'!#REF!=0,\"\",'Наш прайс'!#REF!)","v":{"$error":"#REF!"}},{"$f":"IF('Наш прайс'!#REF!=0,\"\",'Наш прайс'!#REF!)","v":{"$error":"#REF!"}},{"$f":"IF('Наш прайс'!#REF!=0,\"\",'Наш прайс'!#REF!)","v":{"$error":"#REF!"}},{"$f":"IF('Наш прайс'!J259=0,\"\",'Наш прайс'!J259)","v":""},{"$f":"IF('Наш прайс'!#REF!=0,\"\",'Наш прайс'!#REF!)","v":{"$error":"#REF!"}}]
[{"$f":"IF('Наш прайс'!B260=0,\"\",'Наш прайс'!B260)","v":""},{"$f":"IF('Наш прайс'!#REF!=0,\"\",'Наш прайс'!#REF!)","v":{"$error":"#REF!"}},{"$f":"IF('Наш прайс'!#REF!=0,\"\",'Наш прайс'!#REF!)","v":{"$error":"#REF!"}},"",null,null,{"$f":"IF('Наш прайс'!#REF!=0,\"\",'Наш прайс'!#REF!)","v":{"$error":"#REF!"}},{"$f":"IF('Наш прайс'!#REF!=0,\"\",'Наш прайс'!#REF!)","v":{"$error":"#REF!"}},{"$f":"IF('Наш прайс'!#REF!=0,\"\",'Наш прайс'!#REF!)","v":{"$error":"#REF!"}},{"$f":"IF('Наш прайс'!#REF!=0,\"\",'Наш прайс'!#REF!)","v":{"$error":"#REF!"}},{"$f":"IF('Наш прайс'!#REF!=0,\"\",'Наш прайс'!#REF!)","v":{"$error":"#REF!"}},{"$f":"IF('Наш прайс'!J260=0,\"\",'Наш прайс'!J260)","v":""},{"$f":"IF('Наш прайс'!#REF!=0,\"\",'Наш прайс'!#REF!)","v":{"$error":"#REF!"}}]
[{"$f":"IF('Наш прайс'!B261=0,\"\",'Наш прайс'!B261)","v":""},{"$f":"IF('Наш прайс'!#REF!=0,\"\",'Наш прайс'!#REF!)","v":{"$error":"#REF!"}},{"$f":"IF('Наш прайс'!#REF!=0,\"\",'Наш прайс'!#REF!)","v":{"$error":"#REF!"}},"",null,null,{"$f":"IF('Наш прайс'!#REF!=0,\"\",'Наш прайс'!#REF!)","v":{"$error":"#REF!"}},{"$f":"IF('Наш прайс'!#REF!=0,\"\",'Наш прайс'!#REF!)","v":{"$error":"#REF!"}},{"$f":"IF('Наш прайс'!#REF!=0,\"\",'Наш прайс'!#REF!)","v":{"$error":"#REF!"}},{"$f":"IF('Наш прайс'!#REF!=0,\"\",'Наш прайс'!#REF!)","v":{"$error":"#REF!"}},{"$f":"IF('Наш прайс'!#REF!=0,\"\",'Наш прайс'!#REF!)","v":{"$error":"#REF!"}},{"$f":"IF('Наш прайс'!J261=0,\"\",'Наш прайс'!J261)","v":""},{"$f":"IF('Наш прайс'!#REF!=0,\"\",'Наш прайс'!#REF!)","v":{"$error":"#REF!"}}]
[{"$f":"IF('Наш прайс'!B262=0,\"\",'Наш прайс'!B262)","v":""},{"$f":"IF('Наш прайс'!#REF!=0,\"\",'Наш прайс'!#REF!)","v":{"$error":"#REF!"}},{"$f":"IF('Наш прайс'!#REF!=0,\"\",'Наш прайс'!#REF!)","v":{"$error":"#REF!"}},"",null,null,{"$f":"IF('Наш прайс'!#REF!=0,\"\",'Наш прайс'!#REF!)","v":{"$error":"#REF!"}},{"$f":"IF('Наш прайс'!#REF!=0,\"\",'Наш прайс'!#REF!)","v":{"$error":"#REF!"}},{"$f":"IF('Наш прайс'!#REF!=0,\"\",'Наш прайс'!#REF!)","v":{"$error":"#REF!"}},{"$f":"IF('Наш прайс'!#REF!=0,\"\",'Наш прайс'!#REF!)","v":{"$error":"#REF!"}},{"$f":"IF('Наш прайс'!#REF!=0,\"\",'Наш прайс'!#REF!)","v":{"$error":"#REF!"}},{"$f":"IF('Наш прайс'!J262=0,\"\",'Наш прайс'!J262)","v":""},{"$f":"IF('Наш прайс'!#REF!=0,\"\",'Наш прайс'!#REF!)","v":{"$error":"#REF!"}}]
[{"$f":"IF('Наш прайс'!B263=0,\"\",'Наш прайс'!B263)","v":""},{"$f":"IF('Наш прайс'!#REF!=0,\"\",'Наш прайс'!#REF!)","v":{"$error":"#REF!"}},{"$f":"IF('Наш прайс'!#REF!=0,\"\",'Наш прайс'!#REF!)","v":{"$error":"#REF!"}},"",null,null,{"$f":"IF('Наш прайс'!#REF!=0,\"\",'Наш прайс'!#REF!)","v":{"$error":"#REF!"}},{"$f":"IF('Наш прайс'!#REF!=0,\"\",'Наш прайс'!#REF!)","v":{"$error":"#REF!"}},{"$f":"IF('Наш прайс'!#REF!=0,\"\",'Наш прайс'!#REF!)","v":{"$error":"#REF!"}},{"$f":"IF('Наш прайс'!#REF!=0,\"\",'Наш прайс'!#REF!)","v":{"$error":"#REF!"}},{"$f":"IF('Наш прайс'!#REF!=0,\"\",'Наш прайс'!#REF!)","v":{"$error":"#REF!"}},{"$f":"IF('Наш прайс'!J263=0,\"\",'Наш прайс'!J263)","v":""},{"$f":"IF('Наш прайс'!#REF!=0,\"\",'Наш прайс'!#REF!)","v":{"$error":"#REF!"}}]
[{"$f":"IF('Наш прайс'!B264=0,\"\",'Наш прайс'!B264)","v":""},{"$f":"IF('Наш прайс'!#REF!=0,\"\",'Наш прайс'!#REF!)","v":{"$error":"#REF!"}},{"$f":"IF('Наш прайс'!#REF!=0,\"\",'Наш прайс'!#REF!)","v":{"$error":"#REF!"}},"",null,null,{"$f":"IF('Наш прайс'!#REF!=0,\"\",'Наш прайс'!#REF!)","v":{"$error":"#REF!"}},{"$f":"IF('Наш прайс'!#REF!=0,\"\",'Наш прайс'!#REF!)","v":{"$error":"#REF!"}},{"$f":"IF('Наш прайс'!#REF!=0,\"\",'Наш прайс'!#REF!)","v":{"$error":"#REF!"}},{"$f":"IF('Наш прайс'!#REF!=0,\"\",'Наш прайс'!#REF!)","v":{"$error":"#REF!"}},{"$f":"IF('Наш прайс'!#REF!=0,\"\",'Наш прайс'!#REF!)","v":{"$error":"#REF!"}},{"$f":"IF('Наш прайс'!J264=0,\"\",'Наш прайс'!J264)","v":""},{"$f":"IF('Наш прайс'!#REF!=0,\"\",'Наш прайс'!#REF!)","v":{"$error":"#REF!"}}]
[{"$f":"IF('Наш прайс'!B265=0,\"\",'Наш прайс'!B265)","v":""},{"$f":"IF('Наш прайс'!#REF!=0,\"\",'Наш прайс'!#REF!)","v":{"$error":"#REF!"}},{"$f":"IF('Наш прайс'!#REF!=0,\"\",'Наш прайс'!#REF!)","v":{"$error":"#REF!"}},"",null,null,{"$f":"IF('Наш прайс'!#REF!=0,\"\",'Наш прайс'!#REF!)","v":{"$error":"#REF!"}},{"$f":"IF('Наш прайс'!#REF!=0,\"\",'Наш прайс'!#REF!)","v":{"$error":"#REF!"}},{"$f":"IF('Наш прайс'!#REF!=0,\"\",'Наш прайс'!#REF!)","v":{"$error":"#REF!"}},{"$f":"IF('Наш прайс'!#REF!=0,\"\",'Наш прайс'!#REF!)","v":{"$error":"#REF!"}},{"$f":"IF('Наш прайс'!#REF!=0,\"\",'Наш прайс'!#REF!)","v":{"$error":"#REF!"}},{"$f":"IF('Наш прайс'!J265=0,\"\",'Наш прайс'!J265)","v":""},{"$f":"IF('Наш прайс'!#REF!=0,\"\",'Наш прайс'!#REF!)","v":{"$error":"#REF!"}}]
[{"$f":"IF('Наш прайс'!B266=0,\"\",'Наш прайс'!B266)","v":""},{"$f":"IF('Наш прайс'!#REF!=0,\"\",'Наш прайс'!#REF!)","v":{"$error":"#REF!"}},{"$f":"IF('Наш прайс'!#REF!=0,\"\",'Наш прайс'!#REF!)","v":{"$error":"#REF!"}},"",null,null,{"$f":"IF('Наш прайс'!#REF!=0,\"\",'Наш прайс'!#REF!)","v":{"$error":"#REF!"}},{"$f":"IF('Наш прайс'!#REF!=0,\"\",'Наш прайс'!#REF!)","v":{"$error":"#REF!"}},{"$f":"IF('Наш прайс'!#REF!=0,\"\",'Наш прайс'!#REF!)","v":{"$error":"#REF!"}},{"$f":"IF('Наш прайс'!#REF!=0,\"\",'Наш прайс'!#REF!)","v":{"$error":"#REF!"}},{"$f":"IF('Наш прайс'!#REF!=0,\"\",'Наш прайс'!#REF!)","v":{"$error":"#REF!"}},{"$f":"IF('Наш прайс'!J266=0,\"\",'Наш прайс'!J266)","v":""},{"$f":"IF('Наш прайс'!#REF!=0,\"\",'Наш прайс'!#REF!)","v":{"$error":"#REF!"}}]
[{"$f":"IF('Наш прайс'!B267=0,\"\",'Наш прайс'!B267)","v":""},{"$f":"IF('Наш прайс'!#REF!=0,\"\",'Наш прайс'!#REF!)","v":{"$error":"#REF!"}},{"$f":"IF('Наш прайс'!#REF!=0,\"\",'Наш прайс'!#REF!)","v":{"$error":"#REF!"}},"",null,null,{"$f":"IF('Наш прайс'!#REF!=0,\"\",'Наш прайс'!#REF!)","v":{"$error":"#REF!"}},{"$f":"IF('Наш прайс'!#REF!=0,\"\",'Наш прайс'!#REF!)","v":{"$error":"#REF!"}},{"$f":"IF('Наш прайс'!#REF!=0,\"\",'Наш прайс'!#REF!)","v":{"$error":"#REF!"}},{"$f":"IF('Наш прайс'!#REF!=0,\"\",'Наш прайс'!#REF!)","v":{"$error":"#REF!"}},{"$f":"IF('Наш прайс'!#REF!=0,\"\",'Наш прайс'!#REF!)","v":{"$error":"#REF!"}},{"$f":"IF('Наш прайс'!J267=0,\"\",'Наш прайс'!J267)","v":""},{"$f":"IF('Наш прайс'!#REF!=0,\"\",'Наш прайс'!#REF!)","v":{"$error":"#REF!"}}]
[{"$f":"IF('Наш прайс'!B268=0,\"\",'Наш прайс'!B268)","v":""},{"$f":"IF('Наш прайс'!#REF!=0,\"\",'Наш прайс'!#REF!)","v":{"$error":"#REF!"}},{"$f":"IF('Наш прайс'!#REF!=0,\"\",'Наш прайс'!#REF!)","v":{"$error":"#REF!"}},"",null,null,{"$f":"IF('Наш прайс'!#REF!=0,\"\",'Наш прайс'!#REF!)","v":{"$error":"#REF!"}},{"$f":"IF('Наш прайс'!#REF!=0,\"\",'Наш прайс'!#REF!)","v":{"$error":"#REF!"}},{"$f":"IF('Наш прайс'!#REF!=0,\"\",'Наш прайс'!#REF!)","v":{"$error":"#REF!"}},{"$f":"IF('Наш прайс'!#REF!=0,\"\",'Наш прайс'!#REF!)","v":{"$error":"#REF!"}},{"$f":"IF('Наш прайс'!#REF!=0,\"\",'Наш прайс'!#REF!)","v":{"$error":"#REF!"}},{"$f":"IF('Наш прайс'!J268=0,\"\",'Наш прайс'!J268)","v":""},{"$f":"IF('Наш прайс'!#REF!=0,\"\",'Наш прайс'!#REF!)","v":{"$error":"#REF!"}}]
[{"$f":"IF('Наш прайс'!B269=0,\"\",'Наш прайс'!B269)","v":""},{"$f":"IF('Наш прайс'!#REF!=0,\"\",'Наш прайс'!#REF!)","v":{"$error":"#REF!"}},{"$f":"IF('Наш прайс'!#REF!=0,\"\",'Наш прайс'!#REF!)","v":{"$error":"#REF!"}},"",null,null,{"$f":"IF('Наш прайс'!#REF!=0,\"\",'Наш прайс'!#REF!)","v":{"$error":"#REF!"}},{"$f":"IF('Наш прайс'!#REF!=0,\"\",'Наш прайс'!#REF!)","v":{"$error":"#REF!"}},{"$f":"IF('Наш прайс'!#REF!=0,\"\",'Наш прайс'!#REF!)","v":{"$error":"#REF!"}},{"$f":"IF('Наш прайс'!#REF!=0,\"\",'Наш прайс'!#REF!)","v":{"$error":"#REF!"}},{"$f":"IF('Наш прайс'!#REF!=0,\"\",'Наш прайс'!#REF!)","v":{"$error":"#REF!"}},{"$f":"IF('Наш прайс'!J269=0,\"\",'Наш прайс'!J269)","v":""},{"$f":"IF('Наш прайс'!#REF!=0,\"\",'Наш прайс'!#REF!)","v":{"$error":"#REF!"}}]
[{"$f":"IF('Наш прайс'!B270=0,\"\",'Наш прайс'!B270)","v":""},{"$f":"IF('Наш прайс'!#REF!=0,\"\",'Наш прайс'!#REF!)","v":{"$error":"#REF!"}},{"$f":"IF('Наш прайс'!#REF!=0,\"\",'Наш прайс'!#REF!)","v":{"$error":"#REF!"}},"",null,null,{"$f":"IF('Наш прайс'!#REF!=0,\"\",'Наш прайс'!#REF!)","v":{"$error":"#REF!"}},{"$f":"IF('Наш прайс'!#REF!=0,\"\",'Наш прайс'!#REF!)","v":{"$error":"#REF!"}},{"$f":"IF('Наш прайс'!#REF!=0,\"\",'Наш прайс'!#REF!)","v":{"$error":"#REF!"}},{"$f":"IF('Наш прайс'!#REF!=0,\"\",'Наш прайс'!#REF!)","v":{"$error":"#REF!"}},{"$f":"IF('Наш прайс'!#REF!=0,\"\",'Наш прайс'!#REF!)","v":{"$error":"#REF!"}},{"$f":"IF('Наш прайс'!J270=0,\"\",'Наш прайс'!J270)","v":""},{"$f":"IF('Наш прайс'!#REF!=0,\"\",'Наш прайс'!#REF!)","v":{"$error":"#REF!"}}]
[{"$f":"IF('Наш прайс'!B271=0,\"\",'Наш прайс'!B271)","v":""},{"$f":"IF('Наш прайс'!#REF!=0,\"\",'Наш прайс'!#REF!)","v":{"$error":"#REF!"}},{"$f":"IF('Наш прайс'!#REF!=0,\"\",'Наш прайс'!#REF!)","v":{"$error":"#REF!"}},"",null,null,{"$f":"IF('Наш прайс'!#REF!=0,\"\",'Наш прайс'!#REF!)","v":{"$error":"#REF!"}},{"$f":"IF('Наш прайс'!#REF!=0,\"\",'Наш прайс'!#REF!)","v":{"$error":"#REF!"}},{"$f":"IF('Наш прайс'!#REF!=0,\"\",'Наш прайс'!#REF!)","v":{"$error":"#REF!"}},{"$f":"IF('Наш прайс'!#REF!=0,\"\",'Наш прайс'!#REF!)","v":{"$error":"#REF!"}},{"$f":"IF('Наш прайс'!#REF!=0,\"\",'Наш прайс'!#REF!)","v":{"$error":"#REF!"}},{"$f":"IF('Наш прайс'!J271=0,\"\",'Наш прайс'!J271)","v":""},{"$f":"IF('Наш прайс'!#REF!=0,\"\",'Наш прайс'!#REF!)","v":{"$error":"#REF!"}}]
[{"$f":"IF('Наш прайс'!B272=0,\"\",'Наш прайс'!B272)","v":""},{"$f":"IF('Наш прайс'!#REF!=0,\"\",'Наш прайс'!#REF!)","v":{"$error":"#REF!"}},{"$f":"IF('Наш прайс'!#REF!=0,\"\",'Наш прайс'!#REF!)","v":{"$error":"#REF!"}},"",null,null,{"$f":"IF('Наш прайс'!#REF!=0,\"\",'Наш прайс'!#REF!)","v":{"$error":"#REF!"}},{"$f":"IF('Наш прайс'!#REF!=0,\"\",'Наш прайс'!#REF!)","v":{"$error":"#REF!"}},{"$f":"IF('Наш прайс'!#REF!=0,\"\",'Наш прайс'!#REF!)","v":{"$error":"#REF!"}},{"$f":"IF('Наш прайс'!#REF!=0,\"\",'Наш прайс'!#REF!)","v":{"$error":"#REF!"}},{"$f":"IF('Наш прайс'!#REF!=0,\"\",'Наш прайс'!#REF!)","v":{"$error":"#REF!"}},{"$f":"IF('Наш прайс'!J272=0,\"\",'Наш прайс'!J272)","v":""},{"$f":"IF('Наш прайс'!#REF!=0,\"\",'Наш прайс'!#REF!)","v":{"$error":"#REF!"}}]
[{"$f":"IF('Наш прайс'!B273=0,\"\",'Наш прайс'!B273)","v":""},{"$f":"IF('Наш прайс'!#REF!=0,\"\",'Наш прайс'!#REF!)","v":{"$error":"#REF!"}},{"$f":"IF('Наш прайс'!#REF!=0,\"\",'Наш прайс'!#REF!)","v":{"$error":"#REF!"}},"",null,null,{"$f":"IF('Наш прайс'!#REF!=0,\"\",'Наш прайс'!#REF!)","v":{"$error":"#REF!"}},{"$f":"IF('Наш прайс'!#REF!=0,\"\",'Наш прайс'!#REF!)","v":{"$error":"#REF!"}},{"$f":"IF('Наш прайс'!#REF!=0,\"\",'Наш прайс'!#REF!)","v":{"$error":"#REF!"}},{"$f":"IF('Наш прайс'!#REF!=0,\"\",'Наш прайс'!#REF!)","v":{"$error":"#REF!"}},{"$f":"IF('Наш прайс'!#REF!=0,\"\",'Наш прайс'!#REF!)","v":{"$error":"#REF!"}},{"$f":"IF('Наш прайс'!J273=0,\"\",'Наш прайс'!J273)","v":""},{"$f":"IF('Наш прайс'!#REF!=0,\"\",'Наш прайс'!#REF!)","v":{"$error":"#REF!"}}]
[{"$f":"IF('Наш прайс'!B274=0,\"\",'Наш прайс'!B274)","v":""},{"$f":"IF('Наш прайс'!#REF!=0,\"\",'Наш прайс'!#REF!)","v":{"$error":"#REF!"}},{"$f":"IF('Наш прайс'!#REF!=0,\"\",'Наш прайс'!#REF!)","v":{"$error":"#REF!"}},"",null,null,{"$f":"IF('Наш прайс'!#REF!=0,\"\",'Наш прайс'!#REF!)","v":{"$error":"#REF!"}},{"$f":"IF('Наш прайс'!#REF!=0,\"\",'Наш прайс'!#REF!)","v":{"$error":"#REF!"}},{"$f":"IF('Наш прайс'!#REF!=0,\"\",'Наш прайс'!#REF!)","v":{"$error":"#REF!"}},{"$f":"IF('Наш прайс'!#REF!=0,\"\",'Наш прайс'!#REF!)","v":{"$error":"#REF!"}},{"$f":"IF('Наш прайс'!#REF!=0,\"\",'Наш прайс'!#REF!)","v":{"$error":"#REF!"}},{"$f":"IF('Наш прайс'!J274=0,\"\",'Наш прайс'!J274)","v":""},{"$f":"IF('Наш прайс'!#REF!=0,\"\",'Наш прайс'!#REF!)","v":{"$error":"#REF!"}}]
[{"$f":"IF('Наш прайс'!B275=0,\"\",'Наш прайс'!B275)","v":""},{"$f":"IF('Наш прайс'!#REF!=0,\"\",'Наш прайс'!#REF!)","v":{"$error":"#REF!"}},{"$f":"IF('Наш прайс'!#REF!=0,\"\",'Наш прайс'!#REF!)","v":{"$error":"#REF!"}},"",null,null,{"$f":"IF('Наш прайс'!#REF!=0,\"\",'Наш прайс'!#REF!)","v":{"$error":"#REF!"}},{"$f":"IF('Наш прайс'!#REF!=0,\"\",'Наш прайс'!#REF!)","v":{"$error":"#REF!"}},{"$f":"IF('Наш прайс'!#REF!=0,\"\",'Наш прайс'!#REF!)","v":{"$error":"#REF!"}},{"$f":"IF('Наш прайс'!#REF!=0,\"\",'Наш прайс'!#REF!)","v":{"$error":"#REF!"}},{"$f":"IF('Наш прайс'!#REF!=0,\"\",'Наш прайс'!#REF!)","v":{"$error":"#REF!"}},{"$f":"IF('Наш прайс'!J275=0,\"\",'Наш прайс'!J275)","v":""},{"$f":"IF('Наш прайс'!#REF!=0,\"\",'Наш прайс'!#REF!)","v":{"$error":"#REF!"}}]
[{"$f":"IF('Наш прайс'!B276=0,\"\",'Наш прайс'!B276)","v":""},{"$f":"IF('Наш прайс'!#REF!=0,\"\",'Наш прайс'!#REF!)","v":{"$error":"#REF!"}},{"$f":"IF('Наш прайс'!#REF!=0,\"\",'Наш прайс'!#REF!)","v":{"$error":"#REF!"}},"",null,null,{"$f":"IF('Наш прайс'!#REF!=0,\"\",'Наш прайс'!#REF!)","v":{"$error":"#REF!"}},{"$f":"IF('Наш прайс'!#REF!=0,\"\",'Наш прайс'!#REF!)","v":{"$error":"#REF!"}},{"$f":"IF('Наш прайс'!#REF!=0,\"\",'Наш прайс'!#REF!)","v":{"$error":"#REF!"}},{"$f":"IF('Наш прайс'!#REF!=0,\"\",'Наш прайс'!#REF!)","v":{"$error":"#REF!"}},{"$f":"IF('Наш прайс'!#REF!=0,\"\",'Наш прайс'!#REF!)","v":{"$error":"#REF!"}},{"$f":"IF('Наш прайс'!J276=0,\"\",'Наш прайс'!J276)","v":""},{"$f":"IF('Наш прайс'!#REF!=0,\"\",'Наш прайс'!#REF!)","v":{"$error":"#REF!"}}]
[{"$f":"IF('Наш прайс'!B277=0,\"\",'Наш прайс'!B277)","v":""},{"$f":"IF('Наш прайс'!#REF!=0,\"\",'Наш прайс'!#REF!)","v":{"$error":"#REF!"}},{"$f":"IF('Наш прайс'!#REF!=0,\"\",'Наш прайс'!#REF!)","v":{"$error":"#REF!"}},"",null,null,{"$f":"IF('Наш прайс'!#REF!=0,\"\",'Наш прайс'!#REF!)","v":{"$error":"#REF!"}},{"$f":"IF('Наш прайс'!#REF!=0,\"\",'Наш прайс'!#REF!)","v":{"$error":"#REF!"}},{"$f":"IF('Наш прайс'!#REF!=0,\"\",'Наш прайс'!#REF!)","v":{"$error":"#REF!"}},{"$f":"IF('Наш прайс'!#REF!=0,\"\",'Наш прайс'!#REF!)","v":{"$error":"#REF!"}},{"$f":"IF('Наш прайс'!#REF!=0,\"\",'Наш прайс'!#REF!)","v":{"$error":"#REF!"}},{"$f":"IF('Наш прайс'!J277=0,\"\",'Наш прайс'!J277)","v":""},{"$f":"IF('Наш прайс'!#REF!=0,\"\",'Наш прайс'!#REF!)","v":{"$error":"#REF!"}}]
[{"$f":"IF('Наш прайс'!B278=0,\"\",'Наш прайс'!B278)","v":""},{"$f":"IF('Наш прайс'!#REF!=0,\"\",'Наш прайс'!#REF!)","v":{"$error":"#REF!"}},{"$f":"IF('Наш прайс'!#REF!=0,\"\",'Наш прайс'!#REF!)","v":{"$error":"#REF!"}},"",null,null,{"$f":"IF('Наш прайс'!#REF!=0,\"\",'Наш прайс'!#REF!)","v":{"$error":"#REF!"}},{"$f":"IF('Наш прайс'!#REF!=0,\"\",'Наш прайс'!#REF!)","v":{"$error":"#REF!"}},{"$f":"IF('Наш прайс'!#REF!=0,\"\",'Наш прайс'!#REF!)","v":{"$error":"#REF!"}},{"$f":"IF('Наш прайс'!#REF!=0,\"\",'Наш прайс'!#REF!)","v":{"$error":"#REF!"}},{"$f":"IF('Наш прайс'!#REF!=0,\"\",'Наш прайс'!#REF!)","v":{"$error":"#REF!"}},{"$f":"IF('Наш прайс'!J278=0,\"\",'Наш прайс'!J278)","v":""},{"$f":"IF('Наш прайс'!#REF!=0,\"\",'Наш прайс'!#REF!)","v":{"$error":"#REF!"}}]
[{"$f":"IF('Наш прайс'!B279=0,\"\",'Наш прайс'!B279)","v":""},{"$f":"IF('Наш прайс'!#REF!=0,\"\",'Наш прайс'!#REF!)","v":{"$error":"#REF!"}},{"$f":"IF('Наш прайс'!#REF!=0,\"\",'Наш прайс'!#REF!)","v":{"$error":"#REF!"}},"",null,null,{"$f":"IF('Наш прайс'!#REF!=0,\"\",'Наш прайс'!#REF!)","v":{"$error":"#REF!"}},{"$f":"IF('Наш прайс'!#REF!=0,\"\",'Наш прайс'!#REF!)","v":{"$error":"#REF!"}},{"$f":"IF('Наш прайс'!#REF!=0,\"\",'Наш прайс'!#REF!)","v":{"$error":"#REF!"}},{"$f":"IF('Наш прайс'!#REF!=0,\"\",'Наш прайс'!#REF!)","v":{"$error":"#REF!"}},{"$f":"IF('Наш прайс'!#REF!=0,\"\",'Наш прайс'!#REF!)","v":{"$error":"#REF!"}},{"$f":"IF('Наш прайс'!J279=0,\"\",'Наш прайс'!J279)","v":""},{"$f":"IF('Наш прайс'!#REF!=0,\"\",'Наш прайс'!#REF!)","v":{"$error":"#REF!"}}]
[{"$f":"IF('Наш прайс'!B280=0,\"\",'Наш прайс'!B280)","v":""},{"$f":"IF('Наш прайс'!#REF!=0,\"\",'Наш прайс'!#REF!)","v":{"$error":"#REF!"}},{"$f":"IF('Наш прайс'!#REF!=0,\"\",'Наш прайс'!#REF!)","v":{"$error":"#REF!"}},"",null,null,{"$f":"IF('Наш прайс'!#REF!=0,\"\",'Наш прайс'!#REF!)","v":{"$error":"#REF!"}},{"$f":"IF('Наш прайс'!#REF!=0,\"\",'Наш прайс'!#REF!)","v":{"$error":"#REF!"}},{"$f":"IF('Наш прайс'!#REF!=0,\"\",'Наш прайс'!#REF!)","v":{"$error":"#REF!"}},{"$f":"IF('Наш прайс'!#REF!=0,\"\",'Наш прайс'!#REF!)","v":{"$error":"#REF!"}},{"$f":"IF('Наш прайс'!#REF!=0,\"\",'Наш прайс'!#REF!)","v":{"$error":"#REF!"}},{"$f":"IF('Наш прайс'!J280=0,\"\",'Наш прайс'!J280)","v":""},{"$f":"IF('Наш прайс'!#REF!=0,\"\",'Наш прайс'!#REF!)","v":{"$error":"#REF!"}}]
[{"$f":"IF('Наш прайс'!B281=0,\"\",'Наш прайс'!B281)","v":""},{"$f":"IF('Наш прайс'!#REF!=0,\"\",'Наш прайс'!#REF!)","v":{"$error":"#REF!"}},{"$f":"IF('Наш прайс'!#REF!=0,\"\",'Наш прайс'!#REF!)","v":{"$error":"#REF!"}},"",null,null,{"$f":"IF('Наш прайс'!#REF!=0,\"\",'Наш прайс'!#REF!)","v":{"$error":"#REF!"}},{"$f":"IF('Наш прайс'!#REF!=0,\"\",'Наш прайс'!#REF!)","v":{"$error":"#REF!"}},{"$f":"IF('Наш прайс'!#REF!=0,\"\",'Наш прайс'!#REF!)","v":{"$error":"#REF!"}},{"$f":"IF('Наш прайс'!#REF!=0,\"\",'Наш прайс'!#REF!)","v":{"$error":"#REF!"}},{"$f":"IF('Наш прайс'!#REF!=0,\"\",'Наш прайс'!#REF!)","v":{"$error":"#REF!"}},{"$f":"IF('Наш прайс'!J281=0,\"\",'Наш прайс'!J281)","v":""},{"$f":"IF('Наш прайс'!#REF!=0,\"\",'Наш прайс'!#REF!)","v":{"$error":"#REF!"}}]
[{"$f":"IF('Наш прайс'!B282=0,\"\",'Наш прайс'!B282)","v":""},{"$f":"IF('Наш прайс'!#REF!=0,\"\",'Наш прайс'!#REF!)","v":{"$error":"#REF!"}},{"$f":"IF('Наш прайс'!#REF!=0,\"\",'Наш прайс'!#REF!)","v":{"$error":"#REF!"}},"",null,null,{"$f":"IF('Наш прайс'!#REF!=0,\"\",'Наш прайс'!#REF!)","v":{"$error":"#REF!"}},{"$f":"IF('Наш прайс'!#REF!=0,\"\",'Наш прайс'!#REF!)","v":{"$error":"#REF!"}},{"$f":"IF('Наш прайс'!#REF!=0,\"\",'Наш прайс'!#REF!)","v":{"$error":"#REF!"}},{"$f":"IF('Наш прайс'!#REF!=0,\"\",'Наш прайс'!#REF!)","v":{"$error":"#REF!"}},{"$f":"IF('Наш прайс'!#REF!=0,\"\",'Наш прайс'!#REF!)","v":{"$error":"#REF!"}},{"$f":"IF('Наш прайс'!J282=0,\"\",'Наш прайс'!J282)","v":""},{"$f":"IF('Наш прайс'!#REF!=0,\"\",'Наш прайс'!#REF!)","v":{"$error":"#REF!"}}]
[{"$f":"IF('Наш прайс'!B283=0,\"\",'Наш прайс'!B283)","v":""},{"$f":"IF('Наш прайс'!#REF!=0,\"\",'Наш прайс'!#REF!)","v":{"$error":"#REF!"}},{"$f":"IF('Наш прайс'!#REF!=0,\"\",'Наш прайс'!#REF!)","v":{"$error":"#REF!"}},"",null,null,{"$f":"IF('Наш прайс'!#REF!=0,\"\",'Наш прайс'!#REF!)","v":{"$error":"#REF!"}},{"$f":"IF('Наш прайс'!#REF!=0,\"\",'Наш прайс'!#REF!)","v":{"$error":"#REF!"}},{"$f":"IF('Наш прайс'!#REF!=0,\"\",'Наш прайс'!#REF!)","v":{"$error":"#REF!"}},{"$f":"IF('Наш прайс'!#REF!=0,\"\",'Наш прайс'!#REF!)","v":{"$error":"#REF!"}},{"$f":"IF('Наш прайс'!#REF!=0,\"\",'Наш прайс'!#REF!)","v":{"$error":"#REF!"}},{"$f":"IF('Наш прайс'!J283=0,\"\",'Наш прайс'!J283)","v":""},{"$f":"IF('Наш прайс'!#REF!=0,\"\",'Наш прайс'!#REF!)","v":{"$error":"#REF!"}}]
[{"$f":"IF('Наш прайс'!B284=0,\"\",'Наш прайс'!B284)","v":""},{"$f":"IF('Наш прайс'!#REF!=0,\"\",'Наш прайс'!#REF!)","v":{"$error":"#REF!"}},{"$f":"IF('Наш прайс'!#REF!=0,\"\",'Наш прайс'!#REF!)","v":{"$error":"#REF!"}},"",null,null,{"$f":"IF('Наш прайс'!#REF!=0,\"\",'Наш прайс'!#REF!)","v":{"$error":"#REF!"}},{"$f":"IF('Наш прайс'!#REF!=0,\"\",'Наш прайс'!#REF!)","v":{"$error":"#REF!"}},{"$f":"IF('Наш прайс'!#REF!=0,\"\",'Наш прайс'!#REF!)","v":{"$error":"#REF!"}},{"$f":"IF('Наш прайс'!#REF!=0,\"\",'Наш прайс'!#REF!)","v":{"$error":"#REF!"}},{"$f":"IF('Наш прайс'!#REF!=0,\"\",'Наш прайс'!#REF!)","v":{"$error":"#REF!"}},{"$f":"IF('Наш прайс'!J284=0,\"\",'Наш прайс'!J284)","v":""},{"$f":"IF('Наш прайс'!#REF!=0,\"\",'Наш прайс'!#REF!)","v":{"$error":"#REF!"}}]
[{"$f":"IF('Наш прайс'!B285=0,\"\",'Наш прайс'!B285)","v":""},{"$f":"IF('Наш прайс'!#REF!=0,\"\",'Наш прайс'!#REF!)","v":{"$error":"#REF!"}},{"$f":"IF('Наш прайс'!#REF!=0,\"\",'Наш прайс'!#REF!)","v":{"$error":"#REF!"}},"",null,null,{"$f":"IF('Наш прайс'!#REF!=0,\"\",'Наш прайс'!#REF!)","v":{"$error":"#REF!"}},{"$f":"IF('Наш прайс'!#REF!=0,\"\",'Наш прайс'!#REF!)","v":{"$error":"#REF!"}},{"$f":"IF('Наш прайс'!#REF!=0,\"\",'Наш прайс'!#REF!)","v":{"$error":"#REF!"}},{"$f":"IF('Наш прайс'!#REF!=0,\"\",'Наш прайс'!#REF!)","v":{"$error":"#REF!"}},{"$f":"IF('Наш прайс'!#REF!=0,\"\",'Наш прайс'!#REF!)","v":{"$error":"#REF!"}},{"$f":"IF('Наш прайс'!J285=0,\"\",'Наш прайс'!J285)","v":""},{"$f":"IF('Наш прайс'!#REF!=0,\"\",'Наш прайс'!#REF!)","v":{"$error":"#REF!"}}]
[{"$f":"IF('Наш прайс'!B286=0,\"\",'Наш прайс'!B286)","v":""},{"$f":"IF('Наш прайс'!#REF!=0,\"\",'Наш прайс'!#REF!)","v":{"$error":"#REF!"}},{"$f":"IF('Наш прайс'!#REF!=0,\"\",'Наш прайс'!#REF!)","v":{"$error":"#REF!"}},"",null,null,{"$f":"IF('Наш прайс'!#REF!=0,\"\",'Наш прайс'!#REF!)","v":{"$error":"#REF!"}},{"$f":"IF('Наш прайс'!#REF!=0,\"\",'Наш прайс'!#REF!)","v":{"$error":"#REF!"}},{"$f":"IF('Наш прайс'!#REF!=0,\"\",'Наш прайс'!#REF!)","v":{"$error":"#REF!"}},{"$f":"IF('Наш прайс'!#REF!=0,\"\",'Наш прайс'!#REF!)","v":{"$error":"#REF!"}},{"$f":"IF('Наш прайс'!#REF!=0,\"\",'Наш прайс'!#REF!)","v":{"$error":"#REF!"}},{"$f":"IF('Наш прайс'!J286=0,\"\",'Наш прайс'!J286)","v":""},{"$f":"IF('Наш прайс'!#REF!=0,\"\",'Наш прайс'!#REF!)","v":{"$error":"#REF!"}}]
[{"$f":"IF('Наш прайс'!B287=0,\"\",'Наш прайс'!B287)","v":""},{"$f":"IF('Наш прайс'!#REF!=0,\"\",'Наш прайс'!#REF!)","v":{"$error":"#REF!"}},{"$f":"IF('Наш прайс'!#REF!=0,\"\",'Наш прайс'!#REF!)","v":{"$error":"#REF!"}},"",null,null,{"$f":"IF('Наш прайс'!#REF!=0,\"\",'Наш прайс'!#REF!)","v":{"$error":"#REF!"}},{"$f":"IF('Наш прайс'!#REF!=0,\"\",'Наш прайс'!#REF!)","v":{"$error":"#REF!"}},{"$f":"IF('Наш прайс'!#REF!=0,\"\",'Наш прайс'!#REF!)","v":{"$error":"#REF!"}},{"$f":"IF('Наш прайс'!#REF!=0,\"\",'Наш прайс'!#REF!)","v":{"$error":"#REF!"}},{"$f":"IF('Наш прайс'!#REF!=0,\"\",'Наш прайс'!#REF!)","v":{"$error":"#REF!"}},{"$f":"IF('Наш прайс'!J287=0,\"\",'Наш прайс'!J287)","v":""},{"$f":"IF('Наш прайс'!#REF!=0,\"\",'Наш прайс'!#REF!)","v":{"$error":"#REF!"}}]
[{"$f":"IF('Наш прайс'!B288=0,\"\",'Наш прайс'!B288)","v":""},{"$f":"IF('Наш прайс'!#REF!=0,\"\",'Наш прайс'!#REF!)","v":{"$error":"#REF!"}},{"$f":"IF('Наш прайс'!#REF!=0,\"\",'Наш прайс'!#REF!)","v":{"$error":"#REF!"}},"",null,null,{"$f":"IF('Наш прайс'!#REF!=0,\"\",'Наш прайс'!#REF!)","v":{"$error":"#REF!"}},{"$f":"IF('Наш прайс'!#REF!=0,\"\",'Наш прайс'!#REF!)","v":{"$error":"#REF!"}},{"$f":"IF('Наш прайс'!#REF!=0,\"\",'Наш прайс'!#REF!)","v":{"$error":"#REF!"}},{"$f":"IF('Наш прайс'!#REF!=0,\"\",'Наш прайс'!#REF!)","v":{"$error":"#REF!"}},{"$f":"IF('Наш прайс'!#REF!=0,\"\",'Наш прайс'!#REF!)","v":{"$error":"#REF!"}},{"$f":"IF('Наш прайс'!J288=0,\"\",'Наш прайс'!J288)","v":""},{"$f":"IF('Наш прайс'!#REF!=0,\"\",'Наш прайс'!#REF!)","v":{"$error":"#REF!"}}]
[{"$f":"IF('Наш прайс'!B289=0,\"\",'Наш прайс'!B289)","v":""},{"$f":"IF('Наш прайс'!#REF!=0,\"\",'Наш прайс'!#REF!)","v":{"$error":"#REF!"}},{"$f":"IF('Наш прайс'!#REF!=0,\"\",'Наш прайс'!#REF!)","v":{"$error":"#REF!"}},"",null,null,{"$f":"IF('Наш прайс'!#REF!=0,\"\",'Наш прайс'!#REF!)","v":{"$error":"#REF!"}},{"$f":"IF('Наш прайс'!#REF!=0,\"\",'Наш прайс'!#REF!)","v":{"$error":"#REF!"}},{"$f":"IF('Наш прайс'!#REF!=0,\"\",'Наш прайс'!#REF!)","v":{"$error":"#REF!"}},{"$f":"IF('Наш прайс'!#REF!=0,\"\",'Наш прайс'!#REF!)","v":{"$error":"#REF!"}},{"$f":"IF('Наш прайс'!#REF!=0,\"\",'Наш прайс'!#REF!)","v":{"$error":"#REF!"}},{"$f":"IF('Наш прайс'!J289=0,\"\",'Наш прайс'!J289)","v":""},{"$f":"IF('Наш прайс'!#REF!=0,\"\",'Наш прайс'!#REF!)","v":{"$error":"#REF!"}}]
[{"$f":"IF('Наш прайс'!B290=0,\"\",'Наш прайс'!B290)","v":""},{"$f":"IF('Наш прайс'!#REF!=0,\"\",'Наш прайс'!#REF!)","v":{"$error":"#REF!"}},{"$f":"IF('Наш прайс'!#REF!=0,\"\",'Наш прайс'!#REF!)","v":{"$error":"#REF!"}},"",null,null,{"$f":"IF('Наш прайс'!#REF!=0,\"\",'Наш прайс'!#REF!)","v":{"$error":"#REF!"}},{"$f":"IF('Наш прайс'!#REF!=0,\"\",'Наш прайс'!#REF!)","v":{"$error":"#REF!"}},{"$f":"IF('Наш прайс'!#REF!=0,\"\",'Наш прайс'!#REF!)","v":{"$error":"#REF!"}},{"$f":"IF('Наш прайс'!#REF!=0,\"\",'Наш прайс'!#REF!)","v":{"$error":"#REF!"}},{"$f":"IF('Наш прайс'!#REF!=0,\"\",'Наш прайс'!#REF!)","v":{"$error":"#REF!"}},{"$f":"IF('Наш прайс'!J290=0,\"\",'Наш прайс'!J290)","v":""},{"$f":"IF('Наш прайс'!#REF!=0,\"\",'Наш прайс'!#REF!)","v":{"$error":"#REF!"}}]
[{"$f":"IF('Наш прайс'!B291=0,\"\",'Наш прайс'!B291)","v":""},{"$f":"IF('Наш прайс'!#REF!=0,\"\",'Наш прайс'!#REF!)","v":{"$error":"#REF!"}},{"$f":"IF('Наш прайс'!#REF!=0,\"\",'Наш прайс'!#REF!)","v":{"$error":"#REF!"}},"",null,null,{"$f":"IF('Наш прайс'!#REF!=0,\"\",'Наш прайс'!#REF!)","v":{"$error":"#REF!"}},{"$f":"IF('Наш прайс'!#REF!=0,\"\",'Наш прайс'!#REF!)","v":{"$error":"#REF!"}},{"$f":"IF('Наш прайс'!#REF!=0,\"\",'Наш прайс'!#REF!)","v":{"$error":"#REF!"}},{"$f":"IF('Наш прайс'!#REF!=0,\"\",'Наш прайс'!#REF!)","v":{"$error":"#REF!"}},{"$f":"IF('Наш прайс'!#REF!=0,\"\",'Наш прайс'!#REF!)","v":{"$error":"#REF!"}},{"$f":"IF('Наш прайс'!J291=0,\"\",'Наш прайс'!J291)","v":""},{"$f":"IF('Наш прайс'!#REF!=0,\"\",'Наш прайс'!#REF!)","v":{"$error":"#REF!"}}]
[{"$f":"IF('Наш прайс'!B292=0,\"\",'Наш прайс'!B292)","v":""},{"$f":"IF('Наш прайс'!#REF!=0,\"\",'Наш прайс'!#REF!)","v":{"$error":"#REF!"}},{"$f":"IF('Наш прайс'!#REF!=0,\"\",'Наш прайс'!#REF!)","v":{"$error":"#REF!"}},"",null,null,{"$f":"IF('Наш прайс'!#REF!=0,\"\",'Наш прайс'!#REF!)","v":{"$error":"#REF!"}},{"$f":"IF('Наш прайс'!#REF!=0,\"\",'Наш прайс'!#REF!)","v":{"$error":"#REF!"}},{"$f":"IF('Наш прайс'!#REF!=0,\"\",'Наш прайс'!#REF!)","v":{"$error":"#REF!"}},{"$f":"IF('Наш прайс'!#REF!=0,\"\",'Наш прайс'!#REF!)","v":{"$error":"#REF!"}},{"$f":"IF('Наш прайс'!#REF!=0,\"\",'Наш прайс'!#REF!)","v":{"$error":"#REF!"}},{"$f":"IF('Наш прайс'!J292=0,\"\",'Наш прайс'!J292)","v":""},{"$f":"IF('Наш прайс'!#REF!=0,\"\",'Наш прайс'!#REF!)","v":{"$error":"#REF!"}}]
[{"$f":"IF('Наш прайс'!B293=0,\"\",'Наш прайс'!B293)","v":""},{"$f":"IF('Наш прайс'!#REF!=0,\"\",'Наш прайс'!#REF!)","v":{"$error":"#REF!"}},{"$f":"IF('Наш прайс'!#REF!=0,\"\",'Наш прайс'!#REF!)","v":{"$error":"#REF!"}},"",null,null,{"$f":"IF('Наш прайс'!#REF!=0,\"\",'Наш прайс'!#REF!)","v":{"$error":"#REF!"}},{"$f":"IF('Наш прайс'!#REF!=0,\"\",'Наш прайс'!#REF!)","v":{"$error":"#REF!"}},{"$f":"IF('Наш прайс'!#REF!=0,\"\",'Наш прайс'!#REF!)","v":{"$error":"#REF!"}},{"$f":"IF('Наш прайс'!#REF!=0,\"\",'Наш прайс'!#REF!)","v":{"$error":"#REF!"}},{"$f":"IF('Наш прайс'!#REF!=0,\"\",'Наш прайс'!#REF!)","v":{"$error":"#REF!"}},{"$f":"IF('Наш прайс'!J293=0,\"\",'Наш прайс'!J293)","v":""},{"$f":"IF('Наш прайс'!#REF!=0,\"\",'Наш прайс'!#REF!)","v":{"$error":"#REF!"}}]
[{"$f":"IF('Наш прайс'!B294=0,\"\",'Наш прайс'!B294)","v":""},{"$f":"IF('Наш прайс'!#REF!=0,\"\",'Наш прайс'!#REF!)","v":{"$error":"#REF!"}},{"$f":"IF('Наш прайс'!#REF!=0,\"\",'Наш прайс'!#REF!)","v":{"$error":"#REF!"}},"",null,null,{"$f":"IF('Наш прайс'!#REF!=0,\"\",'Наш прайс'!#REF!)","v":{"$error":"#REF!"}},{"$f":"IF('Наш прайс'!#REF!=0,\"\",'Наш прайс'!#REF!)","v":{"$error":"#REF!"}},{"$f":"IF('Наш прайс'!#REF!=0,\"\",'Наш прайс'!#REF!)","v":{"$error":"#REF!"}},{"$f":"IF('Наш прайс'!#REF!=0,\"\",'Наш прайс'!#REF!)","v":{"$error":"#REF!"}},{"$f":"IF('Наш прайс'!#REF!=0,\"\",'Наш прайс'!#REF!)","v":{"$error":"#REF!"}},{"$f":"IF('Наш прайс'!J294=0,\"\",'Наш прайс'!J294)","v":""},{"$f":"IF('Наш прайс'!#REF!=0,\"\",'Наш прайс'!#REF!)","v":{"$error":"#REF!"}}]
[{"$f":"IF('Наш прайс'!B295=0,\"\",'Наш прайс'!B295)","v":""},{"$f":"IF('Наш прайс'!#REF!=0,\"\",'Наш прайс'!#REF!)","v":{"$error":"#REF!"}},{"$f":"IF('Наш прайс'!#REF!=0,\"\",'Наш прайс'!#REF!)","v":{"$error":"#REF!"}},"",null,null,{"$f":"IF('Наш прайс'!#REF!=0,\"\",'Наш прайс'!#REF!)","v":{"$error":"#REF!"}},{"$f":"IF('Наш прайс'!#REF!=0,\"\",'Наш прайс'!#REF!)","v":{"$error":"#REF!"}},{"$f":"IF('Наш прайс'!#REF!=0,\"\",'Наш прайс'!#REF!)","v":{"$error":"#REF!"}},{"$f":"IF('Наш прайс'!#REF!=0,\"\",'Наш прайс'!#REF!)","v":{"$error":"#REF!"}},{"$f":"IF('Наш прайс'!#REF!=0,\"\",'Наш прайс'!#REF!)","v":{"$error":"#REF!"}},{"$f":"IF('Наш прайс'!J295=0,\"\",'Наш прайс'!J295)","v":""},{"$f":"IF('Наш прайс'!#REF!=0,\"\",'Наш прайс'!#REF!)","v":{"$error":"#REF!"}}]
[{"$f":"IF('Наш прайс'!B296=0,\"\",'Наш прайс'!B296)","v":""},{"$f":"IF('Наш прайс'!#REF!=0,\"\",'Наш прайс'!#REF!)","v":{"$error":"#REF!"}},{"$f":"IF('Наш прайс'!#REF!=0,\"\",'Наш прайс'!#REF!)","v":{"$error":"#REF!"}},"",null,null,{"$f":"IF('Наш прайс'!#REF!=0,\"\",'Наш прайс'!#REF!)","v":{"$error":"#REF!"}},{"$f":"IF('Наш прайс'!#REF!=0,\"\",'Наш прайс'!#REF!)","v":{"$error":"#REF!"}},{"$f":"IF('Наш прайс'!#REF!=0,\"\",'Наш прайс'!#REF!)","v":{"$error":"#REF!"}},{"$f":"IF('Наш прайс'!#REF!=0,\"\",'Наш прайс'!#REF!)","v":{"$error":"#REF!"}},{"$f":"IF('Наш прайс'!#REF!=0,\"\",'Наш прайс'!#REF!)","v":{"$error":"#REF!"}},{"$f":"IF('Наш прайс'!J296=0,\"\",'Наш прайс'!J296)","v":""},{"$f":"IF('Наш прайс'!#REF!=0,\"\",'Наш прайс'!#REF!)","v":{"$error":"#REF!"}}]
[{"$f":"IF('Наш прайс'!B297=0,\"\",'Наш прайс'!B297)","v":""},{"$f":"IF('Наш прайс'!#REF!=0,\"\",'Наш прайс'!#REF!)","v":{"$error":"#REF!"}},{"$f":"IF('Наш прайс'!#REF!=0,\"\",'Наш прайс'!#REF!)","v":{"$error":"#REF!"}},"",null,null,{"$f":"IF('Наш прайс'!#REF!=0,\"\",'Наш прайс'!#REF!)","v":{"$error":"#REF!"}},{"$f":"IF('Наш прайс'!#REF!=0,\"\",'Наш прайс'!#REF!)","v":{"$error":"#REF!"}},{"$f":"IF('Наш прайс'!#REF!=0,\"\",'Наш прайс'!#REF!)","v":{"$error":"#REF!"}},{"$f":"IF('Наш прайс'!#REF!=0,\"\",'Наш прайс'!#REF!)","v":{"$error":"#REF!"}},{"$f":"IF('Наш прайс'!#REF!=0,\"\",'Наш прайс'!#REF!)","v":{"$error":"#REF!"}},{"$f":"IF('Наш прайс'!J297=0,\"\",'Наш прайс'!J297)","v":""},{"$f":"IF('Наш прайс'!#REF!=0,\"\",'Наш прайс'!#REF!)","v":{"$error":"#REF!"}}]
[{"$f":"IF('Наш прайс'!B298=0,\"\",'Наш прайс'!B298)","v":""},{"$f":"IF('Наш прайс'!#REF!=0,\"\",'Наш прайс'!#REF!)","v":{"$error":"#REF!"}},{"$f":"IF('Наш прайс'!#REF!=0,\"\",'Наш прайс'!#REF!)","v":{"$error":"#REF!"}},"",null,null,{"$f":"IF('Наш прайс'!#REF!=0,\"\",'Наш прайс'!#REF!)","v":{"$error":"#REF!"}},{"$f":"IF('Наш прайс'!#REF!=0,\"\",'Наш прайс'!#REF!)","v":{"$error":"#REF!"}},{"$f":"IF('Наш прайс'!#REF!=0,\"\",'Наш прайс'!#REF!)","v":{"$error":"#REF!"}},{"$f":"IF('Наш прайс'!#REF!=0,\"\",'Наш прайс'!#REF!)","v":{"$error":"#REF!"}},{"$f":"IF('Наш прайс'!#REF!=0,\"\",'Наш прайс'!#REF!)","v":{"$error":"#REF!"}},{"$f":"IF('Наш прайс'!J298=0,\"\",'Наш прайс'!J298)","v":""},{"$f":"IF('Наш прайс'!#REF!=0,\"\",'Наш прайс'!#REF!)","v":{"$error":"#REF!"}}]
[{"$f":"IF('Наш прайс'!B299=0,\"\",'Наш прайс'!B299)","v":""},{"$f":"IF('Наш прайс'!#REF!=0,\"\",'Наш прайс'!#REF!)","v":{"$error":"#REF!"}},{"$f":"IF('Наш прайс'!#REF!=0,\"\",'Наш прайс'!#REF!)","v":{"$error":"#REF!"}},"",null,null,{"$f":"IF('Наш прайс'!#REF!=0,\"\",'Наш прайс'!#REF!)","v":{"$error":"#REF!"}},{"$f":"IF('Наш прайс'!#REF!=0,\"\",'Наш прайс'!#REF!)","v":{"$error":"#REF!"}},{"$f":"IF('Наш прайс'!#REF!=0,\"\",'Наш прайс'!#REF!)","v":{"$error":"#REF!"}},{"$f":"IF('Наш прайс'!#REF!=0,\"\",'Наш прайс'!#REF!)","v":{"$error":"#REF!"}},{"$f":"IF('Наш прайс'!#REF!=0,\"\",'Наш прайс'!#REF!)","v":{"$error":"#REF!"}},{"$f":"IF('Наш прайс'!J299=0,\"\",'Наш прайс'!J299)","v":""},{"$f":"IF('Наш прайс'!#REF!=0,\"\",'Наш прайс'!#REF!)","v":{"$error":"#REF!"}}]
[{"$f":"IF('Наш прайс'!B300=0,\"\",'Наш прайс'!B300)","v":""},{"$f":"IF('Наш прайс'!#REF!=0,\"\",'Наш прайс'!#REF!)","v":{"$error":"#REF!"}},{"$f":"IF('Наш прайс'!#REF!=0,\"\",'Наш прайс'!#REF!)","v":{"$error":"#REF!"}},"",null,null,{"$f":"IF('Наш прайс'!#REF!=0,\"\",'Наш прайс'!#REF!)","v":{"$error":"#REF!"}},{"$f":"IF('Наш прайс'!#REF!=0,\"\",'Наш прайс'!#REF!)","v":{"$error":"#REF!"}},{"$f":"IF('Наш прайс'!#REF!=0,\"\",'Наш прайс'!#REF!)","v":{"$error":"#REF!"}},{"$f":"IF('Наш прайс'!#REF!=0,\"\",'Наш прайс'!#REF!)","v":{"$error":"#REF!"}},{"$f":"IF('Наш прайс'!#REF!=0,\"\",'Наш прайс'!#REF!)","v":{"$error":"#REF!"}},{"$f":"IF('Наш прайс'!J300=0,\"\",'Наш прайс'!J300)","v":""},{"$f":"IF('Наш прайс'!#REF!=0,\"\",'Наш прайс'!#REF!)","v":{"$error":"#REF!"}}]
[{"$f":"IF('Наш прайс'!B301=0,\"\",'Наш прайс'!B301)","v":""},{"$f":"IF('Наш прайс'!#REF!=0,\"\",'Наш прайс'!#REF!)","v":{"$error":"#REF!"}},{"$f":"IF('Наш прайс'!#REF!=0,\"\",'Наш прайс'!#REF!)","v":{"$error":"#REF!"}},{"$f":"L513","v":""},null,null,{"$f":"IF('Наш прайс'!#REF!=0,\"\",'Наш прайс'!#REF!)","v":{"$error":"#REF!"}},{"$f":"IF('Наш прайс'!#REF!=0,\"\",'Наш прайс'!#REF!)","v":{"$error":"#REF!"}},{"$f":"IF('Наш прайс'!#REF!=0,\"\",'Наш прайс'!#REF!)","v":{"$error":"#REF!"}},{"$f":"IF('Наш прайс'!#REF!=0,\"\",'Наш прайс'!#REF!)","v":{"$error":"#REF!"}},{"$f":"IF('Наш прайс'!#REF!=0,\"\",'Наш прайс'!#REF!)","v":{"$error":"#REF!"}},{"$f":"IF('Наш прайс'!J301=0,\"\",'Наш прайс'!J301)","v":""},{"$f":"IF('Наш прайс'!#REF!=0,\"\",'Наш прайс'!#REF!)","v":{"$error":"#REF!"}}]
[{"$f":"IF('Наш прайс'!B302=0,\"\",'Наш прайс'!B302)","v":""},{"$f":"IF('Наш прайс'!#REF!=0,\"\",'Наш прайс'!#REF!)","v":{"$error":"#REF!"}},{"$f":"IF('Наш прайс'!#REF!=0,\"\",'Наш прайс'!#REF!)","v":{"$error":"#REF!"}},"",null,null,{"$f":"IF('Наш прайс'!#REF!=0,\"\",'Наш прайс'!#REF!)","v":{"$error":"#REF!"}},{"$f":"IF('Наш прайс'!#REF!=0,\"\",'Наш прайс'!#REF!)","v":{"$error":"#REF!"}},{"$f":"IF('Наш прайс'!#REF!=0,\"\",'Наш прайс'!#REF!)","v":{"$error":"#REF!"}},{"$f":"IF('Наш прайс'!#REF!=0,\"\",'Наш прайс'!#REF!)","v":{"$error":"#REF!"}},{"$f":"IF('Наш прайс'!#REF!=0,\"\",'Наш прайс'!#REF!)","v":{"$error":"#REF!"}},{"$f":"IF('Наш прайс'!J302=0,\"\",'Наш прайс'!J302)","v":""},{"$f":"IF('Наш прайс'!#REF!=0,\"\",'Наш прайс'!#REF!)","v":{"$error":"#REF!"}}]
[{"$f":"IF('Наш прайс'!B303=0,\"\",'Наш прайс'!B303)","v":""},{"$f":"IF('Наш прайс'!#REF!=0,\"\",'Наш прайс'!#REF!)","v":{"$error":"#REF!"}},{"$f":"IF('Наш прайс'!#REF!=0,\"\",'Наш прайс'!#REF!)","v":{"$error":"#REF!"}},"",null,null,{"$f":"IF('Наш прайс'!#REF!=0,\"\",'Наш прайс'!#REF!)","v":{"$error":"#REF!"}},{"$f":"IF('Наш прайс'!#REF!=0,\"\",'Наш прайс'!#REF!)","v":{"$error":"#REF!"}},{"$f":"IF('Наш прайс'!#REF!=0,\"\",'Наш прайс'!#REF!)","v":{"$error":"#REF!"}},{"$f":"IF('Наш прайс'!#REF!=0,\"\",'Наш прайс'!#REF!)","v":{"$error":"#REF!"}},{"$f":"IF('Наш прайс'!#REF!=0,\"\",'Наш прайс'!#REF!)","v":{"$error":"#REF!"}},{"$f":"IF('Наш прайс'!J303=0,\"\",'Наш прайс'!J303)","v":""},{"$f":"IF('Наш прайс'!#REF!=0,\"\",'Наш прайс'!#REF!)","v":{"$error":"#REF!"}}]
[{"$f":"IF('Наш прайс'!B304=0,\"\",'Наш прайс'!B304)","v":""},{"$f":"IF('Наш прайс'!#REF!=0,\"\",'Наш прайс'!#REF!)","v":{"$error":"#REF!"}},{"$f":"IF('Наш прайс'!#REF!=0,\"\",'Наш прайс'!#REF!)","v":{"$error":"#REF!"}},"",null,null,{"$f":"IF('Наш прайс'!#REF!=0,\"\",'Наш прайс'!#REF!)","v":{"$error":"#REF!"}},{"$f":"IF('Наш прайс'!#REF!=0,\"\",'Наш прайс'!#REF!)","v":{"$error":"#REF!"}},{"$f":"IF('Наш прайс'!#REF!=0,\"\",'Наш прайс'!#REF!)","v":{"$error":"#REF!"}},{"$f":"IF('Наш прайс'!#REF!=0,\"\",'Наш прайс'!#REF!)","v":{"$error":"#REF!"}},{"$f":"IF('Наш прайс'!#REF!=0,\"\",'Наш прайс'!#REF!)","v":{"$error":"#REF!"}},{"$f":"IF('Наш прайс'!J304=0,\"\",'Наш прайс'!J304)","v":""},{"$f":"IF('Наш прайс'!#REF!=0,\"\",'Наш прайс'!#REF!)","v":{"$error":"#REF!"}}]
[{"$f":"IF('Наш прайс'!B305=0,\"\",'Наш прайс'!B305)","v":""},{"$f":"IF('Наш прайс'!#REF!=0,\"\",'Наш прайс'!#REF!)","v":{"$error":"#REF!"}},{"$f":"IF('Наш прайс'!#REF!=0,\"\",'Наш прайс'!#REF!)","v":{"$error":"#REF!"}},"",null,null,{"$f":"IF('Наш прайс'!#REF!=0,\"\",'Наш прайс'!#REF!)","v":{"$error":"#REF!"}},{"$f":"IF('Наш прайс'!#REF!=0,\"\",'Наш прайс'!#REF!)","v":{"$error":"#REF!"}},{"$f":"IF('Наш прайс'!#REF!=0,\"\",'Наш прайс'!#REF!)","v":{"$error":"#REF!"}},{"$f":"IF('Наш прайс'!#REF!=0,\"\",'Наш прайс'!#REF!)","v":{"$error":"#REF!"}},{"$f":"IF('Наш прайс'!#REF!=0,\"\",'Наш прайс'!#REF!)","v":{"$error":"#REF!"}},{"$f":"IF('Наш прайс'!J305=0,\"\",'Наш прайс'!J305)","v":""},{"$f":"IF('Наш прайс'!#REF!=0,\"\",'Наш прайс'!#REF!)","v":{"$error":"#REF!"}}]
[{"$f":"IF('Наш прайс'!B306=0,\"\",'Наш прайс'!B306)","v":""},{"$f":"IF('Наш прайс'!#REF!=0,\"\",'Наш прайс'!#REF!)","v":{"$error":"#REF!"}},{"$f":"IF('Наш прайс'!#REF!=0,\"\",'Наш прайс'!#REF!)","v":{"$error":"#REF!"}},"",null,null,{"$f":"IF('Наш прайс'!#REF!=0,\"\",'Наш прайс'!#REF!)","v":{"$error":"#REF!"}},{"$f":"IF('Наш прайс'!#REF!=0,\"\",'Наш прайс'!#REF!)","v":{"$error":"#REF!"}},{"$f":"IF('Наш прайс'!#REF!=0,\"\",'Наш прайс'!#REF!)","v":{"$error":"#REF!"}},{"$f":"IF('Наш прайс'!#REF!=0,\"\",'Наш прайс'!#REF!)","v":{"$error":"#REF!"}},{"$f":"IF('Наш прайс'!#REF!=0,\"\",'Наш прайс'!#REF!)","v":{"$error":"#REF!"}},{"$f":"IF('Наш прайс'!J306=0,\"\",'Наш прайс'!J306)","v":""},{"$f":"IF('Наш прайс'!#REF!=0,\"\",'Наш прайс'!#REF!)","v":{"$error":"#REF!"}}]
[{"$f":"IF('Наш прайс'!B307=0,\"\",'Наш прайс'!B307)","v":""},{"$f":"IF('Наш прайс'!#REF!=0,\"\",'Наш прайс'!#REF!)","v":{"$error":"#REF!"}},{"$f":"IF('Наш прайс'!#REF!=0,\"\",'Наш прайс'!#REF!)","v":{"$error":"#REF!"}},"",null,null,{"$f":"IF('Наш прайс'!#REF!=0,\"\",'Наш прайс'!#REF!)","v":{"$error":"#REF!"}},{"$f":"IF('Наш прайс'!#REF!=0,\"\",'Наш прайс'!#REF!)","v":{"$error":"#REF!"}},{"$f":"IF('Наш прайс'!#REF!=0,\"\",'Наш прайс'!#REF!)","v":{"$error":"#REF!"}},{"$f":"IF('Наш прайс'!#REF!=0,\"\",'Наш прайс'!#REF!)","v":{"$error":"#REF!"}},{"$f":"IF('Наш прайс'!#REF!=0,\"\",'Наш прайс'!#REF!)","v":{"$error":"#REF!"}},{"$f":"IF('Наш прайс'!J307=0,\"\",'Наш прайс'!J307)","v":""},{"$f":"IF('Наш прайс'!#REF!=0,\"\",'Наш прайс'!#REF!)","v":{"$error":"#REF!"}}]
[{"$f":"IF('Наш прайс'!B308=0,\"\",'Наш прайс'!B308)","v":""},{"$f":"IF('Наш прайс'!#REF!=0,\"\",'Наш прайс'!#REF!)","v":{"$error":"#REF!"}},{"$f":"IF('Наш прайс'!#REF!=0,\"\",'Наш прайс'!#REF!)","v":{"$error":"#REF!"}},"",null,null,{"$f":"IF('Наш прайс'!#REF!=0,\"\",'Наш прайс'!#REF!)","v":{"$error":"#REF!"}},{"$f":"IF('Наш прайс'!#REF!=0,\"\",'Наш прайс'!#REF!)","v":{"$error":"#REF!"}},{"$f":"IF('Наш прайс'!#REF!=0,\"\",'Наш прайс'!#REF!)","v":{"$error":"#REF!"}},{"$f":"IF('Наш прайс'!#REF!=0,\"\",'Наш прайс'!#REF!)","v":{"$error":"#REF!"}},{"$f":"IF('Наш прайс'!#REF!=0,\"\",'Наш прайс'!#REF!)","v":{"$error":"#REF!"}},{"$f":"IF('Наш прайс'!J308=0,\"\",'Наш прайс'!J308)","v":""},{"$f":"IF('Наш прайс'!#REF!=0,\"\",'Наш прайс'!#REF!)","v":{"$error":"#REF!"}}]
[{"$f":"IF('Наш прайс'!B309=0,\"\",'Наш прайс'!B309)","v":""},{"$f":"IF('Наш прайс'!#REF!=0,\"\",'Наш прайс'!#REF!)","v":{"$error":"#REF!"}},{"$f":"IF('Наш прайс'!#REF!=0,\"\",'Наш прайс'!#REF!)","v":{"$error":"#REF!"}},"",null,null,{"$f":"IF('Наш прайс'!#REF!=0,\"\",'Наш прайс'!#REF!)","v":{"$error":"#REF!"}},{"$f":"IF('Наш прайс'!#REF!=0,\"\",'Наш прайс'!#REF!)","v":{"$error":"#REF!"}},{"$f":"IF('Наш прайс'!#REF!=0,\"\",'Наш прайс'!#REF!)","v":{"$error":"#REF!"}},{"$f":"IF('Наш прайс'!#REF!=0,\"\",'Наш прайс'!#REF!)","v":{"$error":"#REF!"}},{"$f":"IF('Наш прайс'!#REF!=0,\"\",'Наш прайс'!#REF!)","v":{"$error":"#REF!"}},{"$f":"IF('Наш прайс'!J309=0,\"\",'Наш прайс'!J309)","v":""},{"$f":"IF('Наш прайс'!#REF!=0,\"\",'Наш прайс'!#REF!)","v":{"$error":"#REF!"}}]
[{"$f":"IF('Наш прайс'!B310=0,\"\",'Наш прайс'!B310)","v":""},{"$f":"IF('Наш прайс'!#REF!=0,\"\",'Наш прайс'!#REF!)","v":{"$error":"#REF!"}},{"$f":"IF('Наш прайс'!#REF!=0,\"\",'Наш прайс'!#REF!)","v":{"$error":"#REF!"}},"",null,null,{"$f":"IF('Наш прайс'!#REF!=0,\"\",'Наш прайс'!#REF!)","v":{"$error":"#REF!"}},{"$f":"IF('Наш прайс'!#REF!=0,\"\",'Наш прайс'!#REF!)","v":{"$error":"#REF!"}},{"$f":"IF('Наш прайс'!#REF!=0,\"\",'Наш прайс'!#REF!)","v":{"$error":"#REF!"}},{"$f":"IF('Наш прайс'!#REF!=0,\"\",'Наш прайс'!#REF!)","v":{"$error":"#REF!"}},{"$f":"IF('Наш прайс'!#REF!=0,\"\",'Наш прайс'!#REF!)","v":{"$error":"#REF!"}},{"$f":"IF('Наш прайс'!J310=0,\"\",'Наш прайс'!J310)","v":""},{"$f":"IF('Наш прайс'!#REF!=0,\"\",'Наш прайс'!#REF!)","v":{"$error":"#REF!"}}]
[{"$f":"IF('Наш прайс'!B311=0,\"\",'Наш прайс'!B311)","v":""},{"$f":"IF('Наш прайс'!#REF!=0,\"\",'Наш прайс'!#REF!)","v":{"$error":"#REF!"}},{"$f":"IF('Наш прайс'!#REF!=0,\"\",'Наш прайс'!#REF!)","v":{"$error":"#REF!"}},"",null,null,{"$f":"IF('Наш прайс'!#REF!=0,\"\",'Наш прайс'!#REF!)","v":{"$error":"#REF!"}},{"$f":"IF('Наш прайс'!#REF!=0,\"\",'Наш прайс'!#REF!)","v":{"$error":"#REF!"}},{"$f":"IF('Наш прайс'!#REF!=0,\"\",'Наш прайс'!#REF!)","v":{"$error":"#REF!"}},{"$f":"IF('Наш прайс'!#REF!=0,\"\",'Наш прайс'!#REF!)","v":{"$error":"#REF!"}},{"$f":"IF('Наш прайс'!#REF!=0,\"\",'Наш прайс'!#REF!)","v":{"$error":"#REF!"}},{"$f":"IF('Наш прайс'!J311=0,\"\",'Наш прайс'!J311)","v":""},{"$f":"IF('Наш прайс'!#REF!=0,\"\",'Наш прайс'!#REF!)","v":{"$error":"#REF!"}}]
[{"$f":"IF('Наш прайс'!B312=0,\"\",'Наш прайс'!B312)","v":""},{"$f":"IF('Наш прайс'!#REF!=0,\"\",'Наш прайс'!#REF!)","v":{"$error":"#REF!"}},{"$f":"IF('Наш прайс'!#REF!=0,\"\",'Наш прайс'!#REF!)","v":{"$error":"#REF!"}},"",null,null,{"$f":"IF('Наш прайс'!#REF!=0,\"\",'Наш прайс'!#REF!)","v":{"$error":"#REF!"}},{"$f":"IF('Наш прайс'!#REF!=0,\"\",'Наш прайс'!#REF!)","v":{"$error":"#REF!"}},{"$f":"IF('Наш прайс'!#REF!=0,\"\",'Наш прайс'!#REF!)","v":{"$error":"#REF!"}},{"$f":"IF('Наш прайс'!#REF!=0,\"\",'Наш прайс'!#REF!)","v":{"$error":"#REF!"}},{"$f":"IF('Наш прайс'!#REF!=0,\"\",'Наш прайс'!#REF!)","v":{"$error":"#REF!"}},{"$f":"IF('Наш прайс'!J312=0,\"\",'Наш прайс'!J312)","v":""},{"$f":"IF('Наш прайс'!#REF!=0,\"\",'Наш прайс'!#REF!)","v":{"$error":"#REF!"}}]
[{"$f":"IF('Наш прайс'!B313=0,\"\",'Наш прайс'!B313)","v":""},{"$f":"IF('Наш прайс'!#REF!=0,\"\",'Наш прайс'!#REF!)","v":{"$error":"#REF!"}},{"$f":"IF('Наш прайс'!#REF!=0,\"\",'Наш прайс'!#REF!)","v":{"$error":"#REF!"}},"",null,null,{"$f":"IF('Наш прайс'!#REF!=0,\"\",'Наш прайс'!#REF!)","v":{"$error":"#REF!"}},{"$f":"IF('Наш прайс'!#REF!=0,\"\",'Наш прайс'!#REF!)","v":{"$error":"#REF!"}},{"$f":"IF('Наш прайс'!#REF!=0,\"\",'Наш прайс'!#REF!)","v":{"$error":"#REF!"}},{"$f":"IF('Наш прайс'!#REF!=0,\"\",'Наш прайс'!#REF!)","v":{"$error":"#REF!"}},{"$f":"IF('Наш прайс'!#REF!=0,\"\",'Наш прайс'!#REF!)","v":{"$error":"#REF!"}},{"$f":"IF('Наш прайс'!J313=0,\"\",'Наш прайс'!J313)","v":""},{"$f":"IF('Наш прайс'!#REF!=0,\"\",'Наш прайс'!#REF!)","v":{"$error":"#REF!"}}]
[{"$f":"IF('Наш прайс'!B314=0,\"\",'Наш прайс'!B314)","v":""},{"$f":"IF('Наш прайс'!#REF!=0,\"\",'Наш прайс'!#REF!)","v":{"$error":"#REF!"}},{"$f":"IF('Наш прайс'!#REF!=0,\"\",'Наш прайс'!#REF!)","v":{"$error":"#REF!"}},"",null,null,{"$f":"IF('Наш прайс'!#REF!=0,\"\",'Наш прайс'!#REF!)","v":{"$error":"#REF!"}},{"$f":"IF('Наш прайс'!#REF!=0,\"\",'Наш прайс'!#REF!)","v":{"$error":"#REF!"}},{"$f":"IF('Наш прайс'!#REF!=0,\"\",'Наш прайс'!#REF!)","v":{"$error":"#REF!"}},{"$f":"IF('Наш прайс'!#REF!=0,\"\",'Наш прайс'!#REF!)","v":{"$error":"#REF!"}},{"$f":"IF('Наш прайс'!#REF!=0,\"\",'Наш прайс'!#REF!)","v":{"$error":"#REF!"}},{"$f":"IF('Наш прайс'!J314=0,\"\",'Наш прайс'!J314)","v":""},{"$f":"IF('Наш прайс'!#REF!=0,\"\",'Наш прайс'!#REF!)","v":{"$error":"#REF!"}}]
[{"$f":"IF('Наш прайс'!B315=0,\"\",'Наш прайс'!B315)","v":""},{"$f":"IF('Наш прайс'!#REF!=0,\"\",'Наш прайс'!#REF!)","v":{"$error":"#REF!"}},{"$f":"IF('Наш прайс'!#REF!=0,\"\",'Наш прайс'!#REF!)","v":{"$error":"#REF!"}},"",null,null,{"$f":"IF('Наш прайс'!#REF!=0,\"\",'Наш прайс'!#REF!)","v":{"$error":"#REF!"}},{"$f":"IF('Наш прайс'!#REF!=0,\"\",'Наш прайс'!#REF!)","v":{"$error":"#REF!"}},{"$f":"IF('Наш прайс'!#REF!=0,\"\",'Наш прайс'!#REF!)","v":{"$error":"#REF!"}},{"$f":"IF('Наш прайс'!#REF!=0,\"\",'Наш прайс'!#REF!)","v":{"$error":"#REF!"}},{"$f":"IF('Наш прайс'!#REF!=0,\"\",'Наш прайс'!#REF!)","v":{"$error":"#REF!"}},{"$f":"IF('Наш прайс'!J315=0,\"\",'Наш прайс'!J315)","v":""},{"$f":"IF('Наш прайс'!#REF!=0,\"\",'Наш прайс'!#REF!)","v":{"$error":"#REF!"}}]
[{"$f":"IF('Наш прайс'!B316=0,\"\",'Наш прайс'!B316)","v":""},{"$f":"IF('Наш прайс'!#REF!=0,\"\",'Наш прайс'!#REF!)","v":{"$error":"#REF!"}},{"$f":"IF('Наш прайс'!#REF!=0,\"\",'Наш прайс'!#REF!)","v":{"$error":"#REF!"}},"",null,null,{"$f":"IF('Наш прайс'!#REF!=0,\"\",'Наш прайс'!#REF!)","v":{"$error":"#REF!"}},{"$f":"IF('Наш прайс'!#REF!=0,\"\",'Наш прайс'!#REF!)","v":{"$error":"#REF!"}},{"$f":"IF('Наш прайс'!#REF!=0,\"\",'Наш прайс'!#REF!)","v":{"$error":"#REF!"}},{"$f":"IF('Наш прайс'!#REF!=0,\"\",'Наш прайс'!#REF!)","v":{"$error":"#REF!"}},{"$f":"IF('Наш прайс'!#REF!=0,\"\",'Наш прайс'!#REF!)","v":{"$error":"#REF!"}},{"$f":"IF('Наш прайс'!J316=0,\"\",'Наш прайс'!J316)","v":""},{"$f":"IF('Наш прайс'!#REF!=0,\"\",'Наш прайс'!#REF!)","v":{"$error":"#REF!"}}]
[{"$f":"IF('Наш прайс'!B317=0,\"\",'Наш прайс'!B317)","v":""},{"$f":"IF('Наш прайс'!#REF!=0,\"\",'Наш прайс'!#REF!)","v":{"$error":"#REF!"}},{"$f":"IF('Наш прайс'!#REF!=0,\"\",'Наш прайс'!#REF!)","v":{"$error":"#REF!"}},"",null,null,{"$f":"IF('Наш прайс'!#REF!=0,\"\",'Наш прайс'!#REF!)","v":{"$error":"#REF!"}},{"$f":"IF('Наш прайс'!#REF!=0,\"\",'Наш прайс'!#REF!)","v":{"$error":"#REF!"}},{"$f":"IF('Наш прайс'!#REF!=0,\"\",'Наш прайс'!#REF!)","v":{"$error":"#REF!"}},{"$f":"IF('Наш прайс'!#REF!=0,\"\",'Наш прайс'!#REF!)","v":{"$error":"#REF!"}},{"$f":"IF('Наш прайс'!#REF!=0,\"\",'Наш прайс'!#REF!)","v":{"$error":"#REF!"}},{"$f":"IF('Наш прайс'!J317=0,\"\",'Наш прайс'!J317)","v":""},{"$f":"IF('Наш прайс'!#REF!=0,\"\",'Наш прайс'!#REF!)","v":{"$error":"#REF!"}}]

{"sheet":"Прайс поставщика","index":2,"n_rows":50,"n_cols":12,"rows_kept":50,"cut":false,"hidden":false,"merged":[[48,1,48,2],[1,1,1,2]]}
[]
[null,"Наименование товаров",null,"Код","Модель","Остатки","A","B","C","Цена","ОПТ","РРЦ"]
[null," 31002406N"," нож + фонарь","27703"," Myth Folder",">10",1935,1839,1839,1742,1935,3290]
[null," 30000463"," нож","25156"," Combat Folder Black","<=10",6450,6128,6128,5805,6450,10965]
[null," 30000462"," нож","25155"," 06 Manual combat folder","<=10",6450,6128,6128,5805,6450,10965]
[null," 30000308"," нож","24958"," 7 Manual combat folder",">10",6450,6128,6128,5805,6450,10965]
[null," 05786"," нож","25192"," Applegate covert","<=10",9083,8630,8630,8176,9084,15442]
[null," 05780N"," нож","24253"," Applegate Fairbain Combat","<=10",7891,7891,7891,7891,7891,13415]
[null," 2231000366"," нож","25063"," Crevice","<=10",1383,1314,1314,1244,1383,2350]
[null," 31000582"," нож","24959"," DMF Folder",">10",3137,2981,2981,2824,3137,5333]
[null," 31000583"," нож","25312"," DMF FOLDER",">10",3075,2921,2921,2768,3075,5227]
[null," 2201648G"," нож","24957"," E-Z Out",">10",2642,2510,2510,2378,2642,4490]
[null," 2201643G"," нож","25157"," E-Z Out","<=10",3531,3354,3354,3178,3531,6002]
[null," 2246069N/223101209"," нож","24966"," Gator",">10",3118,2962,2962,2806,3118,5300]
[null," 2206064N"," нож","24284"," Gator 154",">10",3741,3554,3554,3367,3741,6360]
[null," 2246932N"," нож","24967"," Gator GH","<=10",3419,3248,3248,3077,3419,5811]
[null," 2201870"," нож","23968"," Hinderer CLS","<=10",4281,4067,4067,3853,4281,7277]
[null," 2201534"," нож","23879"," Hinderer Rescue",">10",4535,4309,4309,4082,4535,7710]
[null," 2246009N"," нож","24954"," LST",">10",1559,1481,1481,1404,1559,2650]
[null," 2246050"," нож","24955"," LST ultralight",">10",1123,1067,1067,1011,1123,1908]
[null," 2230000009"," нож","23901"," Metolious","<=10",1848,1756,1756,1664,1848,3142]
[null," 2231000194"," нож","24059"," Metolius two blade","<=10",2520,2394,2394,2268,2520,4283]
[null," 2230000112"," нож","23905"," Metolius two blade",">10",2738,2602,2602,2465,2738,4655]
[null," 46924N"," нож","25141"," Mini Covert",">10",2352,2234,2234,2117,2352,3998]
[null," 31001729N"," нож","25434"," Mini Paraframe","<=10",710,675,675,639,710,1207]
[null," 31000593N"," нож","25078"," Mini Swagger","<=10",1183,1124,1124,1065,1183,2011]
[null," 31002209N"," нож","27701"," Moment",">10",1449,1376,1376,1304,1449,2463]
[null," 31002215N"," нож","27702"," Moment",">10",1183,1124,1124,1065,1183,2011]
[null," 31001164N"," нож","25383"," Myth Folder",">10",2271,2158,2158,2044,2271,3861]
[null," 31001160N"," нож","25382"," Myth Folder","<=10",2271,2158,2158,2044,2271,3861]
[null," 31001088N"," нож","25278"," ",">10",1792,1703,1703,1613,1792,3047]
[null," 2241021"," нож","24048"," Obsidian",">10",2166,2058,2058,1950,2166,3682]
[null," 31001731N"," нож","25435"," Paraframe",">10",1398,1328,1328,1258,1398,2376]
[null," 2248444"," нож","24952"," Powerframe I SS",">10",1160,1102,1102,1044,1160,1971]
[null,"31001734N"," нож","25436"," Paraframe","<=10",1445,1373,1373,1301,1445,2457]
[null," 2248448"," нож","24953"," Powerframe II SS",">10",1501,1426,1426,1351,1501,2552]
[null," 2248447N"," нож","24246"," Powerframe II SS",">10",1344,1277,1277,1210,1344,2285]
[null," 2248485N"," нож","25287"," ","<=10",840,799,799,756,840,1428]
[null," 2241551"," нож","27128"," PR 3.0","<=10",2160,2052,2052,1944,2160,3671]
[null," 2241968/2231000302"," нож","24050"," Remix",">10",1491,1416,1416,1342,1491,2534]
[null," 2241969N"," нож","25159"," Remix","<=10",1491,1416,1416,1342,1491,2534]
[null," 31000346N/31001191"," нож","24051"," Remix Mini",">10",1115,1059,1059,1003,1115,1895]
[null," 31001098N"," нож","25077"," Remix",">10",1835,1743,1743,1652,1835,3119]
[null," 30000185"," нож","25158"," S.A.H.","<=10",10750,10213,10213,9675,10750,18275]
[null," 31000716/2231000781"," нож","24060"," STL 2.5",">10",774,736,736,697,774,1316]
[null," 31000594N"," нож","24964"," Swagger",">10",1478,1405,1405,1331,1478,2513]
[null," 31000345N"," нож кладовщика","27626"," Eab Lite",">10",640,609,609,577,640,1088]
[null," 31001693"," нож","27964"," GDC Tech Skin",">10",1533,1456,1456,1380,1533,2606]
[null,"НОЖИ ФИЛЕЙНЫЕ"]
[null," 2275230"," нож","24067"," Gator fillet 6",">10",1315,1250,1250,1184,1315,2236]