{"text_format":"1","workbook":"xlsx","n_sheets":3,"sheets":["Premier League","Sheet2","Sheet1"],"not_rendered":{"charts":0,"images":0,"macros":1,"external_links":0,"defined_names":1,"comments":0,"pivot_tables":0},"unopened":[],"bounds":{"document_bytes":16777216,"sheet_cells":100000,"rows_first":2000,"rows_last":500,"rows_between":2000,"halvings":0,"cell_chars":16384,"cell_head_chars":4096},"cells_cut":0,"cells_raw":0,"read":"whole","date_system":"1900"}

{"sheet":"Premier League","index":0,"n_rows":12,"n_cols":35,"rows_kept":12,"cut":false,"hidden":false,"merged":[]}
[]
[null,null,null,null,null,null,null,null,null,null,null,null,null,null,null,null,null,null,null,null,null,null,null,null,43]
[null,null,null,null,null,null,null,null,null,null,null,null,null,null,null,null,null,null,null,null,null,null,null,null,null,{"$f":"IF(ISNUMBER(Sheet2!A2),\"\",Sheet2!A2)","v":"Birmingham"},{"$f":"IF(ISNUMBER(Sheet2!B2),\"\",Sheet2!B2)","v":"2"},{"$f":"IF(ISNUMBER(Sheet2!C2),\"\",Sheet2!C2)","v":"1"},{"$f":"IF(ISNUMBER(Sheet2!D2),\"\",Sheet2!D2)","v":"Blackburn"},null,null,null,null,1.4252,0.03]
[null,null,null,null,null,null,null,null,null,null,null,null,null,null,null,null,null,null,null,null,null,null,null,null,null,{"$f":"IF(ISNUMBER(Sheet2!A3),\"\",Sheet2!A3)","v":"Wigan"},{"$f":"IF(ISNUMBER(Sheet2!B3),\"\",Sheet2!B3)","v":"3"},{"$f":"IF(ISNUMBER(Sheet2!C3),\"\",Sheet2!C3)","v":"2"},{"$f":"IF(ISNUMBER(Sheet2!D3),\"\",Sheet2!D3)","v":"AstonVilla"},null,null,null,null,-8.6419999999999997E-2,-0.86250000000000004]
[null,null,null,null,null,null,null,null,null,null,null,null,null,null,null,null,null,null,null,null,null,null,null,null,null,{"$f":"IF(ISNUMBER(Sheet2!A4),\"\",Sheet2!A4)","v":"Charlton"},{"$f":"IF(ISNUMBER(Sheet2!B4),\"\",Sheet2!B4)","v":"2"},{"$f":"IF(ISNUMBER(Sheet2!C4),\"\",Sheet2!C4)","v":"1"},{"$f":"IF(ISNUMBER(Sheet2!D4),\"\",Sheet2!D4)","v":"Portsmouth"},null,null,null,null,-9.8505999999999996E-2,1.560087]
[null,null,null,null,null,null,null,null,null,null,null,null,null,null,null,null,null,null,null,null,null,null,null,null,null,{"$f":"IF(ISNUMBER(Sheet2!A5),\"\",Sheet2!A5)","v":"Chelsea"},{"$f":"IF(ISNUMBER(Sheet2!B5),\"\",Sheet2!B5)","v":"3"},{"$f":"IF(ISNUMBER(Sheet2!C5),\"\",Sheet2!C5)","v":"0"},{"$f":"IF(ISNUMBER(Sheet2!D5),\"\",Sheet2!D5)","v":"Everton"},null,null,null,null,-0.01,2.1111110000000002]
[null,null,null,null,null,null,null,null,null,null,null,null,null,null,null,null,null,null,null,null,null,null,null,null,null,{"$f":"IF(ISNUMBER(Sheet2!A6),\"\",Sheet2!A6)","v":"Middlesbrough"},{"$f":"IF(ISNUMBER(Sheet2!B6),\"\",Sheet2!B6)","v":"2"},{"$f":"IF(ISNUMBER(Sheet2!C6),\"\",Sheet2!C6)","v":"0"},{"$f":"IF(ISNUMBER(Sheet2!D6),\"\",Sheet2!D6)","v":"WestHam"},null,null,null,null,0.351852,-0.23569999999999999]
[null,null,null,null,null,null,null,null,null,null,null,null,null,null,null,null,null,null,null,null,null,null,null,null,null,{"$f":"IF(ISNUMBER(Sheet2!A7),\"\",Sheet2!A7)","v":"Sunderland"},{"$f":"IF(ISNUMBER(Sheet2!B7),\"\",Sheet2!B7)","v":"1"},{"$f":"IF(ISNUMBER(Sheet2!C7),\"\",Sheet2!C7)","v":"4"},{"$f":"IF(ISNUMBER(Sheet2!D7),\"\",Sheet2!D7)","v":"NewcastleUtd"},null,null,null,null,0.30103799999999997,2.33E-4]
[null,null,null,null,null,null,null,null,null,null,null,null,null,null,null,null,null,null,null,null,null,null,null,null,null,{"$f":"IF(ISNUMBER(Sheet2!A8),\"\",Sheet2!A8)","v":"Tottenham"},{"$f":"IF(ISNUMBER(Sheet2!B8),\"\",Sheet2!B8)","v":"1"},{"$f":"IF(ISNUMBER(Sheet2!C8),\"\",Sheet2!C8)","v":"2"},{"$f":"IF(ISNUMBER(Sheet2!D8),\"\",Sheet2!D8)","v":"ManchesterUnited"},null,null,null,null,-8.4362000000000006E-2,1.0233000000000001E-2]
[null,null,null,null,null,null,null,null,null,null,null,null,null,null,null,null,null,null,null,null,null,null,null,null,null,{"$f":"IF(ISNUMBER(Sheet2!A9),\"\",Sheet2!A9)","v":"WestBrom"},{"$f":"IF(ISNUMBER(Sheet2!B9),\"\",Sheet2!B9)","v":"0"},{"$f":"IF(ISNUMBER(Sheet2!C9),\"\",Sheet2!C9)","v":"0"},{"$f":"IF(ISNUMBER(Sheet2!D9),\"\",Sheet2!D9)","v":"Bolton"},null,null,null,null,-0.42238700000000001,-1.0002]
[null,null,null,null,null,null,null,null,null,null,null,null,null,null,null,null,null,null,null,null,null,null,null,null,null,{"$f":"IF(ISNUMBER(Sheet2!A10),\"\",Sheet2!A10)","v":""},{"$f":"IF(ISNUMBER(Sheet2!B10),\"\",Sheet2!B10)","v":""},{"$f":"IF(ISNUMBER(Sheet2!C10),\"\",Sheet2!C10)","v":""},{"$f":"IF(ISNUMBER(Sheet2!D10),\"\",Sheet2!D10)","v":""},null,null,null,null,-0.599769,0.40233000000000002]
[null,null,null,null,null,null,null,null,null,null,null,null,null,null,null,null,null,null,null,null,null,null,null,null,null,{"$f":"IF(ISNUMBER(Sheet2!A11),\"\",Sheet2!A11)","v":""},{"$f":"IF(ISNUMBER(Sheet2!B11),\"\",Sheet2!B11)","v":""},{"$f":"IF(ISNUMBER(Sheet2!C11),\"\",Sheet2!C11)","v":""},{"$f":"IF(ISNUMBER(Sheet2!D11),\"\",Sheet2!D11)","v":""},null,null,null,null,0.111111,0.580233]

{"sheet":"Sheet2","index":1,"n_rows":52,"n_cols":9,"rows_kept":52,"cut":false,"hidden":false,"merged":[]}
["home team","-","-","away team"]
[{"$f":"IF(A1=0,0,INDEX(Sheet1!D$1:D$65516,MATCH($F$5,Sheet1!$C$1:$C$65516,)+ROW(A1)-1))","v":"Birmingham"},{"$f":"IF(B1=0,0,INDEX(Sheet1!E$1:E$65516,MATCH($F$5,Sheet1!$C$1:$C$65516,)+ROW(B1)-1))","v":"2"},{"$f":"IF(C1=0,0,INDEX(Sheet1!F$1:F$65516,MATCH($F$5,Sheet1!$C$1:$C$65516,)+ROW(C1)-1))","v":"1"},{"$f":"IF(D1=0,0,INDEX(Sheet1!G$1:G$65516,MATCH($F$5,Sheet1!$C$1:$C$65516,)+ROW(D1)-1))","v":"Blackburn"}]
[{"$f":"IF(A2=0,0,INDEX(Sheet1!D$1:D$65516,MATCH($F$5,Sheet1!$C$1:$C$65516,)+ROW(A2)-1))","v":"Wigan"},{"$f":"IF(B2=0,0,INDEX(Sheet1!E$1:E$65516,MATCH($F$5,Sheet1!$C$1:$C$65516,)+ROW(B2)-1))","v":"3"},{"$f":"IF(C2=0,0,INDEX(Sheet1!F$1:F$65516,MATCH($F$5,Sheet1!$C$1:$C$65516,)+ROW(C2)-1))","v":"2"},{"$f":"IF(D2=0,0,INDEX(Sheet1!G$1:G$65516,MATCH($F$5,Sheet1!$C$1:$C$65516,)+ROW(D2)-1))","v":"AstonVilla"},null,null,null,null,1]
[{"$f":"IF(A3=0,0,INDEX(Sheet1!D$1:D$65516,MATCH($F$5,Sheet1!$C$1:$C$65516,)+ROW(A3)-1))","v":"Charlton"},{"$f":"IF(B3=0,0,INDEX(Sheet1!E$1:E$65516,MATCH($F$5,Sheet1!$C$1:$C$65516,)+ROW(B3)-1))","v":"2"},{"$f":"IF(C3=0,0,INDEX(Sheet1!F$1:F$65516,MATCH($F$5,Sheet1!$C$1:$C$65516,)+ROW(C3)-1))","v":"1"},{"$f":"IF(D3=0,0,INDEX(Sheet1!G$1:G$65516,MATCH($F$5,Sheet1!$C$1:$C$65516,)+ROW(D3)-1))","v":"Portsmouth"},null,"round",null,null,2]
[{"$f":"IF(A4=0,0,INDEX(Sheet1!D$1:D$65516,MATCH($F$5,Sheet1!$C$1:$C$65516,)+ROW(A4)-1))","v":"Chelsea"},{"$f":"IF(B4=0,0,INDEX(Sheet1!E$1:E$65516,MATCH($F$5,Sheet1!$C$1:$C$65516,)+ROW(B4)-1))","v":"3"},{"$f":"IF(C4=0,0,INDEX(Sheet1!F$1:F$65516,MATCH($F$5,Sheet1!$C$1:$C$65516,)+ROW(C4)-1))","v":"0"},{"$f":"IF(D4=0,0,INDEX(Sheet1!G$1:G$65516,MATCH($F$5,Sheet1!$C$1:$C$65516,)+ROW(D4)-1))","v":"Everton"},null,{"$f":"'Premier League'!Y2","v":43},null,null,3]
[{"$f":"IF(A5=0,0,INDEX(Sheet1!D$1:D$65516,MATCH($F$5,Sheet1!$C$1:$C$65516,)+ROW(A5)-1))","v":"Middlesbrough"},{"$f":"IF(B5=0,0,INDEX(Sheet1!E$1:E$65516,MATCH($F$5,Sheet1!$C$1:$C$65516,)+ROW(B5)-1))","v":"2"},{"$f":"IF(C5=0,0,INDEX(Sheet1!F$1:F$65516,MATCH($F$5,Sheet1!$C$1:$C$65516,)+ROW(C5)-1))","v":"0"},{"$f":"IF(D5=0,0,INDEX(Sheet1!G$1:G$65516,MATCH($F$5,Sheet1!$C$1:$C$65516,)+ROW(D5)-1))","v":"WestHam"},null,null,null,null,4]
[{"$f":"IF(A6=0,0,INDEX(Sheet1!D$1:D$65516,MATCH($F$5,Sheet1!$C$1:$C$65516,)+ROW(A6)-1))","v":"Sunderland"},{"$f":"IF(B6=0,0,INDEX(Sheet1!E$1:E$65516,MATCH($F$5,Sheet1!$C$1:$C$65516,)+ROW(B6)-1))","v":"1"},{"$f":"IF(C6=0,0,INDEX(Sheet1!F$1:F$65516,MATCH($F$5,Sheet1!$C$1:$C$65516,)+ROW(C6)-1))","v":"4"},{"$f":"IF(D6=0,0,INDEX(Sheet1!G$1:G$65516,MATCH($F$5,Sheet1!$C$1:$C$65516,)+ROW(D6)-1))","v":"NewcastleUtd"},null,null,null,null,5]
[{"$f":"IF(A7=0,0,INDEX(Sheet1!D$1:D$65516,MATCH($F$5,Sheet1!$C$1:$C$65516,)+ROW(A7)-1))","v":"Tottenham"},{"$f":"IF(B7=0,0,INDEX(Sheet1!E$1:E$65516,MATCH($F$5,Sheet1!$C$1:$C$65516,)+ROW(B7)-1))","v":"1"},{"$f":"IF(C7=0,0,INDEX(Sheet1!F$1:F$65516,MATCH($F$5,Sheet1!$C$1:$C$65516,)+ROW(C7)-1))","v":"2"},{"$f":"IF(D7=0,0,INDEX(Sheet1!G$1:G$65516,MATCH($F$5,Sheet1!$C$1:$C$65516,)+ROW(D7)-1))","v":"ManchesterUnited"},null,null,null,null,6]
[{"$f":"IF(A8=0,0,INDEX(Sheet1!D$1:D$65516,MATCH($F$5,Sheet1!$C$1:$C$65516,)+ROW(A8)-1))","v":"WestBrom"},{"$f":"IF(B8=0,0,INDEX(Sheet1!E$1:E$65516,MATCH($F$5,Sheet1!$C$1:$C$65516,)+ROW(B8)-1))","v":"0"},{"$f":"IF(C8=0,0,INDEX(Sheet1!F$1:F$65516,MATCH($F$5,Sheet1!$C$1:$C$65516,)+ROW(C8)-1))","v":"0"},{"$f":"IF(D8=0,0,INDEX(Sheet1!G$1:G$65516,MATCH($F$5,Sheet1!$C$1:$C$65516,)+ROW(D8)-1))","v":"Bolton"},null,null,null,null,7]
[{"$f":"IF(A9=0,0,INDEX(Sheet1!D$1:D$65516,MATCH($F$5,Sheet1!$C$1:$C$65516,)+ROW(A9)-1))","v":0},{"$f":"IF(B9=0,0,INDEX(Sheet1!E$1:E$65516,MATCH($F$5,Sheet1!$C$1:$C$65516,)+ROW(B9)-1))","v":0},{"$f":"IF(C9=0,0,INDEX(Sheet1!F$1:F$65516,MATCH($F$5,Sheet1!$C$1:$C$65516,)+ROW(C9)-1))","v":0},{"$f":"IF(D9=0,0,INDEX(Sheet1!G$1:G$65516,MATCH($F$5,Sheet1!$C$1:$C$65516,)+ROW(D9)-1))","v":0},null,null,null,null,8]
[{"$f":"IF(A10=0,0,INDEX(Sheet1!D$1:D$65516,MATCH($F$5,Sheet1!$C$1:$C$65516,)+ROW(A10)-1))","v":0},{"$f":"IF(B10=0,0,INDEX(Sheet1!E$1:E$65516,MATCH($F$5,Sheet1!$C$1:$C$65516,)+ROW(B10)-1))","v":0},{"$f":"IF(C10=0,0,INDEX(Sheet1!F$1:F$65516,MATCH($F$5,Sheet1!$C$1:$C$65516,)+ROW(C10)-1))","v":0},{"$f":"IF(D10=0,0,INDEX(Sheet1!G$1:G$65516,MATCH($F$5,Sheet1!$C$1:$C$65516,)+ROW(D10)-1))","v":0},null,null,null,null,9]
[null,null,null,null,null,null,null,null,10]
[null,null,null,null,null,null,null,null,11]
[null,null,null,null,null,null,null,null,12]
[null,null,null,null,null,null,null,null,13]
[null,null,null,null,null,null,null,null,14]
[null,null,null,null,null,null,null,null,15]
[null,null,null,null,null,null,null,null,16]
[null,null,null,null,null,null,null,null,17]
[null,null,null,null,null,null,null,null,18]
[null,null,null,null,null,null,null,null,19]
[null,null,null,null,null,null,null,null,20]
[null,null,null,null,null,null,null,null,21]
[null,null,null,null,null,null,null,null,22]
[null,null,null,null,null,null,null,null,23]
[null,null,null,null,null,null,null,null,24]
[null,null,null,null,null,null,null,null,25]
[null,null,null,null,null,null,null,null,26]
[null,null,null,null,null,null,null,null,27]
[null,null,null,null,null,null,null,null,28]
[null,null,null,null,null,null,null,null,29]
[null,null,null,null,null,null,null,null,30]
[null,null,null,null,null,null,null,null,31]
[null,null,null,null,null,null,null,null,32]
[null,null,null,null,null,null,null,null,33]
[null,null,null,null,null,null,null,null,34]
[null,null,null,null,null,null,null,null,35]
[null,null,null,null,null,null,null,null,36]
[null,null,null,null,null,null,null,null,37]
[null,null,null,null,null,null,null,null,38]
[null,null,null,null,null,null,null,null,39]
[null,null,null,null,null,null,null,null,40]
[null,null,null,null,null,null,null,null,41]
[null,null,null,null,null,null,null,null,42]
[null,null,null,null,null,null,null,null,43]
[null,null,null,null,null,null,null,null,44]
[null,null,null,null,null,null,null,null,45]
[null,null,null,null,null,null,null,null,46]
[null,null,null,null,null,null,null,null,47]
[null,null,null,null,null,null,null,null,48]
[null,null,null,null,null,null,null,null,49]
[null,null,null,null,null,null,null,null,50]

{"sheet":"Sheet1","index":2,"n_rows":427,"n_cols":7,"rows_kept":427,"cut":false,"hidden":false,"merged":[]}
[null,"2006-05-07",48,"Arsenal","4","2","Wigan"]
[null,"2006-05-07",48,"AstonVilla","2","1","Sunderland"]
[null,"2006-05-07",48,"Blackburn","2","0","ManchesterCity"]
[null,"2006-05-07",48,"Bolton","1","0","Birmingham"]
[null,"2006-05-07",48,"Everton","2","2","WestBrom"]
[null,"2006-05-07",48,"Fulham","1","0","Middlesbrough"]
[null,"2006-05-07",48,"ManchesterUnited","4","0","Charlton"]
[null,"2006-05-07",48,"NewcastleUtd","1","0","Chelsea"]
[null,"2006-05-07",48,"Portsmouth","1","3","Liverpool"]
[null,"2006-05-07",48,"WestHam","2","1","Tottenham"]
[]
[null,"2006-05-04",47,"ManchesterCity","1","3","Arsenal"]
[null,"2006-05-04",47,"Sunderland","2","1","Fulham"]
[null,"2006-05-03",47,"Bolton","1","1","Middlesbrough"]
[]
[null,"2006-05-02",46,"Blackburn","1","0","Chelsea"]
[null,"2006-05-01",46,"Sunderland","0","3","Arsenal"]
[null,"2006-05-01",46,"WestBrom","0","1","WestHam"]
[null,"2006-05-01",46,"ManchesterUnited","0","0","Middlesbrough"]
[]
[null,"2006-04-30",45,"Tottenham","1","0","Bolton"]
[null,"2006-04-29",45,"Birmingham","0","0","NewcastleUtd"]
[null,"2006-04-29",45,"Charlton","0","2","Blackburn"]
[null,"2006-04-29",45,"Chelsea","3","0","ManchesterUnited"]
[null,"2006-04-29",45,"Liverpool","3","1","AstonVilla"]
[null,"2006-04-29",45,"ManchesterCity","1","2","Fulham"]
[null,"2006-04-29",45,"Middlesbrough","0","1","Everton"]
[null,"2006-04-29",45,"Wigan","1","2","Portsmouth"]
[]
[null,"2006-04-26",44,"WestHam","1","2","Liverpool"]
[null,"2006-04-25",44,"AstonVilla","0","1","ManchesterCity"]
[null,"2006-04-24",44,"Fulham","1","0","Wigan"]
[null,"2006-04-22",44,"Arsenal","1","1","Tottenham"]
[null,"2006-04-22",44,"Bolton","4","1","Charlton"]
[null,"2006-04-22",44,"Everton","0","0","Birmingham"]
[null,"2006-04-22",44,"NewcastleUtd","3","0","WestBrom"]
[null,"2006-04-22",44,"Portsmouth","2","1","Sunderland"]
[]
[null,"2006-04-19",43,"Birmingham","2","1","Blackburn"]
[null,"2006-04-18",43,"Wigan","3","2","AstonVilla"]
[null,"2006-04-17",43,"Charlton","2","1","Portsmouth"]
[null,"2006-04-17",43,"Chelsea","3","0","Everton"]
[null,"2006-04-17",43,"Middlesbrough","2","0","WestHam"]
[null,"2006-04-17",43,"Sunderland","1","4","NewcastleUtd"]
[null,"2006-04-17",43,"Tottenham","1","2","ManchesterUnited"]
[null,"2006-04-17",43,"WestBrom","0","0","Bolton"]
[]
[null,"2006-04-16",42,"AstonVilla","3","1","Birmingham"]
[null,"2006-04-16",42,"Blackburn","0","1","Liverpool"]
[null,"2006-04-15",42,"Arsenal","3","1","WestBrom"]
[null,"2006-04-15",42,"Bolton","0","2","Chelsea"]
[null,"2006-04-15",42,"Everton","0","1","Tottenham"]
[null,"2006-04-15",42,"Fulham","2","1","Charlton"]
[null,"2006-04-15",42,"NewcastleUtd","3","1","Wigan"]
[null,"2006-04-15",42,"Portsmouth","1","0","Middlesbrough"]
[null,"2006-04-15",42,"WestHam","1","0","ManchesterCity"]
[null,"2006-04-14",42,"ManchesterUnited","0","0","Sunderland"]
[]
[null,"2006-04-12",41,"Portsmouth","1","1","Arsenal"]
[]
[null,"2006-04-09",40,"AstonVilla","0","0","WestBrom"]
[null,"2006-04-09",40,"Chelsea","4","1","WestHam"]
[null,"2006-04-09",40,"Liverpool","1","0","Bolton"]
[null,"2006-04-09",40,"ManchesterUnited","2","0","Arsenal"]
[null,"2006-04-09",40,"Middlesbrough","1","2","NewcastleUtd"]
[null,"2006-04-08",40,"Charlton","0","0","Everton"]
[null,"2006-04-08",40,"Portsmouth","2","2","Blackburn"]
[null,"2006-04-08",40,"Tottenham","2","1","ManchesterCity"]
[null,"2006-04-08",40,"Wigan","1","1","Birmingham"]
[]
[null,"2006-04-04",39,"Birmingham","1","0","Bolton"]
[]
[null,"2006-04-03",38,"Blackburn","1","1","Wigan"]
[null,"2006-04-02",38,"ManchesterCity","0","1","Middlesbrough"]
[null,"2006-04-02",38,"WestHam","0","0","Charlton"]
[null,"2006-04-01",38,"Arsenal","5","0","AstonVilla"]
[null,"2006-04-01",38,"Birmingham","0","0","Chelsea"]
[null,"2006-04-01",38,"Bolton","1","2","ManchesterUnited"]
[null,"2006-04-01",38,"Everton","2","2","Sunderland"]
[null,"2006-04-01",38,"Fulham","1","3","Portsmouth"]
[null,"2006-04-01",38,"NewcastleUtd","3","1","Tottenham"]
[null,"2006-04-01",38,"WestBrom","0","2","Liverpool"]
[]
[null,"2006-03-29",37,"ManchesterUnited","1","0","WestHam"]
[]
[null,"2006-03-27",36,"Tottenham","2","1","WestBrom"]
[null,"2006-03-26",36,"Charlton","3","1","NewcastleUtd"]
[null,"2006-03-26",36,"ManchesterUnited","3","0","Birmingham"]
[null,"2006-03-26",36,"Middlesbrough","4","3","Bolton"]
[null,"2006-03-25",36,"AstonVilla","0","0","Fulham"]
[null,"2006-03-25",36,"Chelsea","2","0","ManchesterCity"]
[null,"2006-03-25",36,"Liverpool","3","1","Everton"]
[null,"2006-03-25",36,"Sunderland","0","1","Blackburn"]
[null,"2006-03-25",36,"Wigan","1","2","WestHam"]
[]
[null,"2006-03-19",35,"Fulham","1","0","Chelsea"]
[null,"2006-03-19",35,"NewcastleUtd","1","3","Liverpool"]
[null,"2006-03-18",35,"Arsenal","3","0","Charlton"]
[null,"2006-03-18",35,"Birmingham","0","2","Tottenham"]
[null,"2006-03-18",35,"Blackburn","3","2","Middlesbrough"]
[null,"2006-03-18",35,"Bolton","2","0","Sunderland"]
[null,"2006-03-18",35,"Everton","4","1","AstonVilla"]
[null,"2006-03-18",35,"ManchesterCity","0","1","Wigan"]
[null,"2006-03-18",35,"WestBrom","1","2","ManchesterUnited"]
[null,"2006-03-18",35,"WestHam","2","4","Portsmouth"]
[]
[null,"2006-03-15",34,"Liverpool","5","1","Fulham"]
[]
[null,"2006-03-12",33,"Arsenal","2","1","Liverpool"]
[null,"2006-03-12",33,"Charlton","2","1","Middlesbrough"]
[null,"2006-03-12",33,"ManchesterUnited","2","0","NewcastleUtd"]
[null,"2006-03-11",33,"Birmingham","1","1","WestBrom"]
[null,"2006-03-11",33,"Blackburn","2","0","AstonVilla"]
[null,"2006-03-11",33,"Bolton","4","1","WestHam"]
[null,"2006-03-11",33,"Chelsea","2","1","Tottenham"]
[null,"2006-03-11",33,"Everton","3","1","Fulham"]
[null,"2006-03-11",33,"Portsmouth","2","1","ManchesterCity"]
[null,"2006-03-11",33,"Sunderland","0","1","Wigan"]
[]
[null,"2006-03-06",32,"Wigan","1","2","ManchesterUnited"]
[null,"2006-03-05",32,"ManchesterCity","2","1","Sunderland"]
[null,"2006-03-05",32,"Tottenham","3","2","Blackburn"]
[null,"2006-03-04",32,"AstonVilla","1","0","Portsmouth"]
[null,"2006-03-04",32,"Fulham","0","4","Arsenal"]
[null,"2006-03-04",32,"Liverpool","0","0","Charlton"]
[null,"2006-03-04",32,"Middlesbrough","1","0","Birmingham"]
[null,"2006-03-04",32,"NewcastleUtd","3","1","Bolton"]
[null,"2006-03-04",32,"WestBrom","1","2","Chelsea"]
[null,"2006-03-04",32,"WestHam","2","2","Everton"]
[]
[null,"2006-02-26",31,"Bolton","2","1","Fulham"]
[null,"2006-02-26",31,"Liverpool","1","0","ManchesterCity"]
[null,"2006-02-26",31,"WestBrom","0","2","Middlesbrough"]
[null,"2006-02-25",31,"Birmingham","1","0","Sunderland"]
[null,"2006-02-25",31,"Blackburn","1","0","Arsenal"]
[null,"2006-02-25",31,"Charlton","0","0","AstonVilla"]
[null,"2006-02-25",31,"Chelsea","2","0","Portsmouth"]
[null,"2006-02-25",31,"NewcastleUtd","2","0","Everton"]
[]
[null,"2006-02-22",30,"NewcastleUtd","0","0","Charlton"]
[null,"2006-02-19",30,"Tottenham","2","2","Wigan"]
[null,"2006-02-15",30,"Blackburn","2","0","Sunderland"]
[null,"2006-02-14",30,"Liverpool","1","0","Arsenal"]
[]
[null,"2006-02-13",29,"WestHam","3","0","Birmingham"]
[null,"2006-02-12",29,"ManchesterCity","3","2","Charlton"]
[null,"2006-02-12",29,"Sunderland","1","1","Tottenham"]
[null,"2006-02-11",29,"Arsenal","1","1","Bolton"]
[null,"2006-02-11",29,"AstonVilla","1","2","NewcastleUtd"]
[null,"2006-02-11",29,"Everton","1","0","Blackburn"]
[null,"2006-02-11",29,"Fulham","6","1","WestBrom"]
[null,"2006-02-11",29,"Middlesbrough","3","0","Chelsea"]
[null,"2006-02-11",29,"Portsmouth","1","3","ManchesterUnited"]
[null,"2006-02-11",29,"Wigan","0","1","Liverpool"]
[]
[null,"2006-02-08",28,"Charlton","2","0","Liverpool"]
[]
[null,"2006-02-05",27,"Chelsea","2","0","Liverpool"]
[null,"2006-02-05",27,"Tottenham","3","1","Charlton"]
[null,"2006-02-04",27,"Birmingham","0","2","Arsenal"]
[null,"2006-02-04",27,"Bolton","1","1","Wigan"]
[null,"2006-02-04",27,"Everton","1","0","ManchesterCity"]
[null,"2006-02-04",27,"ManchesterUnited","4","2","Fulham"]
[null,"2006-02-04",27,"Middlesbrough","0","4","AstonVilla"]
[null,"2006-02-04",27,"NewcastleUtd","2","0","Portsmouth"]
[null,"2006-02-04",27,"WestBrom","2","0","Blackburn"]
[null,"2006-02-04",27,"WestHam","2","0","Sunderland"]
[]
[null,"2006-02-01",26,"Arsenal","2","3","WestHam"]
[null,"2006-02-01",26,"AstonVilla","1","1","Chelsea"]
[null,"2006-02-01",26,"Blackburn","4","3","ManchesterUnited"]
[null,"2006-02-01",26,"Liverpool","1","1","Birmingham"]
[null,"2006-02-01",26,"ManchesterCity","3","0","NewcastleUtd"]
[null,"2006-02-01",26,"Portsmouth","1","1","Bolton"]
[null,"2006-01-31",26,"Charlton","0","0","WestBrom"]
[null,"2006-01-31",26,"Fulham","1","0","Tottenham"]
[null,"2006-01-31",26,"Sunderland","0","3","Middlesbrough"]
[null,"2006-01-31",26,"Wigan","1","1","Everton"]
[]
[null,"2006-01-23",25,"WestHam","2","1","Fulham"]
[null,"2006-01-22",25,"Chelsea","1","1","Charlton"]
[null,"2006-01-22",25,"ManchesterUnited","1","0","Liverpool"]
[null,"2006-01-21",25,"Birmingham","5","0","Portsmouth"]
[null,"2006-01-21",25,"Bolton","2","0","ManchesterCity"]
[null,"2006-01-21",25,"Everton","1","0","Arsenal"]
[null,"2006-01-21",25,"Middlesbrough","2","3","Wigan"]
[null,"2006-01-21",25,"NewcastleUtd","0","1","Blackburn"]
[null,"2006-01-21",25,"Tottenham","0","0","AstonVilla"]
[null,"2006-01-21",25,"WestBrom","0","1","Sunderland"]
[]
[null,"2006-01-15",24,"Sunderland","1","2","Chelsea"]
[null,"2006-01-15",24,"Wigan","0","1","WestBrom"]
[null,"2006-01-14",24,"Arsenal","7","0","Middlesbrough"]
[null,"2006-01-14",24,"AstonVilla","1","2","WestHam"]
[null,"2006-01-14",24,"Blackburn","0","0","Bolton"]
[null,"2006-01-14",24,"Charlton","2","0","Birmingham"]
[null,"2006-01-14",24,"Fulham","1","0","NewcastleUtd"]
[null,"2006-01-14",24,"Liverpool","1","0","Tottenham"]
[null,"2006-01-14",24,"ManchesterCity","3","1","ManchesterUnited"]
[null,"2006-01-14",24,"Portsmouth","0","1","Everton"]
{"$rows_left_out":227}