{"text_format":"1","workbook":"xlsx","n_sheets":2,"sheets":["     ","Январь 2015"],"not_rendered":{"charts":0,"images":0,"macros":1,"external_links":1,"defined_names":2,"comments":0,"pivot_tables":0},"unopened":[],"bounds":{"document_bytes":16777216,"sheet_cells":100000,"rows_first":2000,"rows_last":500,"rows_between":2000,"halvings":0,"cell_chars":16384,"cell_head_chars":4096},"cells_cut":0,"cells_raw":0,"read":"whole","date_system":"1900"}

{"sheet":"     ","index":0,"n_rows":130,"n_cols":21,"rows_kept":130,"cut":false,"hidden":false,"merged":[]}
["В месяц",null,null,"Расценка","В неделю","Проценты","АП","Группа","Тренер"]
[2,"Айкидо",{"$f":"A2&B2","v":"2Айкидо"},60,2,5,"А","Айкидо",1,"2015-01-01","2015-02-01","2015-03-01","2015-04-01","2015-05-01","2015-06-01","2015-07-01","2015-08-01","2015-09-01","2015-10-01","2015-11-01","2015-12-01"]
[3,"Айкидо",{"$f":"A3&B3","v":"3Айкидо"},90,3,10,"П","Айкидо - Дети",2,"2015-01-02","2015-02-02","2015-03-02","2015-04-02","2015-05-02","2015-06-02","2015-07-02","2015-08-02","2015-09-02","2015-10-02","2015-11-02","2015-12-02"]
[4,"Айкидо","4Айкидо",130,4,15,"А/П","Аэробный Зал",3,"2015-01-03","2015-02-03","2015-03-03","2015-04-03","2015-05-03","2015-06-03","2015-07-03","2015-08-03","2015-09-03","2015-10-03","2015-11-03","2015-12-03"]
[5,"Айкидо","5Айкидо",155,5,20,null,"Аэробный Зал - Дети",4,"2015-01-04","2015-02-04","2015-03-04","2015-04-04","2015-05-04","2015-06-04","2015-07-04","2015-08-04","2015-09-04","2015-10-04","2015-11-04","2015-12-04"]
[6,"Айкидо","6Айкидо",180,6,25,null,"Тайский",5,"2015-01-05","2015-02-05","2015-03-05","2015-04-05","2015-05-05","2015-06-05","2015-07-05","2015-08-05","2015-09-05","2015-10-05","2015-11-05","2015-12-05"]
[7,"Айкидо","7Айкидо",205,null,30,null,"Тайский - Дети",6,"2015-01-06","2015-02-06","2015-03-06","2015-04-06","2015-05-06","2015-06-06","2015-07-06","2015-08-06","2015-09-06","2015-10-06","2015-11-06","2015-12-06"]
[8,"Айкидо","8Айкидо",230,null,35,null,"Тренажерный Зал",7,"2015-01-07","2015-02-07","2015-03-07","2015-04-07","2015-05-07","2015-06-07","2015-07-07","2015-08-07","2015-09-07","2015-10-07","2015-11-07","2015-12-07"]
[9,"Айкидо","9Айкидо",250,null,40,null,"Тренажерный Зал - Дети",8,"2015-01-08","2015-02-08","2015-03-08","2015-04-08","2015-05-08","2015-06-08","2015-07-08","2015-08-08","2015-09-08","2015-10-08","2015-11-08","2015-12-08"]
[10,"Айкидо","10Айкидо",250,null,45,null,null,null,"2015-01-09","2015-02-09","2015-03-09","2015-04-09","2015-05-09","2015-06-09","2015-07-09","2015-08-09","2015-09-09","2015-10-09","2015-11-09","2015-12-09"]
[11,"Айкидо","11Айкидо",270,null,50,null,null,null,"2015-01-10","2015-02-10","2015-03-10","2015-04-10","2015-05-10","2015-06-10","2015-07-10","2015-08-10","2015-09-10","2015-10-10","2015-11-10","2015-12-10"]
[12,"Айкидо","12Айкидо",280,null,null,null,null,null,"2015-01-11","2015-02-11","2015-03-11","2015-04-11","2015-05-11","2015-06-11","2015-07-11","2015-08-11","2015-09-11","2015-10-11","2015-11-11","2015-12-11"]
[13,"Айкидо","13Айкидо",280,null,null,null,null,null,"2015-01-12","2015-02-12","2015-03-12","2015-04-12","2015-05-12","2015-06-12","2015-07-12","2015-08-12","2015-09-12","2015-10-12","2015-11-12","2015-12-12"]
[2,"Айкидо - Дети","2Айкидо - Дети",60,null,null,null,null,null,"2015-01-13","2015-02-13","2015-03-13","2015-04-13","2015-05-13","2015-06-13","2015-07-13","2015-08-13","2015-09-13","2015-10-13","2015-11-13","2015-12-13"]
[3,"Айкидо - Дети","3Айкидо - Дети",90,null,null,null,null,null,"2015-01-14","2015-02-14","2015-03-14","2015-04-14","2015-05-14","2015-06-14","2015-07-14","2015-08-14","2015-09-14","2015-10-14","2015-11-14","2015-12-14"]
[4,"Айкидо - Дети","4Айкидо - Дети",120,null,null,null,null,null,"2015-01-15","2015-02-15","2015-03-15","2015-04-15","2015-05-15","2015-06-15","2015-07-15","2015-08-15","2015-09-15","2015-10-15","2015-11-15","2015-12-15"]
[5,"Айкидо - Дети","5Айкидо - Дети",150,null,null,null,null,null,"2015-01-16","2015-02-16","2015-03-16","2015-04-16","2015-05-16","2015-06-16","2015-07-16","2015-08-16","2015-09-16","2015-10-16","2015-11-16","2015-12-16"]
[6,"Айкидо - Дети","6Айкидо - Дети",175,null,null,null,null,null,"2015-01-17","2015-02-17","2015-03-17","2015-04-17","2015-05-17","2015-06-17","2015-07-17","2015-08-17","2015-09-17","2015-10-17","2015-11-17","2015-12-17"]
[7,"Айкидо - Дети","7Айкидо - Дети",195,null,null,null,null,null,"2015-01-18","2015-02-18","2015-03-18","2015-04-18","2015-05-18","2015-06-18","2015-07-18","2015-08-18","2015-09-18","2015-10-18","2015-11-18","2015-12-18"]
[8,"Айкидо - Дети","8Айкидо - Дети",215,null,null,null,null,null,"2015-01-19","2015-02-19","2015-03-19","2015-04-19","2015-05-19","2015-06-19","2015-07-19","2015-08-19","2015-09-19","2015-10-19","2015-11-19","2015-12-19"]
[9,"Айкидо - Дети","9Айкидо - Дети",230,null,null,null,null,null,"2015-01-20","2015-02-20","2015-03-20","2015-04-20","2015-05-20","2015-06-20","2015-07-20","2015-08-20","2015-09-20","2015-10-20","2015-11-20","2015-12-20"]
[10,"Айкидо - Дети","10Айкидо - Дети",230,null,null,null,null,null,"2015-01-21","2015-02-21","2015-03-21","2015-04-21","2015-05-21","2015-06-21","2015-07-21","2015-08-21","2015-09-21","2015-10-21","2015-11-21","2015-12-21"]
[11,"Айкидо - Дети","11Айкидо - Дети",240,null,null,null,null,null,"2015-01-22","2015-02-22","2015-03-22","2015-04-22","2015-05-22","2015-06-22","2015-07-22","2015-08-22","2015-09-22","2015-10-22","2015-11-22","2015-12-22"]
[12,"Айкидо - Дети","12Айкидо - Дети",250,null,null,null,null,null,"2015-01-23","2015-02-23","2015-03-23","2015-04-23","2015-05-23","2015-06-23","2015-07-23","2015-08-23","2015-09-23","2015-10-23","2015-11-23","2015-12-23"]
[13,"Айкидо - Дети","13Айкидо - Дети",250,null,null,null,null,null,"2015-01-24","2015-02-24","2015-03-24","2015-04-24","2015-05-24","2015-06-24","2015-07-24","2015-08-24","2015-09-24","2015-10-24","2015-11-24","2015-12-24"]
[2,"Аэробный Зал","2Аэробный Зал",60,null,null,null,null,null,"2015-01-25","2015-02-25","2015-03-25","2015-04-25","2015-05-25","2015-06-25","2015-07-25","2015-08-25","2015-09-25","2015-10-25","2015-11-25","2015-12-25"]
[3,"Аэробный Зал","3Аэробный Зал",90,null,null,null,null,null,"2015-01-26","2015-02-26","2015-03-26","2015-04-26","2015-05-26","2015-06-26","2015-07-26","2015-08-26","2015-09-26","2015-10-26","2015-11-26","2015-12-26"]
[4,"Аэробный Зал","4Аэробный Зал",120,null,null,null,null,null,"2015-01-27","2015-02-27","2015-03-27","2015-04-27","2015-05-27","2015-06-27","2015-07-27","2015-08-27","2015-09-27","2015-10-27","2015-11-27","2015-12-27"]
[5,"Аэробный Зал","5Аэробный Зал",150,null,null,null,null,null,"2015-01-28","2015-02-28","2015-03-28","2015-04-28","2015-05-28","2015-06-28","2015-07-28","2015-08-28","2015-09-28","2015-10-28","2015-11-28","2015-12-28"]
[6,"Аэробный Зал","6Аэробный Зал",175,null,null,null,null,null,"2015-01-29",null,"2015-03-29","2015-04-29","2015-05-29","2015-06-29","2015-07-29","2015-08-29","2015-09-29","2015-10-29","2015-11-29","2015-12-29"]
[7,"Аэробный Зал","7Аэробный Зал",195,null,null,null,null,null,"2015-01-30",null,"2015-03-30","2015-04-30","2015-05-30","2015-06-30","2015-07-30","2015-08-30","2015-09-30","2015-10-30","2015-11-30","2015-12-30"]
[8,"Аэробный Зал","8Аэробный Зал",215,null,null,null,null,null,"2015-01-31",null,"2015-03-31",null,"2015-05-31",null,"2015-07-31","2015-08-31",null,"2015-10-31",null,"2015-12-31"]
[9,"Аэробный Зал","9Аэробный Зал",230]
[10,"Аэробный Зал","10Аэробный Зал",230]
[11,"Аэробный Зал","11Аэробный Зал",240]
[12,"Аэробный Зал","12Аэробный Зал",250]
[13,"Аэробный Зал","13Аэробный Зал",250]
[14,"Аэробный Зал","14Аэробный Зал",260]
[15,"Аэробный Зал","15Аэробный Зал",275]
[16,"Аэробный Зал","16Аэробный Зал",290]
[17,"Аэробный Зал","17Аэробный Зал",300]
[18,"Аэробный Зал","18Аэробный Зал",310]
[19,"Аэробный Зал","19Аэробный Зал",320]
[20,"Аэробный Зал","20Аэробный Зал",330]
[21,"Аэробный Зал",{"$f":"A45&B45","v":"21Аэробный Зал"},340]
[22,"Аэробный Зал","22Аэробный Зал",350]
[23,"Аэробный Зал","23Аэробный Зал",365]
[24,"Аэробный Зал","24Аэробный Зал",380]
[2,"Аэробный Зал - Дети","2Аэробный Зал - Дети",60]
[3,"Аэробный Зал - Дети","3Аэробный Зал - Дети",90]
[4,"Аэробный Зал - Дети","4Аэробный Зал - Дети",105]
[5,"Аэробный Зал - Дети","5Аэробный Зал - Дети",125]
[6,"Аэробный Зал - Дети","6Аэробный Зал - Дети",145]
[7,"Аэробный Зал - Дети","7Аэробный Зал - Дети",165]
[8,"Аэробный Зал - Дети","8Аэробный Зал - Дети",185]
[9,"Аэробный Зал - Дети","9Аэробный Зал - Дети",210]
[10,"Аэробный Зал - Дети","10Аэробный Зал - Дети",210]
[11,"Аэробный Зал - Дети","11Аэробный Зал - Дети",220]
[12,"Аэробный Зал - Дети","12Аэробный Зал - Дети",230]
[13,"Аэробный Зал - Дети","13Аэробный Зал - Дети",230]
[2,"Тайский","2Тайский",60]
[3,"Тайский","3Тайский",90]
[4,"Тайский","4Тайский",130]
[5,"Тайский","5Тайский",155]
[6,"Тайский","6Тайский",180]
[7,"Тайский","7Тайский",205]
[8,"Тайский","8Тайский",230]
[9,"Тайский","9Тайский",250]
[10,"Тайский","10Тайский",250]
[11,"Тайский","11Тайский",270]
[12,"Тайский","12Тайский",280]
[13,"Тайский","13Тайский",280]
[2,"Тайский - Дети",{"$f":"A73&B73","v":"2Тайский - Дети"},60]
[3,"Тайский - Дети","3Тайский - Дети",90]
[4,"Тайский - Дети","4Тайский - Дети",120]
[5,"Тайский - Дети","5Тайский - Дети",150]
[6,"Тайский - Дети","6Тайский - Дети",175]
[7,"Тайский - Дети","7Тайский - Дети",195]
[8,"Тайский - Дети","8Тайский - Дети",215]
[9,"Тайский - Дети","9Тайский - Дети",230]
[10,"Тайский - Дети","10Тайский - Дети",230]
[11,"Тайский - Дети","11Тайский - Дети",240]
[12,"Тайский - Дети","12Тайский - Дети",250]
[13,"Тайский - Дети","13Тайский - Дети",250]
[2,"Тренажерный Зал","2Тренажерный Зал",60]
[3,"Тренажерный Зал","3Тренажерный Зал",90]
[4,"Тренажерный Зал","4Тренажерный Зал",130]
[5,"Тренажерный Зал","5Тренажерный Зал",155]
[6,"Тренажерный Зал","6Тренажерный Зал",180]
[7,"Тренажерный Зал","7Тренажерный Зал",205]
[8,"Тренажерный Зал","8Тренажерный Зал",230]
[9,"Тренажерный Зал","9Тренажерный Зал",250]
[10,"Тренажерный Зал","10Тренажерный Зал",250]
[11,"Тренажерный Зал",{"$f":"A94&B94","v":"11Тренажерный Зал"},260]
[12,"Тренажерный Зал","12Тренажерный Зал",270]
[13,"Тренажерный Зал","13Тренажерный Зал",270]
[14,"Тренажерный Зал","14Тренажерный Зал",285]
[15,"Тренажерный Зал","15Тренажерный Зал",300]
[16,"Тренажерный Зал","16Тренажерный Зал",310]
[17,"Тренажерный Зал","17Тренажерный Зал",320]
[18,"Тренажерный Зал","18Тренажерный Зал",330]
[19,"Тренажерный Зал","19Тренажерный Зал",340]
[20,"Тренажерный Зал","20Тренажерный Зал",350]
[21,"Тренажерный Зал","21Тренажерный Зал",355]
[22,"Тренажерный Зал","22Тренажерный Зал",360]
[23,"Тренажерный Зал","23Тренажерный Зал",370]
[24,"Тренажерный Зал","24Тренажерный Зал",380]
[2,"Тренажерный Зал - Дети","2Тренажерный Зал - Дети",60]
[3,"Тренажерный Зал - Дети","3Тренажерный Зал - Дети",90]
[4,"Тренажерный Зал - Дети","4Тренажерный Зал - Дети",120]
[5,"Тренажерный Зал - Дети","5Тренажерный Зал - Дети",150]
[6,"Тренажерный Зал - Дети","6Тренажерный Зал - Дети",175]
[7,"Тренажерный Зал - Дети","7Тренажерный Зал - Дети",195]
[8,"Тренажерный Зал - Дети","8Тренажерный Зал - Дети",215]
[9,"Тренажерный Зал - Дети","9Тренажерный Зал - Дети",230]
[10,"Тренажерный Зал - Дети","10Тренажерный Зал - Дети",230]
[11,"Тренажерный Зал - Дети","11Тренажерный Зал - Дети",240]
[12,"Тренажерный Зал - Дети","12Тренажерный Зал - Дети",250]
[13,"Тренажерный Зал - Дети","13Тренажерный Зал - Дети",250]
[14,"Тренажерный Зал - Дети","14Тренажерный Зал - Дети",260]
[15,"Тренажерный Зал - Дети","15Тренажерный Зал - Дети",275]
[16,"Тренажерный Зал - Дети","16Тренажерный Зал - Дети",290]
[17,"Тренажерный Зал - Дети","17Тренажерный Зал - Дети",300]
[18,"Тренажерный Зал - Дети","18Тренажерный Зал - Дети",310]
[19,"Тренажерный Зал - Дети","19Тренажерный Зал - Дети",320]
[20,"Тренажерный Зал - Дети","20Тренажерный Зал - Дети",330]
[21,"Тренажерный Зал - Дети","21Тренажерный Зал - Дети",340]
[22,"Тренажерный Зал - Дети","22Тренажерный Зал - Дети",350]
[23,"Тренажерный Зал - Дети","23Тренажерный Зал - Дети",365]
[24,"Тренажерный Зал - Дети","24Тренажерный Зал - Дети",380]

{"sheet":"Январь 2015","index":1,"n_rows":6,"n_cols":84,"rows_kept":6,"cut":false,"hidden":false,"merged":[[0,75,1,75],[0,7,0,8],[0,3,0,4],[0,19,0,20],[0,21,0,22],[0,23,0,24],[0,25,0,26],[0,27,0,28],[0,29,0,30],[0,31,0,32],[0,51,0,52],[0,33,0,34],[0,13,0,14],[0,15,0,16],[0,17,0,18],[0,12,1,12],[0,53,0,54],[0,55,0,56],[0,57,0,58],[0,59,0,60],[0,61,0,62],[0,73,0,74],[0,63,0,64],[0,65,0,66],[0,67,0,68],[0,69,0,70],[0,71,0,72],[0,45,0,46],[0,47,0,48],[0,49,0,50],[0,35,0,36],[0,37,0,38],[0,39,0,40],[0,41,0,42],[0,43,0,44]]}
[null,null,null,"К-во посещений",null,null,null,"Скидка",null,null,"Остатолось","Отработано","→","10 января",null,"11 января",null,"12 января",null,"13 января",null,"14 января",null,"15 января",null,"16 января",null,"17 января",null,"18 января",null,"19 января",null,"20 января",null,"21 января",null,"22 января",null,"23 января",null,"24 января",null,"25 января",null,"26 января",null,"27 января",null,"28 января",null,"29 января",null,"30 января",null,"31 января",null,"1 февраля",null,"2 февраля",null,"3 февраля",null,"4 февраля",null,"5 февраля",null,"6 февраля",null,"7 февраля",null,"8 февраля",null,"9 февраля",null,"→","Тр 1","Тр 2","Тр 3","Тр 4","Тр 5","Тр 6","Тр 7","Тр 8"]
["ФИО","Дата","А/П","В неделю","В месяц","Группа","Абонемент","%","грн.","К оплате","тренеровок","тренеровок",null,"Группа","Тренер","Группа","Тренер","Группа","Тренер","Группа","Тренер","Группа","Тренер","Группа","Тренер","Группа","Тренер","Группа","Тренер","Группа","Тренер","Группа","Тренер","Группа","Тренер","Группа","Тренер","Группа","Тренер","Группа","Тренер","Группа","Тренер","Группа","Тренер","Группа","Тренер","Группа","Тренер","Группа","Тренер","Группа","Тренер","Группа","Тренер","Группа","Тренер","Группа","Тренер","Группа","Тренер","Группа","Тренер","Группа","Тренер","Группа","Тренер","Группа","Тренер","Группа","Тренер","Группа","Тренер","Группа","Тренер",null,{"$f":"SUM(BY3:BY400)","v":{"$error":"#REF!"}},{"$f":"SUM(BZ3:BZ400)","v":{"$error":"#REF!"}},{"$error":"#REF!"},{"$error":"#REF!"},{"$error":"#REF!"},{"$error":"#REF!"},{"$error":"#REF!"},{"$error":"#REF!"}]
["Баранов Дмитрий Долг 60 грн.","2015-01-08","А",3,11,"Айкидо",{"$f":"IFERROR(VLOOKUP(E3&F3,'     '!C:D,2,0),\"\" )","v":270},50,{"$f":"IFERROR(G3*H3%,\"\" )","v":135},{"$f":"IFERROR(G3-I3,\"\")","v":135},{"$f":"E3-L3","v":2},{"$f":"COUNT(N3:BW3)","v":9},null,"Айкидо",2,"Айкидо - Дети",2,"Аэробный Зал",3,"Тайский",8,null,null,null,null,"Тайский - Дети",1,null,null,null,null,null,null,null,null,null,null,null,null,null,null,null,null,null,null,null,null,null,null,null,null,null,null,null,null,null,null,"Айкидо",2,null,null,null,null,null,null,null,null,null,null,null,1,null,1,"Айкидо - Дети",2,null,{"$f":"COUNTIF(AH3:BW3,\"=1\")+COUNTIF(#REF!,\"=1\")","v":{"$error":"#REF!"}},{"$f":"COUNTIF(AI3:BX3,\"=2\")+COUNTIF(#REF!,\"=2\")","v":{"$error":"#REF!"}},{"$f":"COUNTIF(AJ3:BY3,\"=3\")+COUNTIF(#REF!,\"=3\")","v":{"$error":"#REF!"}},{"$f":"COUNTIF(AK3:BZ3,\"=4\")+COUNTIF(#REF!,\"=4\")","v":{"$error":"#REF!"}},{"$f":"COUNTIF(AL3:CA3,\"=5\")+COUNTIF(#REF!,\"=5\")","v":{"$error":"#REF!"}},{"$f":"COUNTIF(AM3:CB3,\"=6\")+COUNTIF(#REF!,\"=6\")","v":{"$error":"#REF!"}},{"$f":"COUNTIF(AN3:CC3,\"=7\")+COUNTIF(#REF!,\"=7\")","v":{"$error":"#REF!"}},{"$f":"COUNTIF(AO3:CD3,\"=8\")+COUNTIF(#REF!,\"=8\")","v":{"$error":"#REF!"}}]
["Азаров Сергей","2015-01-09",null,null,null,null,{"$f":"IFERROR(VLOOKUP(E4&F4,'     '!C:D,2,0),\"\" )","v":""},null,{"$f":"IFERROR(G4*H4%,\"\" )","v":""},{"$f":"IFERROR(G4-I4,\"\")","v":""},0,0,null,null,null,null,null,null,null,null,null,null,null,null,null,null,null,null,null,null,null,null,null,null,null,null,null,null,null,null,null,null,null,null,null,null,null,null,null,null,null,null,null,null,null,null,null,null,null,null,null,null,null,null,null,null,null,null,null,null,null,null,null,null,null,null,{"$f":"COUNTIF(AH4:BW4,\"=1\")+COUNTIF(#REF!,\"=1\")","v":{"$error":"#REF!"}},{"$f":"COUNTIF(AI4:BX4,\"=2\")+COUNTIF(#REF!,\"=2\")","v":{"$error":"#REF!"}},{"$f":"COUNTIF(AJ4:BY4,\"=3\")+COUNTIF(#REF!,\"=3\")","v":{"$error":"#REF!"}},{"$f":"COUNTIF(AK4:BZ4,\"=4\")+COUNTIF(#REF!,\"=4\")","v":{"$error":"#REF!"}},{"$f":"COUNTIF(AL4:CA4,\"=5\")+COUNTIF(#REF!,\"=5\")","v":{"$error":"#REF!"}},{"$f":"COUNTIF(AM4:CB4,\"=6\")+COUNTIF(#REF!,\"=6\")","v":{"$error":"#REF!"}},{"$f":"COUNTIF(AN4:CC4,\"=7\")+COUNTIF(#REF!,\"=7\")","v":{"$error":"#REF!"}},{"$f":"COUNTIF(AO4:CD4,\"=8\")+COUNTIF(#REF!,\"=8\")","v":{"$error":"#REF!"}}]
[null,null,null,null,null,null,{"$f":"IFERROR(VLOOKUP(E5&F5,'     '!C:D,2,0),\"\" )","v":""},null,"","",0,0,null,null,null,null,null,null,null,null,null,null,null,null,null,null,null,null,null,null,null,null,null,null,null,null,null,null,null,null,null,null,null,null,null,null,null,null,null,null,null,null,null,null,null,null,null,null,null,null,null,null,null,null,null,null,null,null,null,null,null,null,null,null,null,null,{"$f":"COUNTIF(AH5:BW5,\"=1\")+COUNTIF(#REF!,\"=1\")","v":{"$error":"#REF!"}},{"$f":"COUNTIF(AI5:BX5,\"=2\")+COUNTIF(#REF!,\"=2\")","v":{"$error":"#REF!"}},{"$f":"COUNTIF(AJ5:BY5,\"=3\")+COUNTIF(#REF!,\"=3\")","v":{"$error":"#REF!"}},{"$f":"COUNTIF(AK5:BZ5,\"=4\")+COUNTIF(#REF!,\"=4\")","v":{"$error":"#REF!"}},{"$f":"COUNTIF(AL5:CA5,\"=5\")+COUNTIF(#REF!,\"=5\")","v":{"$error":"#REF!"}},{"$f":"COUNTIF(AM5:CB5,\"=6\")+COUNTIF(#REF!,\"=6\")","v":{"$error":"#REF!"}},{"$f":"COUNTIF(AN5:CC5,\"=7\")+COUNTIF(#REF!,\"=7\")","v":{"$error":"#REF!"}},{"$f":"COUNTIF(AO5:CD5,\"=8\")+COUNTIF(#REF!,\"=8\")","v":{"$error":"#REF!"}}]
[null,null,null,null,null,null,{"$f":"IFERROR(VLOOKUP(E6&F6,'     '!C:D,2,0),\"\" )","v":""},null,"","",0,0,null,null,null,null,null,null,null,null,null,null,null,null,null,null,null,null,null,null,null,null,null,null,null,null,null,null,null,null,null,null,null,null,null,null,null,null,null,null,null,null,null,null,null,null,null,null,null,null,null,null,null,null,null,null,null,null,null,null,null,null,null,null,null,null,{"$f":"COUNTIF(AH6:BW6,\"=1\")+COUNTIF(#REF!,\"=1\")","v":{"$error":"#REF!"}},{"$f":"COUNTIF(AI6:BX6,\"=2\")+COUNTIF(#REF!,\"=2\")","v":{"$error":"#REF!"}},{"$f":"COUNTIF(AJ6:BY6,\"=3\")+COUNTIF(#REF!,\"=3\")","v":{"$error":"#REF!"}},{"$f":"COUNTIF(AK6:BZ6,\"=4\")+COUNTIF(#REF!,\"=4\")","v":{"$error":"#REF!"}},{"$f":"COUNTIF(AL6:CA6,\"=5\")+COUNTIF(#REF!,\"=5\")","v":{"$error":"#REF!"}},{"$f":"COUNTIF(AM6:CB6,\"=6\")+COUNTIF(#REF!,\"=6\")","v":{"$error":"#REF!"}},{"$f":"COUNTIF(AN6:CC6,\"=7\")+COUNTIF(#REF!,\"=7\")","v":{"$error":"#REF!"}},{"$f":"COUNTIF(AO6:CD6,\"=8\")+COUNTIF(#REF!,\"=8\")","v":{"$error":"#REF!"}}]