{"text_format":"1","workbook":"xlsx","n_sheets":3,"sheets":["Premier League","Sheet1","Sheet2"],"not_rendered":{"charts":0,"images":0,"macros":0,"external_links":0,"defined_names":3,"comments":0,"pivot_tables":0},"unopened":[],"bounds":{"document_bytes":16777216,"sheet_cells":100000,"rows_first":2000,"rows_last":500,"rows_between":2000,"halvings":0,"cell_chars":16384,"cell_head_chars":4096},"cells_cut":0,"cells_raw":0,"read":"whole","date_system":"1900"}

{"sheet":"Premier League","index":0,"n_rows":20,"n_cols":22,"rows_kept":20,"cut":false,"hidden":false,"merged":[]}
[1,"Arsenal"]
[2,"Aston Villa",null,null,null,null,null,null,null,null,null,null,null,null,null,null,{"$f":"Sheet2!A2","v":"Manchester United "},{"$f":"Sheet2!B2","v":"3"},{"$f":"Sheet2!C2","v":"0"},{"$f":"Sheet2!D2","v":" Newcastle Utd"},{"$f":"INDEX($A$1:$A$20,MATCH(Q2,$B$1:$B$20))","v":12},{"$f":"INDEX($A$1:$A$20,MATCH(T2,$B$1:$B$20))","v":{"$error":"#N/A"}}]
[3,"Birmingham",null,null,null,null,null,null,null,null,null,null,null,null,null,null,{"$f":"Sheet2!A3","v":"Liverpool "},{"$f":"Sheet2!B3","v":"1"},{"$f":"Sheet2!C3","v":"1"},{"$f":"Sheet2!D3","v":" Arsenal"},{"$f":"INDEX($A$1:$A$20,MATCH(Q3,$B$1:$B$20))","v":10},{"$f":"INDEX($A$1:$A$20,MATCH(T3,$B$1:$B$20))","v":{"$error":"#N/A"}}]
[4,"Blackburn",null,null,null,null,null,null,null,null,null,null,null,null,null,null,{"$f":"Sheet2!A4","v":"Aston Villa "},{"$f":"Sheet2!B4","v":"3"},{"$f":"Sheet2!C4","v":"0"},{"$f":"Sheet2!D4","v":" West Ham"},2,{"$error":"#N/A"}]
[5,"Blackpool",null,null,null,null,null,null,null,null,null,null,null,null,null,null,{"$f":"Sheet2!A5","v":"Blackburn "},{"$f":"Sheet2!B5","v":"1"},{"$f":"Sheet2!C5","v":"0"},{"$f":"Sheet2!D5","v":" Everton"},4,{"$error":"#N/A"}]
[6,"Bolton",null,null,null,null,null,null,null,null,null,null,null,null,null,null,{"$f":"Sheet2!A6","v":"Bolton "},{"$f":"Sheet2!B6","v":"0"},{"$f":"Sheet2!C6","v":"0"},{"$f":"Sheet2!D6","v":" Fulham"},6,{"$error":"#N/A"}]
[7,"Chelsea",null,null,null,null,null,null,null,null,null,null,null,null,null,null,{"$f":"Sheet2!A7","v":"Chelsea "},{"$f":"Sheet2!B7","v":"6"},{"$f":"Sheet2!C7","v":"0"},{"$f":"Sheet2!D7","v":" West Brom"},7,{"$error":"#N/A"}]
[8,"Everton",null,null,null,null,null,null,null,null,null,null,null,null,null,null,{"$f":"Sheet2!A8","v":"Sunderland "},{"$f":"Sheet2!B8","v":"2"},{"$f":"Sheet2!C8","v":"2"},{"$f":"Sheet2!D8","v":" Birmingham"},15,{"$error":"#N/A"}]
[9,"Fulham",null,null,null,null,null,null,null,null,null,null,null,null,null,null,{"$f":"Sheet2!A9","v":"Tottenham "},{"$f":"Sheet2!B9","v":"0"},{"$f":"Sheet2!C9","v":"0"},{"$f":"Sheet2!D9","v":" Manchester City"},16,{"$error":"#N/A"}]
[10,"Liverpool",null,null,null,null,null,null,null,null,null,null,null,null,null,null,{"$f":"Sheet2!A10","v":"Wigan "},{"$f":"Sheet2!B10","v":"0"},{"$f":"Sheet2!C10","v":"4"},{"$f":"Sheet2!D10","v":" Blackpool"},19,{"$error":"#N/A"}]
[11,"Manchester City",null,null,null,null,null,null,null,null,null,null,null,null,null,null,{"$f":"Sheet2!A11","v":"Wolves "},{"$f":"Sheet2!B11","v":"2"},{"$f":"Sheet2!C11","v":"1"},{"$f":"Sheet2!D11","v":" Stoke City"},20,{"$error":"#N/A"}]
[12,"Manchester United"]
[13,"Newcastle Utd"]
[14,"Stoke City"]
[15,"Sunderland"]
[16,"Tottenham"]
[17,"West Brom"]
[18,"West Ham"]
[19,"Wigan"]
[20,"Wolves"]

{"sheet":"Sheet1","index":1,"n_rows":427,"n_cols":7,"rows_kept":427,"cut":false,"hidden":false,"merged":[]}
[null,"date","round","home team",null,null,"away team"]
[null,"2011-05-22",47,"Aston Villa ","1","0"," Liverpool"]
[null,"2011-05-22",47,"Bolton ","0","2"," Manchester City"]
[null,"2011-05-22",47,"Everton ","1","0"," Chelsea"]
[null,"2011-05-22",47,"Fulham ","2","2"," Arsenal"]
[null,"2011-05-22",47,"Manchester United ","4","2"," Blackpool"]
[null,"2011-05-22",47,"Newcastle Utd ","3","3"," West Brom"]
[null,"2011-05-22",47,"Stoke City ","0","1"," Wigan"]
[null,"2011-05-22",47,"Tottenham ","2","1"," Birmingham"]
[null,"2011-05-22",47,"West Ham ","0","3"," Sunderland"]
[null,"2011-05-22",47,"Wolves ","2","3"," Blackburn"]
[]
[null,"2011-05-17",46,"Manchester City ","3","0"," Stoke City"]
[null,"2011-05-15",46,"Arsenal ","1","2"," Aston Villa"]
[null,"2011-05-15",46,"Birmingham ","0","2"," Fulham"]
[null,"2011-05-15",46,"Chelsea ","2","2"," Newcastle Utd"]
[null,"2011-05-15",46,"Liverpool ","0","2"," Tottenham"]
[null,"2011-05-15",46,"Wigan ","3","2"," West Ham"]
[null,"2011-05-14",46,"Blackburn ","1","1"," Manchester United"]
[null,"2011-05-14",46,"Blackpool ","4","3"," Bolton"]
[null,"2011-05-14",46,"Sunderland ","1","3"," Wolves"]
[null,"2011-05-14",46,"West Brom ","1","0"," Everton"]
[]
[null,"2011-05-10",45,"Manchester City ","1","0"," Tottenham"]
[]
[null,"2011-05-09",44,"Fulham ","2","5"," Liverpool"]
[null,"2011-05-08",44,"Manchester United ","2","1"," Chelsea"]
[null,"2011-05-08",44,"Stoke City ","3","1"," Arsenal"]
[null,"2011-05-08",44,"Wolves ","3","1"," West Brom"]
[null,"2011-05-07",44,"Aston Villa ","1","1"," Wigan"]
[null,"2011-05-07",44,"Bolton ","1","2"," Sunderland"]
[null,"2011-05-07",44,"Everton ","2","1"," Manchester City"]
[null,"2011-05-07",44,"Newcastle Utd ","2","1"," Birmingham"]
[null,"2011-05-07",44,"Tottenham ","1","1"," Blackpool"]
[null,"2011-05-07",44,"West Ham ","1","1"," Blackburn"]
[]
[null,"2011-05-01",43,"Arsenal ","1","0"," Manchester United"]
[null,"2011-05-01",43,"Birmingham ","1","1"," Wolves"]
[null,"2011-05-01",43,"Liverpool ","3","0"," Newcastle Utd"]
[null,"2011-05-01",43,"Manchester City ","2","1"," West Ham"]
[null,"2011-04-30",43,"Blackburn ","1","0"," Bolton"]
[null,"2011-04-30",43,"Blackpool ","0","0"," Stoke City"]
[null,"2011-04-30",43,"Chelsea ","2","1"," Tottenham"]
[null,"2011-04-30",43,"Sunderland ","0","3"," Fulham"]
[null,"2011-04-30",43,"West Brom ","2","1"," Aston Villa"]
[null,"2011-04-30",43,"Wigan ","1","1"," Everton"]
[]
[null,"2011-04-27",42,"Fulham ","3","0"," Bolton"]
[null,"2011-04-26",42,"Stoke City ","3","0"," Wolves"]
[]
[null,"2011-04-25",41,"Blackburn ","0","1"," Manchester City"]
[null,"2011-04-24",41,"Bolton ","2","1"," Arsenal"]
[null,"2011-04-23",41,"Aston Villa ","1","1"," Stoke City"]
[null,"2011-04-23",41,"Blackpool ","1","1"," Newcastle Utd"]
[null,"2011-04-23",41,"Chelsea ","3","0"," West Ham"]
[null,"2011-04-23",41,"Liverpool ","5","0"," Birmingham"]
[null,"2011-04-23",41,"Manchester United ","1","0"," Everton"]
[null,"2011-04-23",41,"Sunderland ","4","2"," Wigan"]
[null,"2011-04-23",41,"Tottenham ","2","2"," West Brom"]
[null,"2011-04-23",41,"Wolves ","1","1"," Fulham"]
[]
[null,"2011-04-20",40,"Chelsea ","3","1"," Birmingham"]
[null,"2011-04-20",40,"Tottenham ","3","3"," Arsenal"]
[]
[null,"2011-04-19",39,"Newcastle Utd ","0","0"," Manchester United"]
[null,"2011-04-17",39,"Arsenal ","1","1"," Liverpool"]
[null,"2011-04-16",39,"Birmingham ","2","0"," Sunderland"]
[null,"2011-04-16",39,"Blackpool ","1","3"," Wigan"]
[null,"2011-04-16",39,"Everton ","2","0"," Blackburn"]
[null,"2011-04-16",39,"West Brom ","1","3"," Chelsea"]
[null,"2011-04-16",39,"West Ham ","1","2"," Aston Villa"]
[]
[null,"2011-04-11",38,"Liverpool ","3","0"," Manchester City"]
[null,"2011-04-10",38,"Aston Villa ","1","0"," Newcastle Utd"]
[null,"2011-04-10",38,"Blackpool ","1","3"," Arsenal"]
[null,"2011-04-09",38,"Blackburn ","1","1"," Birmingham"]
[null,"2011-04-09",38,"Bolton ","3","0"," West Ham"]
[null,"2011-04-09",38,"Chelsea ","1","0"," Wigan"]
[null,"2011-04-09",38,"Manchester United ","2","0"," Fulham"]
[null,"2011-04-09",38,"Sunderland ","2","3"," West Brom"]
[null,"2011-04-09",38,"Tottenham ","3","2"," Stoke City"]
[null,"2011-04-09",38,"Wolves ","0","3"," Everton"]
[]
[null,"2011-04-03",37,"Fulham ","3","0"," Blackpool"]
[null,"2011-04-03",37,"Manchester City ","5","0"," Sunderland"]
[null,"2011-04-02",37,"Arsenal ","0","0"," Blackburn"]
[null,"2011-04-02",37,"Birmingham ","2","1"," Bolton"]
[null,"2011-04-02",37,"Everton ","2","2"," Aston Villa"]
[null,"2011-04-02",37,"Newcastle Utd ","4","1"," Wolves"]
[null,"2011-04-02",37,"Stoke City ","1","1"," Chelsea"]
[null,"2011-04-02",37,"West Brom ","2","1"," Liverpool"]
[null,"2011-04-02",37,"West Ham ","2","4"," Manchester United"]
[null,"2011-04-02",37,"Wigan ","0","0"," Tottenham"]
[]
[null,"2011-03-20",36,"Chelsea ","2","0"," Manchester City"]
[null,"2011-03-20",36,"Sunderland ","0","2"," Liverpool"]
[null,"2011-03-19",36,"Aston Villa ","0","1"," Wolves"]
[null,"2011-03-19",36,"Blackburn ","2","2"," Blackpool"]
[null,"2011-03-19",36,"Everton ","2","1"," Fulham"]
[null,"2011-03-19",36,"Manchester United ","1","0"," Bolton"]
[null,"2011-03-19",36,"Stoke City ","4","0"," Newcastle Utd"]
[null,"2011-03-19",36,"Tottenham ","0","0"," West Ham"]
[null,"2011-03-19",36,"West Brom ","2","2"," Arsenal"]
[null,"2011-03-19",36,"Wigan ","2","1"," Birmingham"]
[]
[null,"2011-03-09",35,"Everton ","1","1"," Birmingham"]
[]
[null,"2011-03-07",34,"Blackpool ","1","3"," Chelsea"]
[null,"2011-03-06",34,"Liverpool ","3","1"," Manchester United"]
[null,"2011-03-06",34,"Wolves ","3","3"," Tottenham"]
[null,"2011-03-05",34,"Arsenal ","0","0"," Sunderland"]
[null,"2011-03-05",34,"Birmingham ","1","3"," West Brom"]
[null,"2011-03-05",34,"Bolton ","3","2"," Aston Villa"]
[null,"2011-03-05",34,"Fulham ","3","2"," Blackburn"]
[null,"2011-03-05",34,"Manchester City ","1","0"," Wigan"]
[null,"2011-03-05",34,"Newcastle Utd ","1","2"," Everton"]
[null,"2011-03-05",34,"West Ham ","3","0"," Stoke City"]
[]
[null,"2011-03-01",33,"Chelsea ","2","1"," Manchester United"]
[]
[null,"2011-02-28",32,"Stoke City ","1","1"," West Brom"]
[null,"2011-02-27",32,"Manchester City ","1","1"," Fulham"]
[null,"2011-02-27",32,"West Ham ","3","1"," Liverpool"]
[null,"2011-02-26",32,"Aston Villa ","4","1"," Blackburn"]
[null,"2011-02-26",32,"Everton ","2","0"," Sunderland"]
[null,"2011-02-26",32,"Newcastle Utd ","1","1"," Bolton"]
[null,"2011-02-26",32,"Wigan ","0","4"," Manchester United"]
[null,"2011-02-26",32,"Wolves ","4","0"," Blackpool"]
[]
[null,"2011-02-23",31,"Arsenal ","1","0"," Stoke City"]
[null,"2011-02-22",31,"Blackpool ","3","1"," Tottenham"]
[null,"2011-02-20",31,"West Brom ","1","1"," Wolves"]
[null,"2011-02-15",31,"Birmingham ","0","2"," Newcastle Utd"]
[]
[null,"2011-02-14",30,"Fulham ","0","0"," Chelsea"]
[null,"2011-02-13",30,"Bolton ","2","0"," Everton"]
[null,"2011-02-12",30,"Arsenal ","2","0"," Wolves"]
[null,"2011-02-12",30,"Birmingham ","1","0"," Stoke City"]
[null,"2011-02-12",30,"Blackburn ","0","0"," Newcastle Utd"]
[null,"2011-02-12",30,"Blackpool ","1","1"," Aston Villa"]
[null,"2011-02-12",30,"Liverpool ","1","1"," Wigan"]
[null,"2011-02-12",30,"Manchester United ","2","1"," Manchester City"]
[null,"2011-02-12",30,"Sunderland ","1","2"," Tottenham"]
[null,"2011-02-12",30,"West Brom ","3","3"," West Ham"]
[]
[null,"2011-02-06",29,"Chelsea ","0","1"," Liverpool"]
[null,"2011-02-06",29,"West Ham ","0","1"," Birmingham"]
[null,"2011-02-05",29,"Aston Villa ","2","2"," Fulham"]
[null,"2011-02-05",29,"Everton ","5","3"," Blackpool"]
[null,"2011-02-05",29,"Manchester City ","3","0"," West Brom"]
[null,"2011-02-05",29,"Newcastle Utd ","4","4"," Arsenal"]
[null,"2011-02-05",29,"Stoke City ","3","2"," Sunderland"]
[null,"2011-02-05",29,"Tottenham ","2","1"," Bolton"]
[null,"2011-02-05",29,"Wigan ","4","3"," Blackburn"]
[null,"2011-02-05",29,"Wolves ","2","1"," Manchester United"]
[]
[null,"2011-02-02",28,"Birmingham ","2","2"," Manchester City"]
[null,"2011-02-02",28,"Blackburn ","0","1"," Tottenham"]
[null,"2011-02-02",28,"Blackpool ","1","3"," West Ham"]
[null,"2011-02-02",28,"Bolton ","1","0"," Wolves"]
[null,"2011-02-02",28,"Fulham ","1","0"," Newcastle Utd"]
[null,"2011-02-02",28,"Liverpool ","2","0"," Stoke City"]
[null,"2011-02-01",28,"Arsenal ","2","1"," Everton"]
[null,"2011-02-01",28,"Manchester United ","3","1"," Aston Villa"]
[null,"2011-02-01",28,"Sunderland ","2","4"," Chelsea"]
[null,"2011-02-01",28,"West Brom ","2","2"," Wigan"]
[]
[null,"2011-01-26",27,"Liverpool ","1","0"," Fulham"]
[null,"2011-01-25",27,"Wigan ","1","2"," Aston Villa"]
[]
[null,"2011-01-25",26,"Blackpool ","2","3"," Manchester United"]
[]
[null,"2011-01-24",25,"Bolton ","0","4"," Chelsea"]
[null,"2011-01-23",25,"Blackburn ","2","0"," West Brom"]
[null,"2011-01-22",25,"Arsenal ","3","0"," Wigan"]
[null,"2011-01-22",25,"Aston Villa ","1","0"," Manchester City"]
[null,"2011-01-22",25,"Blackpool ","1","2"," Sunderland"]
[null,"2011-01-22",25,"Everton ","2","2"," West Ham"]
[null,"2011-01-22",25,"Fulham ","2","0"," Stoke City"]
[null,"2011-01-22",25,"Manchester United ","5","0"," Birmingham"]
[null,"2011-01-22",25,"Newcastle Utd ","1","1"," Tottenham"]
[null,"2011-01-22",25,"Wolves ","0","3"," Liverpool"]
[]
[null,"2011-01-16",24,"Birmingham ","1","1"," Aston Villa"]
[null,"2011-01-16",24,"Liverpool ","2","2"," Everton"]
[null,"2011-01-16",24,"Sunderland ","1","1"," Newcastle Utd"]
[null,"2011-01-16",24,"Tottenham ","0","0"," Manchester United"]
[null,"2011-01-15",24,"Chelsea ","2","0"," Blackburn"]
[null,"2011-01-15",24,"Manchester City ","4","3"," Wolves"]
[null,"2011-01-15",24,"Stoke City ","2","0"," Bolton"]
[null,"2011-01-15",24,"West Brom ","3","2"," Blackpool"]
[null,"2011-01-15",24,"West Ham ","0","3"," Arsenal"]
[null,"2011-01-15",24,"Wigan ","1","1"," Fulham"]
[]
[null,"2011-01-12",23,"Blackpool ","2","1"," Liverpool"]
[]
[null,"2011-01-05",22,"Arsenal ","0","0"," Manchester City"]
[null,"2011-01-05",22,"Aston Villa ","0","1"," Sunderland"]
[null,"2011-01-05",22,"Blackburn ","3","1"," Liverpool"]
[null,"2011-01-05",22,"Bolton ","1","1"," Wigan"]
[null,"2011-01-05",22,"Everton ","2","1"," Tottenham"]
[null,"2011-01-05",22,"Newcastle Utd ","5","0"," West Ham"]
[null,"2011-01-05",22,"Wolves ","1","0"," Chelsea"]
[null,"2011-01-04",22,"Blackpool ","1","2"," Birmingham"]
[null,"2011-01-04",22,"Fulham ","3","0"," West Brom"]
[null,"2011-01-04",22,"Manchester United ","2","1"," Stoke City"]
[]
[null,"2011-01-02",21,"Chelsea ","3","3"," Aston Villa"]
[null,"2011-01-02",21,"Wigan ","0","1"," Newcastle Utd"]
[null,"2011-01-01",21,"Birmingham ","0","3"," Arsenal"]
[null,"2011-01-01",21,"Liverpool ","2","1"," Bolton"]
[null,"2011-01-01",21,"Manchester City ","1","0"," Blackpool"]
[null,"2011-01-01",21,"Stoke City ","2","0"," Everton"]
[null,"2011-01-01",21,"Sunderland ","3","0"," Blackburn"]
[null,"2011-01-01",21,"Tottenham ","1","0"," Fulham"]
[null,"2011-01-01",21,"West Brom ","1","2"," Manchester United"]
[null,"2011-01-01",21,"West Ham ","2","0"," Wolves"]
[]
[null,"2010-12-29",20,"Chelsea ","1","0"," Bolton"]
[null,"2010-12-29",20,"Liverpool ","0","1"," Wolves"]
[null,"2010-12-29",20,"Wigan ","2","2"," Arsenal"]
[null,"2010-12-28",20,"Birmingham ","1","1"," Manchester United"]
[null,"2010-12-28",20,"Manchester City ","4","0"," Aston Villa"]
[null,"2010-12-28",20,"Stoke City ","0","2"," Fulham"]
[null,"2010-12-28",20,"Sunderland ","0","2"," Blackpool"]
[null,"2010-12-28",20,"Tottenham ","2","0"," Newcastle Utd"]
[null,"2010-12-28",20,"West Brom ","1","3"," Blackburn"]
[null,"2010-12-28",20,"West Ham ","1","1"," Everton"]
[]
[null,"2010-12-27",19,"Arsenal ","3","1"," Chelsea"]
[null,"2010-12-26",19,"Aston Villa ","1","2"," Tottenham"]
[null,"2010-12-26",19,"Blackburn ","0","2"," Stoke City"]
[null,"2010-12-26",19,"Bolton ","2","0"," West Brom"]
[null,"2010-12-26",19,"Fulham ","1","3"," West Ham"]
[null,"2010-12-26",19,"Manchester United ","2","0"," Sunderland"]
[null,"2010-12-26",19,"Newcastle Utd ","1","3"," Manchester City"]
[null,"2010-12-26",19,"Wolves ","1","2"," Wigan"]
[]
[null,"2010-12-20",18,"Manchester City ","1","2"," Everton"]
[null,"2010-12-18",18,"Blackburn ","1","1"," West Ham"]
[null,"2010-12-18",18,"Sunderland ","1","0"," Bolton"]
[]
[null,"2010-12-13",17,"Manchester United ","1","0"," Arsenal"]
[null,"2010-12-12",17,"Bolton ","2","1"," Blackburn"]
[null,"2010-12-12",17,"Tottenham ","1","1"," Chelsea"]
[null,"2010-12-12",17,"Wolves ","1","0"," Birmingham"]
[null,"2010-12-11",17,"Aston Villa ","2","1"," West Brom"]
[null,"2010-12-11",17,"Everton ","0","0"," Wigan"]
[null,"2010-12-11",17,"Fulham ","0","0"," Sunderland"]
[null,"2010-12-11",17,"Newcastle Utd ","3","1"," Liverpool"]
[null,"2010-12-11",17,"Stoke City ","0","1"," Blackpool"]
[null,"2010-12-11",17,"West Ham ","1","3"," Manchester City"]
[]
[null,"2010-12-06",16,"Liverpool ","3","0"," Aston Villa"]
[null,"2010-12-05",16,"Sunderland ","1","0"," West Ham"]
[null,"2010-12-05",16,"West Brom ","3","1"," Newcastle Utd"]
[null,"2010-12-04",16,"Arsenal ","2","1"," Fulham"]
[null,"2010-12-04",16,"Birmingham ","1","1"," Tottenham"]
[null,"2010-12-04",16,"Blackburn ","3","0"," Wolves"]
[null,"2010-12-04",16,"Chelsea ","1","1"," Everton"]
[null,"2010-12-04",16,"Manchester City ","1","0"," Bolton"]
[null,"2010-12-04",16,"Wigan ","2","2"," Stoke City"]
[]
[null,"2010-11-28",15,"Newcastle Utd ","1","1"," Chelsea"]
[null,"2010-11-28",15,"Tottenham ","2","1"," Liverpool"]
[null,"2010-11-27",15,"Aston Villa ","2","4"," Arsenal"]
[null,"2010-11-27",15,"Bolton ","2","2"," Blackpool"]
[null,"2010-11-27",15,"Everton ","1","4"," West Brom"]
[null,"2010-11-27",15,"Fulham ","1","1"," Birmingham"]
[null,"2010-11-27",15,"Manchester United ","7","1"," Blackburn"]
[null,"2010-11-27",15,"Stoke City ","1","1"," Manchester City"]
[null,"2010-11-27",15,"West Ham ","3","1"," Wigan"]
[null,"2010-11-27",15,"Wolves ","3","2"," Sunderland"]
[]
[null,"2010-11-22",14,"Sunderland ","2","2"," Everton"]
[null,"2010-11-21",14,"Blackburn ","2","0"," Aston Villa"]
[null,"2010-11-21",14,"Fulham ","1","4"," Manchester City"]
[null,"2010-11-20",14,"Arsenal ","2","3"," Tottenham"]
[null,"2010-11-20",14,"Birmingham ","1","0"," Chelsea"]
[null,"2010-11-20",14,"Blackpool ","2","1"," Wolves"]
[null,"2010-11-20",14,"Bolton ","5","1"," Newcastle Utd"]
[null,"2010-11-20",14,"Liverpool ","3","0"," West Ham"]
[null,"2010-11-20",14,"Manchester United ","2","0"," Wigan"]
[null,"2010-11-20",14,"West Brom ","0","3"," Stoke City"]
[]
[null,"2010-11-14",13,"Chelsea ","0","3"," Sunderland"]
[null,"2010-11-14",13,"Everton ","1","2"," Arsenal"]
[null,"2010-11-13",13,"Aston Villa ","2","2"," Manchester United"]
[null,"2010-11-13",13,"Manchester City ","0","0"," Birmingham"]
[null,"2010-11-13",13,"Newcastle Utd ","0","0"," Fulham"]
[null,"2010-11-13",13,"Stoke City ","2","0"," Liverpool"]
[null,"2010-11-13",13,"Tottenham ","4","2"," Blackburn"]
[null,"2010-11-13",13,"West Ham ","0","0"," Blackpool"]
[null,"2010-11-13",13,"Wigan ","1","0"," West Brom"]
[null,"2010-11-13",13,"Wolves ","2","3"," Bolton"]
[]
[null,"2010-11-10",12,"Aston Villa ","3","2"," Blackpool"]
[null,"2010-11-10",12,"Chelsea ","1","0"," Fulham"]
[null,"2010-11-10",12,"Everton ","1","1"," Bolton"]
[null,"2010-11-10",12,"Manchester City ","0","0"," Manchester United"]
[null,"2010-11-10",12,"Newcastle Utd ","1","2"," Blackburn"]
[null,"2010-11-10",12,"West Ham ","2","2"," West Brom"]
[null,"2010-11-10",12,"Wigan ","1","1"," Liverpool"]
[null,"2010-11-10",12,"Wolves ","0","2"," Arsenal"]
[null,"2010-11-09",12,"Stoke City ","3","2"," Birmingham"]
[null,"2010-11-09",12,"Tottenham ","1","1"," Sunderland"]
[]
[null,"2010-11-07",11,"Arsenal ","0","1"," Newcastle Utd"]
[null,"2010-11-07",11,"Liverpool ","2","0"," Chelsea"]
[null,"2010-11-07",11,"West Brom ","0","2"," Manchester City"]
[null,"2010-11-06",11,"Birmingham ","2","2"," West Ham"]
[null,"2010-11-06",11,"Blackburn ","2","1"," Wigan"]
[null,"2010-11-06",11,"Blackpool ","2","2"," Everton"]
[null,"2010-11-06",11,"Bolton ","4","2"," Tottenham"]
[null,"2010-11-06",11,"Fulham ","1","1"," Aston Villa"]
[null,"2010-11-06",11,"Manchester United ","2","1"," Wolves"]
[null,"2010-11-06",11,"Sunderland ","2","0"," Stoke City"]
[]
[null,"2010-11-01",10,"Blackpool ","2","1"," West Brom"]
[null,"2010-10-31",10,"Aston Villa ","0","0"," Birmingham"]
[null,"2010-10-31",10,"Bolton ","0","1"," Liverpool"]
[null,"2010-10-31",10,"Newcastle Utd ","5","1"," Sunderland"]
[null,"2010-10-30",10,"Arsenal ","1","0"," West Ham"]
[null,"2010-10-30",10,"Blackburn ","1","2"," Chelsea"]
[null,"2010-10-30",10,"Everton ","1","0"," Stoke City"]
[null,"2010-10-30",10,"Fulham ","2","0"," Wigan"]
[null,"2010-10-30",10,"Manchester United ","2","0"," Tottenham"]
[null,"2010-10-30",10,"Wolves ","2","1"," Manchester City"]
[]
[null,"2010-10-24",9,"Liverpool ","2","1"," Blackburn"]
[null,"2010-10-24",9,"Manchester City ","0","3"," Arsenal"]
[null,"2010-10-24",9,"Stoke City ","1","2"," Manchester United"]
[null,"2010-10-23",9,"Birmingham ","2","0"," Blackpool"]
[null,"2010-10-23",9,"Chelsea ","2","0"," Wolves"]
[null,"2010-10-23",9,"Sunderland ","1","0"," Aston Villa"]
[null,"2010-10-23",9,"Tottenham ","1","1"," Everton"]
[null,"2010-10-23",9,"West Brom ","2","1"," Fulham"]
[null,"2010-10-23",9,"West Ham ","1","2"," Newcastle Utd"]
[null,"2010-10-23",9,"Wigan ","1","1"," Bolton"]
[]
[null,"2010-10-18",8,"Blackburn ","0","0"," Sunderland"]
[null,"2010-10-17",8,"Blackpool ","2","3"," Manchester City"]
[null,"2010-10-17",8,"Everton ","2","0"," Liverpool"]
[null,"2010-10-16",8,"Arsenal ","2","1"," Birmingham"]
[null,"2010-10-16",8,"Aston Villa ","0","0"," Chelsea"]
[null,"2010-10-16",8,"Bolton ","2","1"," Stoke City"]
[null,"2010-10-16",8,"Fulham ","1","2"," Tottenham"]
[null,"2010-10-16",8,"Manchester United ","2","2"," West Brom"]
[null,"2010-10-16",8,"Newcastle Utd ","2","2"," Wigan"]
[null,"2010-10-16",8,"Wolves ","1","1"," West Ham"]
[]
[null,"2010-10-03",7,"Chelsea ","2","0"," Arsenal"]
[null,"2010-10-03",7,"Liverpool ","1","2"," Blackpool"]
[null,"2010-10-03",7,"Manchester City ","2","1"," Newcastle Utd"]
[null,"2010-10-02",7,"Birmingham ","0","2"," Everton"]
[null,"2010-10-02",7,"Stoke City ","1","0"," Blackburn"]
[null,"2010-10-02",7,"Sunderland ","0","0"," Manchester United"]
[null,"2010-10-02",7,"Tottenham ","2","1"," Aston Villa"]
[null,"2010-10-02",7,"West Brom ","1","1"," Bolton"]
[null,"2010-10-02",7,"West Ham ","1","1"," Fulham"]
[null,"2010-10-02",7,"Wigan ","2","0"," Wolves"]
[]
[null,"2010-09-26",6,"Bolton ","2","2"," Manchester United"]
[null,"2010-09-26",6,"Newcastle Utd ","1","2"," Stoke City"]
[null,"2010-09-26",6,"Wolves ","1","2"," Aston Villa"]
[null,"2010-09-25",6,"Arsenal ","2","3"," West Brom"]
[null,"2010-09-25",6,"Birmingham ","0","0"," Wigan"]
[null,"2010-09-25",6,"Blackpool ","1","2"," Blackburn"]
[null,"2010-09-25",6,"Fulham ","0","0"," Everton"]
[null,"2010-09-25",6,"Liverpool ","2","2"," Sunderland"]
[null,"2010-09-25",6,"Manchester City ","1","0"," Chelsea"]
[null,"2010-09-25",6,"West Ham ","1","0"," Tottenham"]
[]
[null,"2010-09-19",5,"Chelsea ","4","0"," Blackpool"]
[null,"2010-09-19",5,"Manchester United ","3","2"," Liverpool"]
[null,"2010-09-19",5,"Wigan ","0","2"," Manchester City"]
[null,"2010-09-18",5,"Aston Villa ","1","1"," Bolton"]
[null,"2010-09-18",5,"Blackburn ","1","1"," Fulham"]
[null,"2010-09-18",5,"Everton ","0","1"," Newcastle Utd"]
[null,"2010-09-18",5,"Stoke City ","1","1"," West Ham"]
[null,"2010-09-18",5,"Sunderland ","1","1"," Arsenal"]
[null,"2010-09-18",5,"Tottenham ","3","1"," Wolves"]
[null,"2010-09-18",5,"West Brom ","3","1"," Birmingham"]
[]
[null,"2010-09-13",4,"Stoke City ","2","1"," Aston Villa"]
[null,"2010-09-12",4,"Birmingham ","0","0"," Liverpool"]
[null,"2010-09-11",4,"Arsenal ","4","1"," Bolton"]
[null,"2010-09-11",4,"Everton ","3","3"," Manchester United"]
[null,"2010-09-11",4,"Fulham ","2","1"," Wolves"]
[null,"2010-09-11",4,"Manchester City ","1","1"," Blackburn"]
[null,"2010-09-11",4,"Newcastle Utd ","0","2"," Blackpool"]
[null,"2010-09-11",4,"West Brom ","1","1"," Tottenham"]
[null,"2010-09-11",4,"West Ham ","1","3"," Chelsea"]
[null,"2010-09-11",4,"Wigan ","1","1"," Sunderland"]
[]
[null,"2010-08-29",3,"Aston Villa ","1","0"," Everton"]
[null,"2010-08-29",3,"Bolton ","2","2"," Birmingham"]
[null,"2010-08-29",3,"Liverpool ","1","0"," West Brom"]
[null,"2010-08-29",3,"Sunderland ","1","0"," Manchester City"]
[null,"2010-08-28",3,"Blackburn ","1","2"," Arsenal"]
[null,"2010-08-28",3,"Blackpool ","2","2"," Fulham"]
[null,"2010-08-28",3,"Chelsea ","2","0"," Stoke City"]
[null,"2010-08-28",3,"Manchester United ","3","0"," West Ham"]
[null,"2010-08-28",3,"Tottenham ","0","1"," Wigan"]
[null,"2010-08-28",3,"Wolves ","1","1"," Newcastle Utd"]
[]
[null,"2010-08-23",2,"Manchester City ","3","0"," Liverpool"]
[null,"2010-08-22",2,"Fulham ","2","2"," Manchester United"]
[null,"2010-08-22",2,"Newcastle Utd ","6","0"," Aston Villa"]
[null,"2010-08-21",2,"Arsenal ","6","0"," Blackpool"]
[null,"2010-08-21",2,"Birmingham ","2","1"," Blackburn"]
[null,"2010-08-21",2,"Everton ","1","1"," Wolves"]
[null,"2010-08-21",2,"Stoke City ","1","2"," Tottenham"]
[null,"2010-08-21",2,"West Brom ","1","0"," Sunderland"]
[null,"2010-08-21",2,"West Ham ","1","3"," Bolton"]
[null,"2010-08-21",2,"Wigan ","0","6"," Chelsea"]
[]
[null,"2010-08-16",1,"Manchester United ","3","0"," Newcastle Utd"]
[null,"2010-08-15",1,"Liverpool ","1","1"," Arsenal"]
[null,"2010-08-14",1,"Aston Villa ","3","0"," West Ham"]
[null,"2010-08-14",1,"Blackburn ","1","0"," Everton"]
[null,"2010-08-14",1,"Bolton ","0","0"," Fulham"]
[null,"2010-08-14",1,"Chelsea ","6","0"," West Brom"]
[null,"2010-08-14",1,"Sunderland ","2","2"," Birmingham"]
[null,"2010-08-14",1,"Tottenham ","0","0"," Manchester City"]
[null,"2010-08-14",1,"Wigan ","0","4"," Blackpool"]
[null,"2010-08-14",1,"Wolves ","2","1"," Stoke City"]

{"sheet":"Sheet2","index":2,"n_rows":47,"n_cols":9,"rows_kept":47,"cut":false,"hidden":false,"merged":[]}
["home team","-","-","away team"]
[{"$f":"IF(A1=0,0,INDEX(Sheet1!D$1:D$65536,MATCH($F$5,Sheet1!$C$1:$C$65536,)+ROW(A1)-1))","v":"Manchester United "},{"$f":"IF(B1=0,0,INDEX(Sheet1!E$1:E$65536,MATCH($F$5,Sheet1!$C$1:$C$65536,)+ROW(B1)-1))","v":"3"},{"$f":"IF(C1=0,0,INDEX(Sheet1!F$1:F$65536,MATCH($F$5,Sheet1!$C$1:$C$65536,)+ROW(C1)-1))","v":"0"},{"$f":"IF(D1=0,0,INDEX(Sheet1!G$1:G$65536,MATCH($F$5,Sheet1!$C$1:$C$65536,)+ROW(D1)-1))","v":" Newcastle Utd"}]
[{"$f":"IF(A2=0,0,INDEX(Sheet1!D$1:D$65536,MATCH($F$5,Sheet1!$C$1:$C$65536,)+ROW(A2)-1))","v":"Liverpool "},{"$f":"IF(B2=0,0,INDEX(Sheet1!E$1:E$65536,MATCH($F$5,Sheet1!$C$1:$C$65536,)+ROW(B2)-1))","v":"1"},{"$f":"IF(C2=0,0,INDEX(Sheet1!F$1:F$65536,MATCH($F$5,Sheet1!$C$1:$C$65536,)+ROW(C2)-1))","v":"1"},{"$f":"IF(D2=0,0,INDEX(Sheet1!G$1:G$65536,MATCH($F$5,Sheet1!$C$1:$C$65536,)+ROW(D2)-1))","v":" Arsenal"},null,null,null,null,1]
[{"$f":"IF(A3=0,0,INDEX(Sheet1!D$1:D$65536,MATCH($F$5,Sheet1!$C$1:$C$65536,)+ROW(A3)-1))","v":"Aston Villa "},{"$f":"IF(B3=0,0,INDEX(Sheet1!E$1:E$65536,MATCH($F$5,Sheet1!$C$1:$C$65536,)+ROW(B3)-1))","v":"3"},{"$f":"IF(C3=0,0,INDEX(Sheet1!F$1:F$65536,MATCH($F$5,Sheet1!$C$1:$C$65536,)+ROW(C3)-1))","v":"0"},{"$f":"IF(D3=0,0,INDEX(Sheet1!G$1:G$65536,MATCH($F$5,Sheet1!$C$1:$C$65536,)+ROW(D3)-1))","v":" West Ham"},null,"round",null,null,2]
[{"$f":"IF(A4=0,0,INDEX(Sheet1!D$1:D$65536,MATCH($F$5,Sheet1!$C$1:$C$65536,)+ROW(A4)-1))","v":"Blackburn "},{"$f":"IF(B4=0,0,INDEX(Sheet1!E$1:E$65536,MATCH($F$5,Sheet1!$C$1:$C$65536,)+ROW(B4)-1))","v":"1"},{"$f":"IF(C4=0,0,INDEX(Sheet1!F$1:F$65536,MATCH($F$5,Sheet1!$C$1:$C$65536,)+ROW(C4)-1))","v":"0"},{"$f":"IF(D4=0,0,INDEX(Sheet1!G$1:G$65536,MATCH($F$5,Sheet1!$C$1:$C$65536,)+ROW(D4)-1))","v":" Everton"},null,1,null,null,3]
[{"$f":"IF(A5=0,0,INDEX(Sheet1!D$1:D$65536,MATCH($F$5,Sheet1!$C$1:$C$65536,)+ROW(A5)-1))","v":"Bolton "},{"$f":"IF(B5=0,0,INDEX(Sheet1!E$1:E$65536,MATCH($F$5,Sheet1!$C$1:$C$65536,)+ROW(B5)-1))","v":"0"},{"$f":"IF(C5=0,0,INDEX(Sheet1!F$1:F$65536,MATCH($F$5,Sheet1!$C$1:$C$65536,)+ROW(C5)-1))","v":"0"},{"$f":"IF(D5=0,0,INDEX(Sheet1!G$1:G$65536,MATCH($F$5,Sheet1!$C$1:$C$65536,)+ROW(D5)-1))","v":" Fulham"},null,null,null,null,4]
[{"$f":"IF(A6=0,0,INDEX(Sheet1!D$1:D$65536,MATCH($F$5,Sheet1!$C$1:$C$65536,)+ROW(A6)-1))","v":"Chelsea "},{"$f":"IF(B6=0,0,INDEX(Sheet1!E$1:E$65536,MATCH($F$5,Sheet1!$C$1:$C$65536,)+ROW(B6)-1))","v":"6"},{"$f":"IF(C6=0,0,INDEX(Sheet1!F$1:F$65536,MATCH($F$5,Sheet1!$C$1:$C$65536,)+ROW(C6)-1))","v":"0"},{"$f":"IF(D6=0,0,INDEX(Sheet1!G$1:G$65536,MATCH($F$5,Sheet1!$C$1:$C$65536,)+ROW(D6)-1))","v":" West Brom"},null,null,null,null,5]
[{"$f":"IF(A7=0,0,INDEX(Sheet1!D$1:D$65536,MATCH($F$5,Sheet1!$C$1:$C$65536,)+ROW(A7)-1))","v":"Sunderland "},{"$f":"IF(B7=0,0,INDEX(Sheet1!E$1:E$65536,MATCH($F$5,Sheet1!$C$1:$C$65536,)+ROW(B7)-1))","v":"2"},{"$f":"IF(C7=0,0,INDEX(Sheet1!F$1:F$65536,MATCH($F$5,Sheet1!$C$1:$C$65536,)+ROW(C7)-1))","v":"2"},{"$f":"IF(D7=0,0,INDEX(Sheet1!G$1:G$65536,MATCH($F$5,Sheet1!$C$1:$C$65536,)+ROW(D7)-1))","v":" Birmingham"},null,null,null,null,6]
[{"$f":"IF(A8=0,0,INDEX(Sheet1!D$1:D$65536,MATCH($F$5,Sheet1!$C$1:$C$65536,)+ROW(A8)-1))","v":"Tottenham "},{"$f":"IF(B8=0,0,INDEX(Sheet1!E$1:E$65536,MATCH($F$5,Sheet1!$C$1:$C$65536,)+ROW(B8)-1))","v":"0"},{"$f":"IF(C8=0,0,INDEX(Sheet1!F$1:F$65536,MATCH($F$5,Sheet1!$C$1:$C$65536,)+ROW(C8)-1))","v":"0"},{"$f":"IF(D8=0,0,INDEX(Sheet1!G$1:G$65536,MATCH($F$5,Sheet1!$C$1:$C$65536,)+ROW(D8)-1))","v":" Manchester City"},null,null,null,null,7]
[{"$f":"IF(A9=0,0,INDEX(Sheet1!D$1:D$65536,MATCH($F$5,Sheet1!$C$1:$C$65536,)+ROW(A9)-1))","v":"Wigan "},{"$f":"IF(B9=0,0,INDEX(Sheet1!E$1:E$65536,MATCH($F$5,Sheet1!$C$1:$C$65536,)+ROW(B9)-1))","v":"0"},{"$f":"IF(C9=0,0,INDEX(Sheet1!F$1:F$65536,MATCH($F$5,Sheet1!$C$1:$C$65536,)+ROW(C9)-1))","v":"4"},{"$f":"IF(D9=0,0,INDEX(Sheet1!G$1:G$65536,MATCH($F$5,Sheet1!$C$1:$C$65536,)+ROW(D9)-1))","v":" Blackpool"},null,null,null,null,8]
[{"$f":"IF(A10=0,0,INDEX(Sheet1!D$1:D$65536,MATCH($F$5,Sheet1!$C$1:$C$65536,)+ROW(A10)-1))","v":"Wolves "},{"$f":"IF(B10=0,0,INDEX(Sheet1!E$1:E$65536,MATCH($F$5,Sheet1!$C$1:$C$65536,)+ROW(B10)-1))","v":"2"},{"$f":"IF(C10=0,0,INDEX(Sheet1!F$1:F$65536,MATCH($F$5,Sheet1!$C$1:$C$65536,)+ROW(C10)-1))","v":"1"},{"$f":"IF(D10=0,0,INDEX(Sheet1!G$1:G$65536,MATCH($F$5,Sheet1!$C$1:$C$65536,)+ROW(D10)-1))","v":" Stoke City"},null,null,null,null,9]
[null,null,null,null,null,null,null,null,10]
[null,null,null,null,null,null,null,null,11]
[null,null,null,null,null,null,null,null,12]
[null,null,null,null,null,null,null,null,13]
[null,null,null,null,null,null,null,null,14]
[null,null,null,null,null,null,null,null,15]
[null,null,null,null,null,null,null,null,16]
[null,null,null,null,null,null,null,null,17]
[null,null,null,null,null,null,null,null,18]
[null,null,null,null,null,null,null,null,19]
[null,null,null,null,null,null,null,null,20]
[null,null,null,null,null,null,null,null,21]
[null,null,null,null,null,null,null,null,22]
[null,null,null,null,null,null,null,null,23]
[null,null,null,null,null,null,null,null,24]
[null,null,null,null,null,null,null,null,25]
[null,null,null,null,null,null,null,null,26]
[null,null,null,null,null,null,null,null,27]
[null,null,null,null,null,null,null,null,28]
[null,null,null,null,null,null,null,null,29]
[null,null,null,null,null,null,null,null,30]
[null,null,null,null,null,null,null,null,31]
[null,null,null,null,null,null,null,null,32]
[null,null,null,null,null,null,null,null,33]
[null,null,null,null,null,null,null,null,34]
[null,null,null,null,null,null,null,null,35]
[null,null,null,null,null,null,null,null,36]
[null,null,null,null,null,null,null,null,37]
[null,null,null,null,null,null,null,null,38]
[null,null,null,null,null,null,null,null,39]
[null,null,null,null,null,null,null,null,40]
[null,null,null,null,null,null,null,null,41]
[null,null,null,null,null,null,null,null,42]
[null,null,null,null,null,null,null,null,43]
[null,null,null,null,null,null,null,null,44]
[null,null,null,null,null,null,null,null,45]