{"text_format":"1","workbook":"xlsx","n_sheets":2,"sheets":["СВХ","отчет"],"not_rendered":{"charts":0,"images":0,"macros":1,"external_links":1,"defined_names":8,"comments":0,"pivot_tables":0},"unopened":[],"bounds":{"document_bytes":16777216,"sheet_cells":100000,"rows_first":2000,"rows_last":500,"rows_between":2000,"halvings":0,"cell_chars":16384,"cell_head_chars":4096},"cells_cut":0,"cells_raw":0,"read":"whole","date_system":"1900"}

{"sheet":"СВХ","index":0,"n_rows":17,"n_cols":7,"rows_kept":17,"cut":false,"hidden":false,"merged":[[0,6,2,6],[0,1,2,1],[0,2,2,2],[0,3,2,3],[0,5,2,5],[0,4,2,4]]}
[null,"№","Дата прибытия","Дата убытия (ручн.)","Текущая дата (автом.)","описание","описание"]
[]
[]
[null,1,null,null,{"$f":"NOW()","v":"2015-02-02T11:12:10.280"}]
[{"$f":"IF(C5,MAX($A$4:A4)+1)","v":1},2,"2013-12-19","2014-02-02",{"$f":"NOW()","v":"2015-02-02T11:12:10.280"},{"$f":"IF(D5>0,INT(D5-C5)+1,INT(E5-C5)+1)","v":46}]
[{"$f":"IF(C6,MAX($A$4:A5)+1)","v":2},3,"2013-12-20","2014-03-03","2015-02-02T11:12:10.280",74]
[{"$f":"IF(C7,MAX($A$4:A6)+1)","v":3},4,"2013-12-21","2014-04-04","2015-02-02T11:12:10.280",105]
[{"$f":"IF(C8,MAX($A$4:A7)+1)","v":4},5,"2013-12-22","2014-05-05","2015-02-02T11:12:10.280",135]
[{"$f":"IF(C9,MAX($A$4:A8)+1)","v":5},6,"2013-12-23","2014-06-06","2015-02-02T11:12:10.280",166]
[{"$f":"IF(C10,MAX($A$4:A9)+1)","v":6},7,"2014-12-19",null,"2015-02-02T11:12:10.280",46]
[{"$f":"IF(C11,MAX($A$4:A10)+1)","v":false},8,null,null,"2015-02-02T11:12:10.280",42038]
[{"$f":"IF(C12,MAX($A$4:A11)+1)","v":false},9,null,null,"2015-02-02T11:12:10.280",42038]
[{"$f":"IF(C13,MAX($A$4:A12)+1)","v":false},10,null,null,"2015-02-02T11:12:10.280",42038]
[{"$f":"IF(C14,MAX($A$4:A13)+1)","v":false},11,null,null,"2015-02-02T11:12:10.280",42038]
[{"$f":"IF(C15,MAX($A$4:A14)+1)","v":false},12,null,null,"2015-02-02T11:12:10.280",42038]
[{"$f":"IF(C16,MAX($A$4:A15)+1)","v":false},13,null,null,"2015-02-02T11:12:10.280",42038]
[{"$f":"IF(C17,MAX($A$4:A16)+1)","v":false}]

{"sheet":"отчет","index":1,"n_rows":12,"n_cols":7,"rows_kept":12,"cut":false,"hidden":false,"merged":[[0,6,2,6],[0,5,2,5],[0,0,2,0],[0,1,2,1],[0,2,2,2],[0,3,2,3],[0,4,2,4]]}
["№","Дата прибытия","Дата убытия (ручн.)","Текущая дата (автом.)","Срок хранения","Найменование товара","Кол-во товара"]
[]
[]
[{"$f":"IF(MAX(СВХ!$A$5:$A$100)<ROW(A1),\"\",VLOOKUP(ROW(A1),СВХ!$A$5:$G$100,COLUMN(B1),))","v":2},{"$f":"IF(MAX(СВХ!$A$5:$A$100)<ROW(B1),\"\",VLOOKUP(ROW(B1),СВХ!$A$5:$G$100,COLUMN(C1),))","v":"2013-12-19"},{"$f":"IF(MAX(СВХ!$A$5:$A$100)<ROW(C1),\"\",VLOOKUP(ROW(C1),СВХ!$A$5:$G$100,COLUMN(D1),))","v":"2014-02-02"},{"$f":"IF(MAX(СВХ!$A$5:$A$100)<ROW(D1),\"\",VLOOKUP(ROW(D1),СВХ!$A$5:$G$100,COLUMN(E1),))","v":42037.466785648146}]
[{"$f":"IF(MAX(СВХ!$A$5:$A$100)<ROW(A2),\"\",VLOOKUP(ROW(A2),СВХ!$A$5:$G$100,COLUMN(B2),))","v":3},{"$f":"IF(MAX(СВХ!$A$5:$A$100)<ROW(B2),\"\",VLOOKUP(ROW(B2),СВХ!$A$5:$G$100,COLUMN(C2),))","v":"2013-12-20"},{"$f":"IF(MAX(СВХ!$A$5:$A$100)<ROW(C2),\"\",VLOOKUP(ROW(C2),СВХ!$A$5:$G$100,COLUMN(D2),))","v":"2014-03-03"},{"$f":"IF(MAX(СВХ!$A$5:$A$100)<ROW(D2),\"\",VLOOKUP(ROW(D2),СВХ!$A$5:$G$100,COLUMN(E2),))","v":42037.466785648146}]
[{"$f":"IF(MAX(СВХ!$A$5:$A$100)<ROW(A3),\"\",VLOOKUP(ROW(A3),СВХ!$A$5:$G$100,COLUMN(B3),))","v":4},{"$f":"IF(MAX(СВХ!$A$5:$A$100)<ROW(B3),\"\",VLOOKUP(ROW(B3),СВХ!$A$5:$G$100,COLUMN(C3),))","v":"2013-12-21"},{"$f":"IF(MAX(СВХ!$A$5:$A$100)<ROW(C3),\"\",VLOOKUP(ROW(C3),СВХ!$A$5:$G$100,COLUMN(D3),))","v":"2014-04-04"},{"$f":"IF(MAX(СВХ!$A$5:$A$100)<ROW(D3),\"\",VLOOKUP(ROW(D3),СВХ!$A$5:$G$100,COLUMN(E3),))","v":42037.466785648146}]
[{"$f":"IF(MAX(СВХ!$A$5:$A$100)<ROW(A4),\"\",VLOOKUP(ROW(A4),СВХ!$A$5:$G$100,COLUMN(B4),))","v":5},{"$f":"IF(MAX(СВХ!$A$5:$A$100)<ROW(B4),\"\",VLOOKUP(ROW(B4),СВХ!$A$5:$G$100,COLUMN(C4),))","v":"2013-12-22"},{"$f":"IF(MAX(СВХ!$A$5:$A$100)<ROW(C4),\"\",VLOOKUP(ROW(C4),СВХ!$A$5:$G$100,COLUMN(D4),))","v":"2014-05-05"},{"$f":"IF(MAX(СВХ!$A$5:$A$100)<ROW(D4),\"\",VLOOKUP(ROW(D4),СВХ!$A$5:$G$100,COLUMN(E4),))","v":42037.466785648146}]
[{"$f":"IF(MAX(СВХ!$A$5:$A$100)<ROW(A5),\"\",VLOOKUP(ROW(A5),СВХ!$A$5:$G$100,COLUMN(B5),))","v":6},{"$f":"IF(MAX(СВХ!$A$5:$A$100)<ROW(B5),\"\",VLOOKUP(ROW(B5),СВХ!$A$5:$G$100,COLUMN(C5),))","v":"2013-12-23"},{"$f":"IF(MAX(СВХ!$A$5:$A$100)<ROW(C5),\"\",VLOOKUP(ROW(C5),СВХ!$A$5:$G$100,COLUMN(D5),))","v":"2014-06-06"},{"$f":"IF(MAX(СВХ!$A$5:$A$100)<ROW(D5),\"\",VLOOKUP(ROW(D5),СВХ!$A$5:$G$100,COLUMN(E5),))","v":42037.466785648146}]
[{"$f":"IF(MAX(СВХ!$A$5:$A$100)<ROW(A6),\"\",VLOOKUP(ROW(A6),СВХ!$A$5:$G$100,COLUMN(B6),))","v":7},{"$f":"IF(MAX(СВХ!$A$5:$A$100)<ROW(B6),\"\",VLOOKUP(ROW(B6),СВХ!$A$5:$G$100,COLUMN(C6),))","v":"2014-12-19"},{"$f":"IF(MAX(СВХ!$A$5:$A$100)<ROW(C6),\"\",VLOOKUP(ROW(C6),СВХ!$A$5:$G$100,COLUMN(D6),))","v":"00:00:00"},{"$f":"IF(MAX(СВХ!$A$5:$A$100)<ROW(D6),\"\",VLOOKUP(ROW(D6),СВХ!$A$5:$G$100,COLUMN(E6),))","v":42037.466785648146}]
[{"$f":"IF(MAX(СВХ!$A$5:$A$100)<ROW(A7),\"\",VLOOKUP(ROW(A7),СВХ!$A$5:$G$100,COLUMN(B7),))","v":""},{"$f":"IF(MAX(СВХ!$A$5:$A$100)<ROW(B7),\"\",VLOOKUP(ROW(B7),СВХ!$A$5:$G$100,COLUMN(C7),))","v":""},{"$f":"IF(MAX(СВХ!$A$5:$A$100)<ROW(C7),\"\",VLOOKUP(ROW(C7),СВХ!$A$5:$G$100,COLUMN(D7),))","v":""},{"$f":"IF(MAX(СВХ!$A$5:$A$100)<ROW(D7),\"\",VLOOKUP(ROW(D7),СВХ!$A$5:$G$100,COLUMN(E7),))","v":""}]
[{"$f":"IF(MAX(СВХ!$A$5:$A$100)<ROW(A8),\"\",VLOOKUP(ROW(A8),СВХ!$A$5:$G$100,COLUMN(B8),))","v":""},{"$f":"IF(MAX(СВХ!$A$5:$A$100)<ROW(B8),\"\",VLOOKUP(ROW(B8),СВХ!$A$5:$G$100,COLUMN(C8),))","v":""},{"$f":"IF(MAX(СВХ!$A$5:$A$100)<ROW(C8),\"\",VLOOKUP(ROW(C8),СВХ!$A$5:$G$100,COLUMN(D8),))","v":""},{"$f":"IF(MAX(СВХ!$A$5:$A$100)<ROW(D8),\"\",VLOOKUP(ROW(D8),СВХ!$A$5:$G$100,COLUMN(E8),))","v":""}]
[{"$f":"IF(MAX(СВХ!$A$5:$A$100)<ROW(A9),\"\",VLOOKUP(ROW(A9),СВХ!$A$5:$G$100,COLUMN(B9),))","v":""},{"$f":"IF(MAX(СВХ!$A$5:$A$100)<ROW(B9),\"\",VLOOKUP(ROW(B9),СВХ!$A$5:$G$100,COLUMN(C9),))","v":""},{"$f":"IF(MAX(СВХ!$A$5:$A$100)<ROW(C9),\"\",VLOOKUP(ROW(C9),СВХ!$A$5:$G$100,COLUMN(D9),))","v":""},{"$f":"IF(MAX(СВХ!$A$5:$A$100)<ROW(D9),\"\",VLOOKUP(ROW(D9),СВХ!$A$5:$G$100,COLUMN(E9),))","v":""}]