{"text_format":"1","workbook":"xlsx","n_sheets":3,"sheets":["Комплектация","Ввод данных","Расчёт комплектации"],"not_rendered":{"charts":0,"images":0,"macros":0,"external_links":0,"defined_names":2,"comments":0,"pivot_tables":0},"unopened":[],"bounds":{"document_bytes":16777216,"sheet_cells":100000,"rows_first":2000,"rows_last":500,"rows_between":2000,"halvings":0,"cell_chars":16384,"cell_head_chars":4096},"cells_cut":0,"cells_raw":0,"read":"whole","date_system":"1900"}

{"sheet":"Комплектация","index":0,"n_rows":65536,"n_cols":4,"rows_kept":65536,"cut":false,"hidden":false,"merged":[]}
["Наименование продукта","Колпак","Флакон","Ящик"]
["Био лайн  Мягкая пенка для умывания 300мл.","63 кор. перлам/2","66 салат.перлам",1508]
["Шампунь для жирных и склонных к жирности","63 кор. перлам/2","81 салат.перлам",87]
["шампунь для нормальных волос 400мл","63 кор. перлам/2","81 салат.перлам",87]
["шампунь для сухих и повреждённых волос","63 кор. перлам/2","81 салат.перлам",87]
[]
["Blis Гель для стирки детского белья 1000мл","Покупной","Покупной",35]
["Blis Гель для стирки цветного белья конентрат автомат 1000мл","Покупной","Покупной",35]
["Blis Жидкое средство для плит и микроволновых печей 700 мл","Покупной","Покупной",55]
["Blis Ликвидатор засоров для канализационных труб 750 мл","Покупной","Покупной",35]
["Blis Ополаскиватель для белья \"Sensetive\" для чувств. кожи 1000 мл","Покупной","Покупной",305]
["Blis Ополаскиватель для белья  Утренняя свежесть","Покупной","Покупной",305]
["Blis пятновыводитель для чистки ковров и мягкой мебели 475 мл","Покупной","Покупной"]
["Blis Средство для ручной и машинной стирки 1000 мл","Покупной","Покупной"]
["Blis чистящий спрей для ванной 475мл","Покупной","Покупной"]
[]
["CLEAR&BEAUTY Шампунь Блеск и восстановление ",35,25]
[" CLEAR&BEAUTY Густота и объём",23,52]
[" CLEAR&BEAUTY  Питание и укрепление",79,13]
[]
["EXOTIC FRECH Крем-гель д/душа Айва и ваниль 500мл Н",88,87]
["EXOTIC FRECH Крем-гель д/душа Гуава и Гибисккус 500 мл Н",88,88]
["EXOTIC FRECH Крем-гель д/душа Лайм и Лемонграсс 500 мл Н",88,89]
["EXOTIC FRECH Крем-гель д/душа Личи и Пион 500 мл Н",88,90]
["EXOTIC FRECH Крем-гель д/душа Манго и Магнолия 500 мл Н",88,91]
[]
["GAMER для продвинутых мальчиков ГЕЛЬ-Пена для душа Двойной бонус "]
["GAMER для продвинутых мальчиков Шампунь для волос"]
[]
[]
[]
[]
[]
[]
[]
[]
[]
[]
[]
[]
[]
[]
[]
[]
[]
[]
[]
[]
[]
[]
[]
[]
[]
[]
[]
[]
[]
[]
[]
[]
[]
[]
[]
[]
[]
[]
[]
[]
[]
[]
[]
[]
[]
[]
[]
[]
[]
[]
[]
[]
[]
[]
[]
[]
[]
[]
[]
[]
[]
[]
[]
[]
[]
[]
[]
[]
[]
[]
[]
[]
[]
[]
[]
[]
[]
[]
[]
[]
[]
[]
[]
[]
[]
[]
[]
[]
[]
[]
[]
[]
[]
[]
[]
[]
[]
[]
[]
[]
[]
[]
[]
[]
[]
[]
[]
[]
[]
[]
[]
[]
[]
[]
[]
[]
[]
[]
[]
[]
[]
[]
[]
[]
[]
[]
[]
[]
[]
[]
[]
[]
[]
[]
[]
[]
[]
[]
[]
[]
[]
[]
[]
[]
[]
[]
[]
[]
[]
[]
[]
[]
[]
[]
[]
[]
[]
[]
[]
[]
[]
[]
[]
[]
[]
[]
[]
[]
[]
[]
[]
[]
[]
[]
[]
[]
[]
[]
[]
[]
[]
[]
[]
[]
[]
[]
[]
[]
[]
[]
[]
[]
[]
[]
[]
[]
[]
[]
[]
[]
[]
[]
[]
[]
[]
[]
[]
[]
[]
[]
[]
[]
[]
[]
[]
[]
[]
[]
[]
[]
[]
[]
[]
[]
[]
[]
[]
[]
[]
[]
[]
[]
[]
[]
[]
[]
[]
[]
[]
[]
[]
[]
[]
[]
[]
[]
[]
[]
[]
[]
[]
[]
[]
[]
[]
[]
[]
[]
[]
[]
[]
[]
[]
[]
[]
[]
[]
[]
[]
[]
[]
[]
[]
[]
[]
[]
[]
[]
[]
[]
[]
[]
[]
[]
[]
[]
[]
[]
[]
[]
[]
[]
[]
[]
[]
[]
[]
[]
[]
[]
[]
[]
[]
[]
[]
[]
[]
[]
[]
[]
[]
[]
[]
[]
[]
[]
[]
[]
[]
[]
[]
[]
[]
[]
[]
[]
[]
[]
[]
[]
[]
[]
[]
[]
[]
[]
[]
[]
[]
[]
[]
[]
[]
[]
[]
[]
[]
[]
[]
[]
[]
[]
[]
[]
[]
[]
[]
[]
[]
[]
[]
[]
[]
[]
[]
[]
[]
[]
[]
[]
[]
[]
{"$rows_left_out":65137}
{"sheet":"Ввод данных","index":1,"n_rows":23,"n_cols":11,"rows_kept":23,"cut":false,"hidden":false,"merged":[]}
["Наименование","Колпак","Флакон","Ящик ","В наличии колпак","Надо колпака","В наличии флакон","Надо флакона","Итого колпака","Итого флакона"]
["CLEAR&BEAUTY Шампунь Блеск и восстановление ",{"$f":"VLOOKUP($A$2, Комплектация!$A$2:$D$800,2,0)","v":35},{"$f":"VLOOKUP($A$2, Комплектация!$A$2:$D$800,3,0)","v":25},{"$f":"VLOOKUP($A$2, Комплектация!$A$2:$D$800,4,0)","v":0},500,5200,0,5200,{"$f":"F2-E2","v":4700},{"$f":"H2-G2","v":5200},{"$f":"SUMIF($B$2:$B$15,B2,$H$2:$H$15)","v":5200}]
["Био лайн  Мягкая пенка для умывания 300мл.",{"$f":"VLOOKUP($A$3, Комплектация!$A$2:$D$800,2,0)","v":"63 кор. перлам/2"},{"$f":"VLOOKUP($A$3, Комплектация!$A$2:$D$800,3,0)","v":"66 салат.перлам"},{"$f":"VLOOKUP($A$3, Комплектация!$A$2:$D$800,4,0)","v":1508},1200,10400,{"$f":"170*13","v":2210},10400,{"$f":"F3-E3","v":9200},{"$f":"H3-G3","v":8190},{"$f":"SUMIF($B$2:$B$15,B3,$H$2:$H$15)","v":15600}]
["Био лайн  Мягкая пенка для умывания 300мл.",{"$f":"VLOOKUP($A$4, Комплектация!$A$2:$D$800,2,0)","v":"63 кор. перлам/2"},{"$f":"VLOOKUP($A$4, Комплектация!$A$2:$D$800,3,0)","v":"66 салат.перлам"},{"$f":"VLOOKUP($A$4, Комплектация!$A$2:$D$800,4,0)","v":1508},0,5200,0,5200,5200,5200,15600]
[" CLEAR&BEAUTY Густота и объём",{"$f":"VLOOKUP($A$5, Комплектация!$A$2:$D$800,2,0)","v":23},{"$f":"VLOOKUP($A$5, Комплектация!$A$2:$D$800,3,0)","v":52},{"$f":"VLOOKUP($A$5, Комплектация!$A$2:$D$800,4,0)","v":0},null,null,null,null,0,0,0]
[" CLEAR&BEAUTY  Питание и укрепление",{"$f":"VLOOKUP($A$6, Комплектация!$A$2:$D$800,2,0)","v":79},{"$f":"VLOOKUP($A$6, Комплектация!$A$2:$D$800,3,0)","v":13},{"$f":"VLOOKUP($A$6, Комплектация!$A$2:$D$800,4,0)","v":0},null,null,null,null,0,0,0]
["Blis Гель для стирки цветного белья конентрат автомат 1000мл",{"$f":"VLOOKUP($A$7, Комплектация!$A$2:$D$800,2,0)","v":"Покупной"},{"$f":"VLOOKUP($A$7, Комплектация!$A$2:$D$800,3,0)","v":"Покупной"},{"$f":"VLOOKUP($A$7, Комплектация!$A$2:$D$800,4,0)","v":35},null,null,null,null,0,0,0]
[" CLEAR&BEAUTY  Питание и укрепление",{"$f":"VLOOKUP($A$8, Комплектация!$A$2:$D$800,2,0)","v":79},{"$f":"VLOOKUP($A$8, Комплектация!$A$2:$D$800,3,0)","v":13},{"$f":"VLOOKUP($A$8, Комплектация!$A$2:$D$800,4,0)","v":0},null,null,null,null,0,0,0]
["CLEAR&BEAUTY Шампунь Блеск и восстановление ",{"$f":"VLOOKUP($A$9, Комплектация!$A$2:$D$800,2,0)","v":35},{"$f":"VLOOKUP($A$9, Комплектация!$A$2:$D$800,3,0)","v":25},{"$f":"VLOOKUP($A$9, Комплектация!$A$2:$D$800,4,0)","v":0},null,null,null,null,0,0,5200]
["Био лайн  Мягкая пенка для умывания 300мл.",{"$f":"VLOOKUP($A$10, Комплектация!$A$2:$D$800,2,0)","v":"63 кор. перлам/2"},{"$f":"VLOOKUP($A$10, Комплектация!$A$2:$D$800,3,0)","v":"66 салат.перлам"},{"$f":"VLOOKUP($A$10, Комплектация!$A$2:$D$800,4,0)","v":1508},null,null,null,null,0,0,15600]
["Шампунь для жирных и склонных к жирности",{"$f":"VLOOKUP($A$11, Комплектация!$A$2:$D$800,2,0)","v":"63 кор. перлам/2"},{"$f":"VLOOKUP($A$11, Комплектация!$A$2:$D$800,3,0)","v":"81 салат.перлам"},{"$f":"VLOOKUP($A$11, Комплектация!$A$2:$D$800,4,0)","v":87},null,null,null,null,0,0,15600]
["GAMER для продвинутых мальчиков Шампунь для волос",{"$f":"VLOOKUP($A$12, Комплектация!$A$2:$D$800,2,0)","v":0},{"$f":"VLOOKUP($A$12, Комплектация!$A$2:$D$800,3,0)","v":0},{"$f":"VLOOKUP($A$12, Комплектация!$A$2:$D$800,4,0)","v":0},null,null,null,null,0,0,0]
[" CLEAR&BEAUTY Густота и объём",{"$f":"VLOOKUP($A$13, Комплектация!$A$2:$D$800,2,0)","v":23},{"$f":"VLOOKUP($A$13, Комплектация!$A$2:$D$800,3,0)","v":52},{"$f":"VLOOKUP($A$13, Комплектация!$A$2:$D$800,4,0)","v":0},null,null,null,null,0,0,0]
["EXOTIC FRECH Крем-гель д/душа Айва и ваниль 500мл Н",{"$f":"VLOOKUP($A$14, Комплектация!$A$2:$D$800,2,0)","v":88},{"$f":"VLOOKUP($A$14, Комплектация!$A$2:$D$800,3,0)","v":87},{"$f":"VLOOKUP($A$14, Комплектация!$A$2:$D$800,4,0)","v":0},null,null,null,null,0,0,0]
["EXOTIC FRECH Крем-гель д/душа Манго и Магнолия 500 мл Н",{"$f":"VLOOKUP($A$15, Комплектация!$A$2:$D$800,2,0)","v":88},{"$f":"VLOOKUP($A$15, Комплектация!$A$2:$D$800,3,0)","v":91},{"$f":"VLOOKUP($A$15, Комплектация!$A$2:$D$800,4,0)","v":0},null,null,null,null,0,0,0]
[]
[]
[]
[]
[]
[]
[null,"вводимые значения имеющейся комплектации в наличии"]
[null,"вводимые значения требуемого кол-ва"]

{"sheet":"Расчёт комплектации","index":2,"n_rows":1,"n_cols":4,"rows_kept":1,"cut":false,"hidden":false,"merged":[]}
["Наименование флакона","Кол-во флакона","Наименование колпака","Кол-во колпака"]