{"text_format":"1","workbook":"xlsx","n_sheets":4,"sheets":["Элементы1","Элементы2","Элементы3","цены"],"not_rendered":{"charts":0,"images":0,"macros":0,"external_links":0,"defined_names":7,"comments":3,"pivot_tables":0},"unopened":[],"bounds":{"document_bytes":16777216,"sheet_cells":100000,"rows_first":2000,"rows_last":500,"rows_between":2000,"halvings":0,"cell_chars":16384,"cell_head_chars":4096},"cells_cut":0,"cells_raw":0,"read":"whole","date_system":"1900"}

{"sheet":"Элементы1","index":0,"n_rows":95,"n_cols":23,"rows_kept":95,"cut":false,"hidden":false,"merged":[[94,18,94,19],[94,20,94,21],[94,0,94,3],[94,6,94,8],[94,10,94,11],[94,12,94,13],[94,14,94,15],[94,16,94,17],[93,0,93,2],[93,10,93,11],[93,12,93,13],[93,14,93,15],[93,16,93,17],[93,18,93,19],[93,20,93,21],[92,0,92,2],[92,10,92,11],[92,12,92,13],[92,14,92,15],[92,16,92,17],[92,18,92,19],[89,22,90,22],[90,0,90,2],[91,0,91,2],[91,10,91,11],[91,12,91,13],[91,14,91,15],[92,20,92,21],[91,16,91,17],[91,18,91,19],[91,20,91,21],[89,10,90,11],[89,12,90,13],[89,14,90,15],[89,16,90,17],[89,18,90,19],[89,20,90,21],[82,19,83,21],[84,16,85,18],[84,19,85,21],[86,16,88,18],[86,19,88,21],[88,0,88,15],[89,0,89,3],[89,4,90,4],[89,5,90,5],[89,6,89,8],[89,9,90,9],[75,19,75,20],[75,22,75,23],[76,16,76,18],[76,19,76,21],[77,16,77,18],[77,19,77,21],[78,16,79,18],[78,19,79,21],[80,16,81,18],[80,19,81,21],[72,0,72,2],[72,3,72,15],[73,0,73,2],[73,3,73,15],[74,0,74,6],[74,8,74,15],[74,16,74,17],[75,0,87,7],[75,8,87,15],[75,16,75,17],[82,16,83,18],[69,10,69,11],[69,12,69,13],[69,14,69,15],[69,16,69,17],[69,18,69,19],[67,18,67,19],[69,20,69,21],[70,0,70,3],[70,6,70,8],[70,10,70,11],[70,12,70,13],[70,14,70,15],[70,16,70,17],[70,18,70,19],[70,20,70,21],[69,0,69,2],[67,0,67,2],[67,10,67,11],[67,12,67,13],[67,14,67,15],[67,16,67,17],[67,20,67,21],[68,0,68,2],[68,10,68,11],[68,12,68,13],[68,14,68,15],[68,16,68,17],[68,18,68,19],[68,20,68,21],[58,19,59,21],[60,16,61,18],[60,19,61,21],[61,22,61,23],[62,16,64,18],[62,19,64,21],[62,22,64,23],[64,0,64,15],[65,0,65,3],[65,4,66,4],[65,5,66,5],[65,6,65,8],[65,9,66,9],[65,10,66,11],[65,12,66,13],[65,14,66,15],[65,16,66,17],[65,18,66,19],[65,20,66,21],[65,22,66,22],[66,0,66,2],[51,19,51,20],[51,22,51,23],[52,16,52,18],[52,19,52,21],[53,16,53,18],[53,19,53,21],[54,16,55,18],[54,19,55,21],[56,16,57,18],[56,19,57,21],[48,0,48,2],[48,3,48,15],[49,0,49,2],[49,3,49,15],[50,0,50,6],[50,8,50,15],[50,16,50,17],[51,0,63,7],[51,8,63,15],[51,16,51,17],[58,16,59,18],[46,0,46,3],[46,6,46,8],[46,10,46,11],[46,12,46,13],[46,14,46,15],[46,16,46,17],[46,18,46,19],[46,20,46,21],[45,0,45,2],[44,0,44,2],[44,10,44,11],[44,12,44,13],[44,14,44,15],[44,16,44,17],[44,18,44,19],[44,20,44,21],[45,10,45,11],[45,12,45,13],[45,14,45,15],[45,16,45,17],[45,18,45,19],[45,20,45,21],[41,18,42,19],[41,20,42,21],[41,22,42,22],[42,0,42,2],[43,0,43,2],[43,10,43,11],[43,12,43,13],[43,14,43,15],[43,16,43,17],[43,20,43,21],[43,18,43,19],[41,0,41,3],[41,4,42,4],[41,5,42,5],[41,6,41,8],[41,9,42,9],[41,10,42,11],[41,12,42,13],[41,14,42,15],[41,16,42,17],[26,16,26,17],[27,0,39,7],[27,8,39,15],[27,16,27,17],[30,16,31,18],[38,16,40,18],[27,19,27,20],[27,22,27,23],[28,16,28,18],[28,19,28,21],[29,16,29,18],[29,19,29,21],[30,19,31,21],[32,16,33,18],[32,19,33,21],[34,16,35,18],[34,19,35,21],[36,16,37,18],[36,19,37,21],[38,19,40,21],[40,0,40,15],[24,0,24,2],[24,3,24,15],[25,0,25,2],[25,3,25,15],[22,0,22,3],[22,6,22,8],[22,10,22,11],[22,12,22,13],[26,0,26,6],[26,8,26,15],[20,0,20,2],[20,10,20,11],[20,12,20,13],[20,14,20,15],[20,16,20,17],[20,18,20,19],[22,14,22,15],[22,16,22,17],[20,20,20,21],[21,0,21,2],[21,10,21,11],[21,12,21,13],[21,14,21,15],[21,16,21,17],[21,18,21,19],[21,20,21,21],[22,18,22,19],[22,20,22,21],[14,19,16,21],[16,0,16,15],[17,22,18,22],[18,0,18,2],[19,0,19,2],[19,10,19,11],[19,12,19,13],[19,14,19,15],[19,16,19,17],[19,18,19,19],[19,20,19,21],[17,10,18,11],[6,19,7,21],[8,16,9,18],[8,19,9,21],[10,16,11,18],[10,19,11,21],[2,16,2,17],[3,16,3,17],[3,19,3,20],[17,0,17,3],[17,4,18,4],[17,5,18,5],[17,6,17,8],[17,9,18,9],[6,16,7,18],[3,0,15,7],[3,8,15,15],[17,12,18,13],[17,14,18,15],[17,16,18,17],[17,18,18,19],[17,20,18,21],[12,16,13,18],[12,19,13,21],[14,16,16,18],[2,8,2,15],[3,22,3,23],[4,16,4,18],[4,19,4,21],[5,16,5,18],[5,19,5,21],[0,0,0,2],[0,3,0,15],[1,0,1,2],[1,3,1,15],[2,0,2,6]]}
["Артикул",null,null,"ЭтСп-001"]
["Наименование",null,null,"Червонка"]
["Фото",null,null,null,null,null,null,null,"Описание",null,null,null,null,null,null,null,"Доставка материала",null,1.07,"а",{"$f":"(T15-S23)/S23","v":{"$error":"#NAME?"}}]
[null,null,null,null,null,null,null,null,"Червонка длинна 415мм, высота 110мм. По обеим сторонам одинаковый загиб",null,null,null,null,null,null,null,"Длина изделия",null,null,"Ширина изделия",null,null,"Высота изделия"]
[null,null,null,null,null,null,null,null,null,null,null,null,null,null,null,null,"Стоимость кв.м. изделия",null,null,{"$f":"_xlfn.CEILING.MATH(T15/(V4*Y4),1)","v":{"$error":"#NAME?"}}]
[null,null,null,null,null,null,null,null,null,null,null,null,null,null,null,null,"Стоимость п.м. изделия",null,null,{"$f":"_xlfn.CEILING.MATH(T15/(S4*2+V4*2),1)","v":{"$error":"#NAME?"}}]
[null,null,null,null,null,null,null,null,null,null,null,null,null,null,null,null,"Чистая прибыль",null,null,{"$f":"T15-T9-T11-T13-S23","v":{"$error":"#NAME?"}}]
[]
[null,null,null,null,null,null,null,null,null,null,null,null,null,null,null,null,"Заработная плата",null,null,{"$f":"(T15-_xlfn.CEILING.MATH(S23,5))*20%","v":{"$error":"#NAME?"}}]
[]
[null,null,null,null,null,null,null,null,null,null,null,null,null,null,null,null,"Расходники",null,null,{"$f":"(T15-_xlfn.CEILING.MATH(S23,5))*7%","v":{"$error":"#NAME?"}}]
[]
[null,null,null,null,null,null,null,null,null,null,null,null,null,null,null,null,"Аренда, электричество",null,null,{"$f":"(T15-_xlfn.CEILING.MATH(S23,5))*10%","v":{"$error":"#NAME?"}}]
[]
[null,null,null,null,null,null,null,null,null,null,null,null,null,null,null,null,"ИТОГОВАЯ ЦЕНА",null,null,{"$f":"_xlfn.CEILING.MATH(O23,5)","v":{"$error":"#NAME?"}}]
[]
["Калькуляция"]
["Наименование материала",null,null,null,"Статус","Ед. изм","Размер заготовки (мм)",null,null,"Размер заготовки (мм)","Количество заготовок (шт)",null,"Цена (руб/м.п.)",null,"Стоимость (руб)",null,"Количество материала факт(м.п.)",null,"Стоимость фактическая (руб)",null,"Количество материала (м.п.)",null,"Вес"]
["Расходный материал",null,null,"Описание",null,null,"Длина","Ширина","Площадь"]
["Профильная  труба15*15*1,5",null,null,null,{"$f":"IF(ISNA(VLOOKUP(A20,цены!$B$3:$H$500,7)),\"\",VLOOKUP(A20,цены!$B$3:$H$500,7,0))","v":"Материал"},{"$f":"IF(ISNA(VLOOKUP(A20,цены!$B$3:$D$500,2)),\"\",VLOOKUP(A20,цены!$B$3:$D$500,2,0))","v":"м.п."},null,null,{"$f":"_xlfn.CEILING.MATH(G20*H20/1000000,0.01)","v":{"$error":"#NAME?"}},690,1,null,{"$f":"IF(ISNA(VLOOKUP(A20,цены!$B$3:$D$500,3)),\"0\",VLOOKUP(A20,цены!$B$3:$D$500,3,0))","v":32},null,{"$f":"IF(F20=\"м2\",I20*K20,_xlfn.CEILING.MATH(J20*K20,500)/1000)*$S$3*M20*IF(E20=\"Материал\",1+VLOOKUP($T$3,цены!$J$3:$K$11,2,0),1)","v":{"$error":"#NAME?"}},null,{"$f":"IF(F20=\"м2\",G20*H20*K20/1000000,J20*K20/1000)","v":0.69},null,{"$f":"Q20*M20","v":22.08},null,{"$f":"IF(F20=\"м2\",_xlfn.CEILING.MATH(G20*H20*K20/1000000,0.1),_xlfn.CEILING.MATH(J20*K20,500)/1000)","v":{"$error":"#NAME?"}},null,{"$f":"IF(ISNA(VLOOKUP(A20,цены!$B$3:$E$500,4)),\"\",VLOOKUP(A20,цены!$B$3:$E$500,4,0)*Q20)","v":0.44159999999999999}]
{"$rows_left_out":76}
{"sheet":"Элементы2","index":1,"n_rows":95,"n_cols":23,"rows_kept":95,"cut":false,"hidden":false,"merged":[[94,18,94,19],[94,20,94,21],[94,0,94,3],[94,6,94,8],[94,10,94,11],[94,12,94,13],[94,14,94,15],[94,16,94,17],[92,20,92,21],[93,0,93,2],[93,10,93,11],[93,12,93,13],[93,14,93,15],[93,16,93,17],[93,18,93,19],[93,20,93,21],[92,0,92,2],[92,10,92,11],[92,12,92,13],[92,14,92,15],[92,16,92,17],[92,18,92,19],[89,22,90,22],[90,0,90,2],[91,0,91,2],[91,10,91,11],[91,12,91,13],[91,14,91,15],[91,16,91,17],[91,18,91,19],[91,20,91,21],[89,10,90,11],[89,12,90,13],[89,14,90,15],[89,16,90,17],[89,18,90,19],[89,20,90,21],[84,16,85,18],[84,19,85,21],[86,16,88,18],[86,19,88,21],[88,0,88,15],[89,0,89,3],[89,4,90,4],[89,5,90,5],[89,6,89,8],[89,9,90,9],[78,16,79,18],[78,19,79,21],[80,16,81,18],[80,19,81,21],[82,16,83,18],[82,19,83,21],[74,16,74,17],[75,0,87,7],[75,8,87,15],[75,16,75,17],[75,19,75,20],[75,22,75,23],[76,16,76,18],[76,19,76,21],[77,16,77,18],[77,19,77,21],[72,0,72,2],[72,3,72,15],[73,0,73,2],[73,3,73,15],[74,0,74,6],[74,8,74,15],[69,20,69,21],[70,0,70,3],[70,6,70,8],[70,10,70,11],[70,12,70,13],[70,14,70,15],[70,16,70,17],[70,18,70,19],[70,20,70,21],[69,0,69,2],[69,10,69,11],[69,12,69,13],[69,14,69,15],[69,16,69,17],[69,18,69,19],[67,18,67,19],[67,20,67,21],[68,0,68,2],[68,10,68,11],[68,12,68,13],[68,14,68,15],[68,16,68,17],[68,18,68,19],[68,20,68,21],[65,16,66,17],[65,18,66,19],[65,20,66,21],[65,22,66,22],[66,0,66,2],[67,0,67,2],[67,10,67,11],[67,12,67,13],[67,14,67,15],[67,16,67,17],[64,0,64,15],[65,0,65,3],[65,4,66,4],[65,5,66,5],[65,6,65,8],[65,9,66,9],[65,10,66,11],[65,12,66,13],[65,14,66,15],[60,16,61,18],[60,19,61,21],[61,22,61,23],[62,16,64,18],[62,19,64,21],[62,22,64,23],[54,16,55,18],[54,19,55,21],[56,16,57,18],[56,19,57,21],[58,16,59,18],[58,19,59,21],[50,16,50,17],[51,0,63,7],[51,8,63,15],[51,16,51,17],[51,19,51,20],[51,22,51,23],[52,16,52,18],[52,19,52,21],[53,16,53,18],[53,19,53,21],[48,0,48,2],[48,3,48,15],[49,0,49,2],[49,3,49,15],[50,0,50,6],[50,8,50,15],[45,20,45,21],[46,0,46,3],[46,6,46,8],[46,10,46,11],[46,12,46,13],[46,14,46,15],[46,16,46,17],[46,18,46,19],[46,20,46,21],[45,0,45,2],[45,10,45,11],[45,12,45,13],[45,14,45,15],[45,16,45,17],[45,18,45,19],[43,18,43,19],[43,20,43,21],[44,0,44,2],[44,10,44,11],[44,12,44,13],[44,14,44,15],[44,16,44,17],[44,18,44,19],[44,20,44,21],[41,16,42,17],[41,18,42,19],[41,20,42,21],[41,22,42,22],[42,0,42,2],[43,0,43,2],[43,10,43,11],[43,12,43,13],[43,14,43,15],[43,16,43,17],[38,19,40,21],[40,0,40,15],[41,0,41,3],[41,4,42,4],[41,5,42,5],[41,6,41,8],[41,9,42,9],[41,10,42,11],[41,12,42,13],[41,14,42,15],[30,19,31,21],[32,16,33,18],[32,19,33,21],[34,16,35,18],[34,19,35,21],[36,16,37,18],[36,19,37,21],[27,19,27,20],[27,22,27,23],[28,16,28,18],[28,19,28,21],[29,16,29,18],[29,19,29,21],[26,0,26,6],[26,8,26,15],[26,16,26,17],[27,0,39,7],[27,8,39,15],[27,16,27,17],[30,16,31,18],[38,16,40,18],[22,18,22,19],[22,20,22,21],[24,0,24,2],[24,3,24,15],[25,0,25,2],[25,3,25,15],[22,0,22,3],[22,6,22,8],[22,10,22,11],[22,12,22,13],[22,14,22,15],[22,16,22,17],[20,20,20,21],[21,0,21,2],[21,10,21,11],[21,12,21,13],[21,14,21,15],[21,16,21,17],[21,18,21,19],[21,20,21,21],[20,0,20,2],[20,10,20,11],[20,12,20,13],[20,14,20,15],[20,16,20,17],[20,18,20,19],[17,22,18,22],[18,0,18,2],[19,0,19,2],[19,10,19,11],[19,12,19,13],[19,14,19,15],[19,16,19,17],[19,18,19,19],[19,20,19,21],[17,10,18,11],[17,12,18,13],[17,14,18,15],[17,16,18,17],[17,18,18,19],[17,20,18,21],[12,16,13,18],[12,19,13,21],[14,16,16,18],[14,19,16,21],[16,0,16,15],[17,0,17,3],[17,4,18,4],[17,5,18,5],[17,6,17,8],[17,9,18,9],[6,16,7,18],[6,19,7,21],[8,16,9,18],[8,19,9,21],[10,16,11,18],[10,19,11,21],[2,16,2,17],[3,0,15,7],[3,8,15,15],[3,16,3,17],[3,19,3,20],[3,22,3,23],[4,16,4,18],[4,19,4,21],[5,16,5,18],[5,19,5,21],[0,0,0,2],[0,3,0,15],[1,0,1,2],[1,3,1,15],[2,0,2,6],[2,8,2,15]]}
["Артикул",null,null,"ЭтСп-0013",null,null,null,null,null,null,null,null,null,null,null,null,{"$f":"(Элементы1!Все=Элементы1!Тек)","v":{"$error":"#NAME?"}}]
["Наименование",null,null,"Червонка"]
["Фото",null,null,null,null,null,null,null,"Описание",null,null,null,null,null,null,null,"Доставка материала",null,1.07,"а",{"$f":"(T15-S23)/S23","v":{"$error":"#NAME?"}}]
[null,null,null,null,null,null,null,null,"Червонка длинна 415мм, высота 110мм. По обеим сторонам одинаковый загиб",null,null,null,null,null,null,null,"Длина изделия",null,null,"Ширина изделия",null,null,"Высота изделия"]
[null,null,null,null,null,null,null,null,null,null,null,null,null,null,null,null,"Стоимость кв.м. изделия",null,null,{"$f":"_xlfn.CEILING.MATH(T15/(V4*Y4),1)","v":{"$error":"#NAME?"}}]
[null,null,null,null,null,null,null,null,null,null,null,null,null,null,null,null,"Стоимость п.м. изделия",null,null,{"$f":"_xlfn.CEILING.MATH(T15/(S4*2+V4*2),1)","v":{"$error":"#NAME?"}}]
[null,null,null,null,null,null,null,null,null,null,null,null,null,null,null,null,"Чистая прибыль",null,null,{"$f":"T15-T9-T11-T13-S23","v":{"$error":"#NAME?"}}]
[]
[null,null,null,null,null,null,null,null,null,null,null,null,null,null,null,null,"Заработная плата",null,null,{"$f":"(T15-_xlfn.CEILING.MATH(S23,5))*20%","v":{"$error":"#NAME?"}}]
[]
[null,null,null,null,null,null,null,null,null,null,null,null,null,null,null,null,"Расходники",null,null,{"$f":"(T15-_xlfn.CEILING.MATH(S23,5))*7%","v":{"$error":"#NAME?"}}]
[]
[null,null,null,null,null,null,null,null,null,null,null,null,null,null,null,null,"Аренда, электричество",null,null,{"$f":"(T15-_xlfn.CEILING.MATH(S23,5))*10%","v":{"$error":"#NAME?"}}]
[]
[null,null,null,null,null,null,null,null,null,null,null,null,null,null,null,null,"ИТОГОВАЯ ЦЕНА",null,null,{"$f":"_xlfn.CEILING.MATH(O23,5)","v":{"$error":"#NAME?"}}]
[]
["Калькуляция"]
["Наименование материала",null,null,null,"Статус","Ед. изм","Размер заготовки (мм)",null,null,"Размер заготовки (мм)","Количество заготовок (шт)",null,"Цена (руб/м.п.)",null,"Стоимость (руб)",null,"Количество материала факт(м.п.)",null,"Стоимость фактическая (руб)",null,"Количество материала (м.п.)",null,"Вес"]
["Расходный материал",null,null,"Описание",null,null,"Длина","Ширина","Площадь"]
["Профильная  труба15*15*1,5",null,null,null,{"$f":"IF(ISNA(VLOOKUP(A20,цены!$B$3:$H$500,7)),\"\",VLOOKUP(A20,цены!$B$3:$H$500,7,0))","v":"Материал"},{"$f":"IF(ISNA(VLOOKUP(A20,цены!$B$3:$D$500,2)),\"\",VLOOKUP(A20,цены!$B$3:$D$500,2,0))","v":"м.п."},null,null,{"$f":"_xlfn.CEILING.MATH(G20*H20/1000000,0.01)","v":{"$error":"#NAME?"}},690,1,null,{"$f":"IF(ISNA(VLOOKUP(A20,цены!$B$3:$D$500,3)),\"0\",VLOOKUP(A20,цены!$B$3:$D$500,3,0))","v":32},null,{"$f":"IF(F20=\"м2\",I20*K20,_xlfn.CEILING.MATH(J20*K20,500)/1000)*$S$3*M20*IF(E20=\"Материал\",1+VLOOKUP($T$3,цены!$J$3:$K$11,2,0),1)","v":{"$error":"#NAME?"}},null,{"$f":"IF(F20=\"м2\",G20*H20*K20/1000000,J20*K20/1000)","v":0.69},null,{"$f":"Q20*M20","v":22.08},null,{"$f":"IF(F20=\"м2\",_xlfn.CEILING.MATH(G20*H20*K20/1000000,0.1),_xlfn.CEILING.MATH(J20*K20,500)/1000)","v":{"$error":"#NAME?"}},null,{"$f":"IF(ISNA(VLOOKUP(A20,цены!$B$3:$E$500,4)),\"\",VLOOKUP(A20,цены!$B$3:$E$500,4,0)*Q20)","v":0.44159999999999999}]
{"$rows_left_out":76}
{"sheet":"Элементы3","index":2,"n_rows":95,"n_cols":23,"rows_kept":95,"cut":false,"hidden":false,"merged":[[94,18,94,19],[94,20,94,21],[94,0,94,3],[94,6,94,8],[94,10,94,11],[94,12,94,13],[94,14,94,15],[94,16,94,17],[92,20,92,21],[93,0,93,2],[93,10,93,11],[93,12,93,13],[93,14,93,15],[93,16,93,17],[93,18,93,19],[93,20,93,21],[92,0,92,2],[92,10,92,11],[92,12,92,13],[92,14,92,15],[92,16,92,17],[92,18,92,19],[89,22,90,22],[90,0,90,2],[91,0,91,2],[91,10,91,11],[91,12,91,13],[91,14,91,15],[91,16,91,17],[91,18,91,19],[91,20,91,21],[89,10,90,11],[89,12,90,13],[89,14,90,15],[89,16,90,17],[89,18,90,19],[89,20,90,21],[84,16,85,18],[84,19,85,21],[86,16,88,18],[86,19,88,21],[88,0,88,15],[89,0,89,3],[89,4,90,4],[89,5,90,5],[89,6,89,8],[89,9,90,9],[78,16,79,18],[78,19,79,21],[80,16,81,18],[80,19,81,21],[82,16,83,18],[82,19,83,21],[74,16,74,17],[75,0,87,7],[75,8,87,15],[75,16,75,17],[75,19,75,20],[75,22,75,23],[76,16,76,18],[76,19,76,21],[77,16,77,18],[77,19,77,21],[72,0,72,2],[72,3,72,15],[73,0,73,2],[73,3,73,15],[74,0,74,6],[74,8,74,15],[69,20,69,21],[70,0,70,3],[70,6,70,8],[70,10,70,11],[70,12,70,13],[70,14,70,15],[70,16,70,17],[70,18,70,19],[70,20,70,21],[69,0,69,2],[69,10,69,11],[69,12,69,13],[69,14,69,15],[69,16,69,17],[69,18,69,19],[67,18,67,19],[67,20,67,21],[68,0,68,2],[68,10,68,11],[68,12,68,13],[68,14,68,15],[68,16,68,17],[68,18,68,19],[68,20,68,21],[65,16,66,17],[65,18,66,19],[65,20,66,21],[65,22,66,22],[66,0,66,2],[67,0,67,2],[67,10,67,11],[67,12,67,13],[67,14,67,15],[67,16,67,17],[64,0,64,15],[65,0,65,3],[65,4,66,4],[65,5,66,5],[65,6,65,8],[65,9,66,9],[65,10,66,11],[65,12,66,13],[65,14,66,15],[60,16,61,18],[60,19,61,21],[61,22,61,23],[62,16,64,18],[62,19,64,21],[62,22,64,23],[54,16,55,18],[54,19,55,21],[56,16,57,18],[56,19,57,21],[58,16,59,18],[58,19,59,21],[50,16,50,17],[51,0,63,7],[51,8,63,15],[51,16,51,17],[51,19,51,20],[51,22,51,23],[52,16,52,18],[52,19,52,21],[53,16,53,18],[53,19,53,21],[48,0,48,2],[48,3,48,15],[49,0,49,2],[49,3,49,15],[50,0,50,6],[50,8,50,15],[45,20,45,21],[46,0,46,3],[46,6,46,8],[46,10,46,11],[46,12,46,13],[46,14,46,15],[46,16,46,17],[46,18,46,19],[46,20,46,21],[45,0,45,2],[45,10,45,11],[45,12,45,13],[45,14,45,15],[45,16,45,17],[45,18,45,19],[43,18,43,19],[43,20,43,21],[44,0,44,2],[44,10,44,11],[44,12,44,13],[44,14,44,15],[44,16,44,17],[44,18,44,19],[44,20,44,21],[41,16,42,17],[41,18,42,19],[41,20,42,21],[41,22,42,22],[42,0,42,2],[43,0,43,2],[43,10,43,11],[43,12,43,13],[43,14,43,15],[43,16,43,17],[38,19,40,21],[40,0,40,15],[41,0,41,3],[41,4,42,4],[41,5,42,5],[41,6,41,8],[41,9,42,9],[41,10,42,11],[41,12,42,13],[41,14,42,15],[30,19,31,21],[32,16,33,18],[32,19,33,21],[34,16,35,18],[34,19,35,21],[36,16,37,18],[36,19,37,21],[27,19,27,20],[27,22,27,23],[28,16,28,18],[28,19,28,21],[29,16,29,18],[29,19,29,21],[26,0,26,6],[26,8,26,15],[26,16,26,17],[27,0,39,7],[27,8,39,15],[27,16,27,17],[30,16,31,18],[38,16,40,18],[22,18,22,19],[22,20,22,21],[24,0,24,2],[24,3,24,15],[25,0,25,2],[25,3,25,15],[22,0,22,3],[22,6,22,8],[22,10,22,11],[22,12,22,13],[22,14,22,15],[22,16,22,17],[20,20,20,21],[21,0,21,2],[21,10,21,11],[21,12,21,13],[21,14,21,15],[21,16,21,17],[21,18,21,19],[21,20,21,21],[20,0,20,2],[20,10,20,11],[20,12,20,13],[20,14,20,15],[20,16,20,17],[20,18,20,19],[17,22,18,22],[18,0,18,2],[19,0,19,2],[19,10,19,11],[19,12,19,13],[19,14,19,15],[19,16,19,17],[19,18,19,19],[19,20,19,21],[17,10,18,11],[17,12,18,13],[17,14,18,15],[17,16,18,17],[17,18,18,19],[17,20,18,21],[12,16,13,18],[12,19,13,21],[14,16,16,18],[14,19,16,21],[16,0,16,15],[17,0,17,3],[17,4,18,4],[17,5,18,5],[17,6,17,8],[17,9,18,9],[6,16,7,18],[6,19,7,21],[8,16,9,18],[8,19,9,21],[10,16,11,18],[10,19,11,21],[2,16,2,17],[3,0,15,7],[3,8,15,15],[3,16,3,17],[3,19,3,20],[3,22,3,23],[4,16,4,18],[4,19,4,21],[5,16,5,18],[5,19,5,21],[0,0,0,2],[0,3,0,15],[1,0,1,2],[1,3,1,15],[2,0,2,6],[2,8,2,15]]}
["Артикул",null,null,"ЭтСп-0014"]
["Наименование",null,null,"Червонка"]
["Фото",null,null,null,null,null,null,null,"Описание",null,null,null,null,null,null,null,"Доставка материала",null,1.07,"а",{"$f":"(T15-S23)/S23","v":{"$error":"#NAME?"}}]
[null,null,null,null,null,null,null,null,"Червонка длинна 415мм, высота 110мм. По обеим сторонам одинаковый загиб",null,null,null,null,null,null,null,"Длина изделия",null,null,"Ширина изделия",null,null,"Высота изделия"]
[null,null,null,null,null,null,null,null,null,null,null,null,null,null,null,null,"Стоимость кв.м. изделия",null,null,{"$f":"_xlfn.CEILING.MATH(T15/(V4*Y4),1)","v":{"$error":"#NAME?"}}]
[null,null,null,null,null,null,null,null,null,null,null,null,null,null,null,null,"Стоимость п.м. изделия",null,null,{"$f":"_xlfn.CEILING.MATH(T15/(S4*2+V4*2),1)","v":{"$error":"#NAME?"}}]
[null,null,null,null,null,null,null,null,null,null,null,null,null,null,null,null,"Чистая прибыль",null,null,{"$f":"T15-T9-T11-T13-S23","v":{"$error":"#NAME?"}}]
[]
[null,null,null,null,null,null,null,null,null,null,null,null,null,null,null,null,"Заработная плата",null,null,{"$f":"(T15-_xlfn.CEILING.MATH(S23,5))*20%","v":{"$error":"#NAME?"}}]
[]
[null,null,null,null,null,null,null,null,null,null,null,null,null,null,null,null,"Расходники",null,null,{"$f":"(T15-_xlfn.CEILING.MATH(S23,5))*7%","v":{"$error":"#NAME?"}}]
[]
[null,null,null,null,null,null,null,null,null,null,null,null,null,null,null,null,"Аренда, электричество",null,null,{"$f":"(T15-_xlfn.CEILING.MATH(S23,5))*10%","v":{"$error":"#NAME?"}}]
[]
[null,null,null,null,null,null,null,null,null,null,null,null,null,null,null,null,"ИТОГОВАЯ ЦЕНА",null,null,{"$f":"_xlfn.CEILING.MATH(O23,5)","v":{"$error":"#NAME?"}}]
[]
["Калькуляция"]
["Наименование материала",null,null,null,"Статус","Ед. изм","Размер заготовки (мм)",null,null,"Размер заготовки (мм)","Количество заготовок (шт)",null,"Цена (руб/м.п.)",null,"Стоимость (руб)",null,"Количество материала факт(м.п.)",null,"Стоимость фактическая (руб)",null,"Количество материала (м.п.)",null,"Вес"]
["Расходный материал",null,null,"Описание",null,null,"Длина","Ширина","Площадь"]
["Профильная  труба15*15*1,5",null,null,null,{"$f":"IF(ISNA(VLOOKUP(A20,цены!$B$3:$H$500,7)),\"\",VLOOKUP(A20,цены!$B$3:$H$500,7,0))","v":"Материал"},{"$f":"IF(ISNA(VLOOKUP(A20,цены!$B$3:$D$500,2)),\"\",VLOOKUP(A20,цены!$B$3:$D$500,2,0))","v":"м.п."},null,null,{"$f":"_xlfn.CEILING.MATH(G20*H20/1000000,0.01)","v":{"$error":"#NAME?"}},690,1,null,{"$f":"IF(ISNA(VLOOKUP(A20,цены!$B$3:$D$500,3)),\"0\",VLOOKUP(A20,цены!$B$3:$D$500,3,0))","v":32},null,{"$f":"IF(F20=\"м2\",I20*K20,_xlfn.CEILING.MATH(J20*K20,500)/1000)*$S$3*M20*IF(E20=\"Материал\",1+VLOOKUP($T$3,цены!$J$3:$K$11,2,0),1)","v":{"$error":"#NAME?"}},null,{"$f":"IF(F20=\"м2\",G20*H20*K20/1000000,J20*K20/1000)","v":0.69},null,{"$f":"Q20*M20","v":22.08},null,{"$f":"IF(F20=\"м2\",_xlfn.CEILING.MATH(G20*H20*K20/1000000,0.1),_xlfn.CEILING.MATH(J20*K20,500)/1000)","v":{"$error":"#NAME?"}},null,{"$f":"IF(ISNA(VLOOKUP(A20,цены!$B$3:$E$500,4)),\"\",VLOOKUP(A20,цены!$B$3:$E$500,4,0)*Q20)","v":0.44159999999999999}]
{"$rows_left_out":76}
{"sheet":"цены","index":3,"n_rows":192,"n_cols":12,"rows_kept":192,"cut":false,"hidden":false,"merged":[[0,5,0,6],[0,9,0,10],[7,11,7,14],[8,11,8,14]]}
[null,null,null,null,null,"Наценка на металл",null,null,null,"Наценка на металл"]
[null,"Расходный материал","Ед.изм.","Цена","Вес (м.п.)","Ставка","Литера","Статус",null,"Ставка","Литера"]
[null,"Арматура 10 мм","м.п.",19,null,null,null,"Материал",null,"А",1]
[null,"Арматура 14 мм","м.п.",36,null,null,null,"Материал",null,"Б",1.5]
[null,"Арматура 16 мм","м.п.",46,null,null,null,"Материал",null,"В",2]
[null,"Квадрат 6*6","м.п.",29,0.28000000000000003,1,"А","Материал",null,"Г",2.5]
[null,"Квадрат 8*8","м.п.",36,0.5,1.5,"Б","Материал",null,"Д",3]
[null,"Квадрат 10*10","м.п.",34,0.78,2,"В","Материал",null,"Е",1.25,"Для элементов без лапки"]
[null,"Квадрат 12*12","м.п.",52,1.1299999999999999,2.5,"Г","Материал",null,"Ж",1.75,"Для элементов с лапкой и сварных"]
[null,"Квадрат 14*14","м.п.",62,1.54,3,"Д","Материал",null,"З",2.25]
[null,"Квадрат 16*16","м.п.",74,2.0099999999999998,null,null,"Материал",null,"И",2.75]
[null,"Квадрат 18*18","м.п.",null,2.54,null,null,"Материал",null,"К",0]
[null,"Квадрат 20*20","м.п.",null,3.14,null,null,"Материал",null,"Л",0.5]
[null,"Квадрат 22*22","м.п.",null,null,null,null,"Материал",null,"М",0.75]
[null,"Квадрат 25*25","м.п.",null,null,null,null,"Материал"]
[null,"Круг  6,5 мм","м.п.",9.5,0.26,null,null,"Материал"]
[null,"Круг  8 мм","м.п.",17,0.39,null,null,"Материал"]
[null,"Круг  10 мм","м.п.",25,0.62,null,null,"Материал"]
[null,"Круг  12 мм","м.п.",34,0.89,null,null,"Материал"]
[null,"Круг  14 мм","м.п.",49,1.21,null,null,"Материал"]
{"$rows_left_out":172}