{"text_format":"1","workbook":"xlsx","n_sheets":2,"sheets":["Лист1","Лист2"],"not_rendered":{"charts":0,"images":1,"macros":1,"external_links":0,"defined_names":2,"comments":0,"pivot_tables":0},"unopened":[],"bounds":{"document_bytes":16777216,"sheet_cells":100000,"rows_first":2000,"rows_last":500,"rows_between":2000,"halvings":0,"cell_chars":16384,"cell_head_chars":4096},"cells_cut":0,"cells_raw":0,"read":"whole","date_system":"1900"}

{"sheet":"Лист1","index":0,"n_rows":4,"n_cols":8,"rows_kept":4,"cut":false,"hidden":false,"merged":[]}
["НОМЕР","ФИО","Место","инвентарий","Серийник","Модель","Дата","Вид"]
["3100242632","Вася Пупкин","Склад","96155283","CZC9092GX7","HP DC5800","2013-12-30","Desktop"]
["3100242653","Маша Иванова","Офис","960155290","CZC9092GWN","HP DC5800","2014-12-05","Desktop"]
["3100242642","Сергей Петров","Доставка","960155294","CZC9092GX4","HP DC5800","2009-07-20","Desktop"]

{"sheet":"Лист2","index":1,"n_rows":26,"n_cols":9,"rows_kept":26,"cut":false,"hidden":false,"merged":[[2,1,2,2],[3,1,3,2],[9,1,9,7],[12,7,13,7],[12,8,13,8],[18,1,18,8],[12,0,13,0],[12,1,13,1],[12,2,12,3],[12,4,13,4],[12,5,13,5],[12,6,13,6]]}
[]
[]
[]
[]
[]
[]
[]
[null,null,null,"Выдача"]
[]
[]
[]
[]
["#"]
[]
[1,2,3,4,5,6,7,8,9]
[1,"3100242632",{"$f":"VLOOKUP(B16,Лист1!$A$1:$H$4,8,FALSE)","v":"Desktop"},{"$f":"VLOOKUP(B16,Лист1!$A$1:$H$4,6,FALSE)","v":"HP DC5800"},{"$f":"VLOOKUP(B16,Лист1!$A$1:$H$4,4,FALSE)","v":"96155283"},{"$f":"VLOOKUP(B16,Лист1!$A$1:$H$4,5,FALSE)","v":"CZC9092GX7"},null,{"$f":"VLOOKUP(B16,Лист1!$A$1:$H$4,3,FALSE)","v":"Склад"}]
[]
[]
[]
[]
[]
[null,null,null,"Проценко О."]
[null,"Former Owner"]
[]
[null,null,null,{"$f":"VLOOKUP(B16,Лист1!$A$1:$H$4,2,FALSE)","v":"Вася Пупкин"}]
[null,"New Owner"]