{"text_format":"1","workbook":"xlsx","n_sheets":4,"sheets":["Список","Список1","Шаблон","МОЛ"],"not_rendered":{"charts":0,"images":0,"macros":1,"external_links":0,"defined_names":1,"comments":0,"pivot_tables":0},"unopened":[],"bounds":{"document_bytes":16777216,"sheet_cells":100000,"rows_first":2000,"rows_last":500,"rows_between":2000,"halvings":0,"cell_chars":16384,"cell_head_chars":4096},"cells_cut":0,"cells_raw":0,"read":"whole","date_system":"1900"}

{"sheet":"Список","index":0,"n_rows":11,"n_cols":5,"rows_kept":11,"cut":false,"hidden":false,"merged":[]}
["Номер наряду","Дата видачі","Кому видано","Постачальник","Договір чи рахунок"]
[156,"28.02.2015","Михайло Мар'янович","ТОВ \"ЛІБЕРТА\"","Б-025 віл 12.02.2015"]
[157,"28.02.2015"," Анатолій Ярославович","ТОВ \"ЛІБЕРТА\"","Б-055 від 12.01.2015"]
[158,"28.02.2015","Анатолій Ярославович","ТОВ \"ПРОМБУД\"","Б-122 від 02.02.2015"]
[159,"28.02.2015","Роман Степанович","ТОВ \"ПРОМБУД\"","Б-085 від 11.02.2015"]
[160,"28.02.2015","Руслан Ярославович","ТОВ \"ПРОМБУД\"","Б-085 від 11.02.2015"]
[161,"28.02.2015","Олександр Олександрович","ТОВ \"ПРОМБУД\"","Б-055 від 12.01.2015"]
[162,"28.02.2015","Михайло Мар'янович","ТОВ \"ЛІБЕРТА\"","рахунок"]
[163,"28.02.2015","Ярослав Михайлович","ТОВ \"ЛІБЕРТА\"","Б-085 від 11.02.2015"]
[164,"28.02.2015","Ярослав Михайлович","ТОВ \"ЛІБЕРТА\"","рахунок"]
[null,null,"","",""]

{"sheet":"Список1","index":1,"n_rows":1,"n_cols":4,"rows_kept":1,"cut":false,"hidden":false,"merged":[]}
["Номер","Найменування цінностей","од.вим","кількість"]

{"sheet":"Шаблон","index":2,"n_rows":32,"n_cols":17,"rows_kept":32,"cut":false,"hidden":false,"merged":[[25,1,25,11],[25,12,25,13],[25,14,25,15],[27,2,27,14],[10,9,10,11],[13,7,13,11],[14,2,14,5],[14,10,14,15],[15,4,15,14],[20,4,20,15],[23,1,23,11],[23,12,23,13],[23,14,23,15],[24,1,24,11],[24,12,24,13],[24,14,24,15],[18,5,18,15],[17,5,17,15],[19,5,19,14],[0,12,0,15],[2,0,2,8],[6,0,6,8],[12,2,12,15],[16,3,16,15],[7,14,7,15],[9,11,9,12],[11,3,11,9]]}
[null,null,null,null,null,null,null,null,null,null,null,null,"Форма, затверджена Наказом"]
[null,null,null,null,null,null,null,null,null,null,null,null,"№",null,"від"]
[]
[]
[]
[]
[null,null,null,null,null,null,null,null,null,null,null,null,null,null,"Наряд дійсний до"]
[null,null,null,null,null,null,null,null,null,null,null,null,null,null,{"$f":"J11+10","v":"2015-03-10"}]
[]
[null,null,null,null,null,null,null,"Наряд на отримання ТМЦ №",null,null,null,137]
[null,null,null,null,null,null,null,"Дата видачі",null,{"$f":"TODAY()","v":"2015-02-28"}]
["Видано",null,null,"Сергій Михайлович"]
[null,null,"(посада, прізвище, ім'я, по батькові)"]
["Документ, що засвідчує особу",null,null,null,null,null,null,{"$f":"VLOOKUP(D12,МОЛ!$A$2:$F$41,2,0)","v":"Паспорт "}]
["серія",null,{"$f":"VLOOKUP(D12,МОЛ!$A$2:$F$41,3,0)","v":"СС"},null,null,null,"№",{"$f":"VLOOKUP(D12,МОЛ!$A$2:$F$41,4,0)","v":544422},null,"від",{"$f":"VLOOKUP(D12,МОЛ!$A$2:$F$41,5,0)","v":"18 березня 1998 р."}]
["Виданий",null,null,null,{"$f":"VLOOKUP(D12,МОЛ!$A$2:$F$41,6,0)","v":"ВМ УМВС"}]
[null,null,null,"(ким виданий документ)"]
["На отримання від"]
[null,null,null,null,null,"(найменування організації постачальника)"]
["цінностей за"]
[null,null,null,null,"(N і дата договору/специфікації)"]
["Перелік цінностей, які належить отримати:"]
[]
["NN п/п","Найменування цінностей",null,null,null,null,null,null,null,null,null,null,"Одиниця виміру",null,"Кількість (прописом)"]
[1,null,null,null,null,null,null,null,null,null,null,null,"шт.",null,100236.56,null,"Сто  тисяч двісті тридцять шість гривень 56 копійок"]
[2]
["Підпис",null,null,null,null,null,null,null,null,null,null,null,null,null,null,"засвідчую"]
[null,null,"(зразок підпису особи, що одержала довіреність)"]
[]
["Уповноважена особа"]
[]
["Місце печатки"]

{"sheet":"МОЛ","index":3,"n_rows":6,"n_cols":6,"rows_kept":6,"cut":false,"hidden":false,"merged":[]}
[]
["Сергій Михайлович","Паспорт ","СС",544422,"18 березня 1998 р.","ВМ УМВС"]
["Василь Богданович","Паспорт ","СС",558585,"15 травня 1997 р.","ВМ УМВС"]
["Михайло Мар'янович","Паспорт ","СС",5757575,"05 жовтня 1999р.","ВМ УМВС"]
["Ярослав Михайлович","Паспорт ","СС",7575757,"27  листопада 1999 р.","ВМ УМВС"]
["Євгеній Богданович","Паспорт ","СЕ",75757575,"18 грудня 2001 р.","ВМ УМВС"]