{"text_format":"1","workbook":"xlsx","n_sheets":4,"sheets":["калькулятор ДЭС","ДЭС на тех.нужды+прогрев","ДЭС на тех.нужды","исх данные"],"not_rendered":{"charts":0,"images":0,"macros":1,"external_links":0,"defined_names":0,"comments":0,"pivot_tables":0},"unopened":[],"bounds":{"document_bytes":16777216,"sheet_cells":100000,"rows_first":2000,"rows_last":500,"rows_between":2000,"halvings":0,"cell_chars":16384,"cell_head_chars":4096},"cells_cut":0,"cells_raw":0,"read":"whole","date_system":"1900"}

{"sheet":"калькулятор ДЭС","index":0,"n_rows":29,"n_cols":31,"rows_kept":29,"cut":false,"hidden":false,"merged":[[28,28,28,29],[0,0,0,30],[6,0,6,7],[1,0,1,7],[2,0,2,7],[1,9,2,12],[1,13,2,30],[6,29,7,29],[6,18,6,27],[6,28,9,28],[7,3,10,3],[7,2,10,2],[7,1,10,1],[7,0,10,0],[7,5,10,5],[7,7,10,7],[7,6,10,6],[7,4,10,4],[6,8,6,17],[8,8,8,17],[11,2,25,2],[8,30,10,30],[8,18,8,27],[3,0,3,7],[4,0,4,7]]}
["КАЛЬКУЛЯТОР ВЫБОРА РЕКОМЕНДУЕМЫХ ДЭС ДЛЯ СТРОИТЕЛЬНЫХ НУЖД И ОРИЕНТИРОВОЧНЫЙ РАСЧЕТ ЗАТРАТ НА КОМПЕСАЦИЮ ВЫРАБОТАННОЙ ЭЛЕКТРОЭНЕРГИИ"]
["поля для заполнения",null,null,null,null,null,null,null,null,"ОБЪЕКТ:"]
["поля для выбора данных из выпадающего списка"]
["рекомендуемые показатели"]
["затраты организации"]
[]
["ИСХОДНЫЕ ДАННЫЕ",null,null,null,null,null,null,null,"РЕКОМЕНДУЕМЫЕ МАРКИ ДИЗЕЛЕЙ",null,null,null,null,null,null,null,null,null,"Нормативная выработка в кВт*ч в месяц",null,null,null,null,null,null,null,null,null,"Стоимость выработанной электроэнергии от ДЭС по тарифу за 1кВт:","Стоимость выработанной электроэнергии от существующих городских сетей по тарифу за 1кВт:","ВЫБОР РЕЗЕРВОЙ ДЭС ПО ПОС"]
["месяц","кол-во дней в месяце","кол-во рабочих часов в сутки","кол-во рабочих часов в месяц","Назначение","Доп. Мощность от гор. сетей, кВт","Требуется мощности на строй нужды по данным  ТРН, кВт","Итого мощности на строй нужды выделяется от ДЭС, кВт","AKSA APD 16, 13кВт","P33, 26кВт","AKSA APD 44, 35кВт","P88, 70кВт","P110, 88кВт","P135, 108кВт","P250, 200кВт","P350, 280кВт","P400, 320кВт","P500, 400кВт","AKSA APD 16, 13кВт","P33, 26кВт","AKSA APD 44, 35кВт","P88, 70кВт","P110, 88кВт","P135, 108кВт","P250, 200кВт","P350, 280кВт","P400, 320кВт","P500, 400кВт",null,null,"Wilson P135"]
[null,null,null,null,null,null,null,null,"Допустимая нагрузка на ДЭС, кВт (70% от номинала)",null,null,null,null,null,null,null,null,null,"Допустимая нагрузка на ДЭС, кВт (70% от номинала)",null,null,null,null,null,null,null,null,null,null,"при условии круглосуточного потребления (24часа)","стоимость 1 месяца резервной ДЭС согласно ПОС"]
[null,null,null,null,null,null,null,null,9,18,25,49,62,76,140,196,224,280,9,18,25,49,62,76,140,196,224,280,null,24]
[null,null,null,null,null,null,null,null,"кВт","кВт","кВт","кВт","кВт","кВт","кВт","кВт","кВт","кВт","кВт","кВт","кВт","кВт","кВт","кВт","кВт","кВт","кВт","кВт",4.21,4.21]
["2015-06-01",{"$f":"DAY(EOMONTH(A12,0))","v":30},16,{"$f":"$C$12*B12","v":480},"тех. нужды",9,{"$f":"32.92+25.6+1.24+60.8","v":120.56},{"$f":"IF(E12=\"тех. Нужды\",'ДЭС на тех.нужды'!$E$3,'ДЭС на тех.нужды+прогрев'!$E$3)","v":111},{"$f":"IF(E12=\"тех. нужды\", IF('ДЭС на тех.нужды'!$B$2=1,'ДЭС на тех.нужды'!$A$2,0),IF('ДЭС на тех.нужды+прогрев'!$B$2=1,'ДЭС на тех.нужды+прогрев'!$A$2,0))","v":0},{"$f":"IF(E12=\"тех. нужды\", IF('ДЭС на тех.нужды'!$B$3=1,'ДЭС на тех.нужды'!$A$3,0),IF('ДЭС на тех.нужды+прогрев'!$B$3=1,'ДЭС на тех.нужды+прогрев'!$A$3,0))","v":0},{"$f":"IF(E12=\"тех. нужды\", IF('ДЭС на тех.нужды'!$B$4=1,'ДЭС на тех.нужды'!$A$4,0),IF('ДЭС на тех.нужды+прогрев'!$B$4=1,'ДЭС на тех.нужды+прогрев'!$A$4,0))","v":0},{"$f":"IF(E12=\"тех. нужды\", IF('ДЭС на тех.нужды'!$B$5=1,'ДЭС на тех.нужды'!$A$5,0),IF('ДЭС на тех.нужды+прогрев'!$B$5=1,'ДЭС на тех.нужды+прогрев'!$A$5,0))","v":49},{"$f":"IF(E12=\"тех. нужды\", IF('ДЭС на тех.нужды'!$B$6=1,'ДЭС на тех.нужды'!$A$6,0),IF('ДЭС на тех.нужды+прогрев'!$B$6=1,'ДЭС на тех.нужды+прогрев'!$A$6,0))","v":62},{"$f":"IF(E12=\"тех. нужды\", IF('ДЭС на тех.нужды'!$B$7=1,'ДЭС на тех.нужды'!$A$7,0),IF('ДЭС на тех.нужды+прогрев'!$B$7=1,'ДЭС на тех.нужды+прогрев'!$A$7,0))","v":0},{"$f":"IF(E12=\"тех. нужды\", IF('ДЭС на тех.нужды'!$B$8=1,'ДЭС на тех.нужды'!$A$8,0),IF('ДЭС на тех.нужды+прогрев'!$B$8=1,'ДЭС на тех.нужды+прогрев'!$A$8,0))","v":0},{"$f":"IF(E12=\"тех. нужды\", IF('ДЭС на тех.нужды'!$B$9=1,'ДЭС на тех.нужды'!$A$9,0),IF('ДЭС на тех.нужды+прогрев'!$B$9=1,'ДЭС на тех.нужды+прогрев'!$A$9,0))","v":0},{"$f":"IF(E12=\"тех. нужды\", IF('ДЭС на тех.нужды'!$B$10=1,'ДЭС на тех.нужды'!$A$10,0),IF('ДЭС на тех.нужды+прогрев'!$B$10=1,'ДЭС на тех.нужды+прогрев'!$A$10,0))","v":0},{"$f":"IF(E12=\"тех. нужды\", IF('ДЭС на тех.нужды'!$B$11=1,'ДЭС на тех.нужды'!$A$11,0),IF('ДЭС на тех.нужды+прогрев'!$B$11=1,'ДЭС на тех.нужды+прогрев'!$A$11,0))","v":0},{"$f":"I12*$D$12","v":0},{"$f":"J12*$D$12","v":0},0,23520,29760,0,0,0,0,0,{"$f":"SUM(S12:AB12)*$AC$11","v":224308.8},{"$f":"$AD$10*B12*$AD$11*F12","v":27280.799999999999},{"$f":"ROUND(VLOOKUP($AE$8, 'исх данные'!$B$3:$D$12, 3,FALSE),2)","v":58000}]
["2015-07-01",{"$f":"DAY(EOMONTH(A13,0))","v":31},null,{"$f":"$C$12*B13","v":496},"тех. нужды",9,{"$f":"32.92+25.6+1.24+60.8","v":120.56},{"$f":"IF(E13=\"тех. Нужды\",'ДЭС на тех.нужды'!$E$3,'ДЭС на тех.нужды+прогрев'!$E$3)","v":111},{"$f":"IF(E13=\"тех. нужды\", IF('ДЭС на тех.нужды'!$B$2=1,'ДЭС на тех.нужды'!$A$2,0),IF('ДЭС на тех.нужды+прогрев'!$B$2=1,'ДЭС на тех.нужды+прогрев'!$A$2,0))","v":0},{"$f":"IF(E13=\"тех. нужды\", IF('ДЭС на тех.нужды'!$B$3=1,'ДЭС на тех.нужды'!$A$3,0),IF('ДЭС на тех.нужды+прогрев'!$B$3=1,'ДЭС на тех.нужды+прогрев'!$A$3,0))","v":0},{"$f":"IF(E13=\"тех. нужды\", IF('ДЭС на тех.нужды'!$B$4=1,'ДЭС на тех.нужды'!$A$4,0),IF('ДЭС на тех.нужды+прогрев'!$B$4=1,'ДЭС на тех.нужды+прогрев'!$A$4,0))","v":0},{"$f":"IF(E13=\"тех. нужды\", IF('ДЭС на тех.нужды'!$B$5=1,'ДЭС на тех.нужды'!$A$5,0),IF('ДЭС на тех.нужды+прогрев'!$B$5=1,'ДЭС на тех.нужды+прогрев'!$A$5,0))","v":49},{"$f":"IF(E13=\"тех. нужды\", IF('ДЭС на тех.нужды'!$B$6=1,'ДЭС на тех.нужды'!$A$6,0),IF('ДЭС на тех.нужды+прогрев'!$B$6=1,'ДЭС на тех.нужды+прогрев'!$A$6,0))","v":62},{"$f":"IF(E13=\"тех. нужды\", IF('ДЭС на тех.нужды'!$B$7=1,'ДЭС на тех.нужды'!$A$7,0),IF('ДЭС на тех.нужды+прогрев'!$B$7=1,'ДЭС на тех.нужды+прогрев'!$A$7,0))","v":0},{"$f":"IF(E13=\"тех. нужды\", IF('ДЭС на тех.нужды'!$B$8=1,'ДЭС на тех.нужды'!$A$8,0),IF('ДЭС на тех.нужды+прогрев'!$B$8=1,'ДЭС на тех.нужды+прогрев'!$A$8,0))","v":0},{"$f":"IF(E13=\"тех. нужды\", IF('ДЭС на тех.нужды'!$B$9=1,'ДЭС на тех.нужды'!$A$9,0),IF('ДЭС на тех.нужды+прогрев'!$B$9=1,'ДЭС на тех.нужды+прогрев'!$A$9,0))","v":0},{"$f":"IF(E13=\"тех. нужды\", IF('ДЭС на тех.нужды'!$B$10=1,'ДЭС на тех.нужды'!$A$10,0),IF('ДЭС на тех.нужды+прогрев'!$B$10=1,'ДЭС на тех.нужды+прогрев'!$A$10,0))","v":0},{"$f":"IF(E13=\"тех. нужды\", IF('ДЭС на тех.нужды'!$B$11=1,'ДЭС на тех.нужды'!$A$11,0),IF('ДЭС на тех.нужды+прогрев'!$B$11=1,'ДЭС на тех.нужды+прогрев'!$A$11,0))","v":0},{"$f":"I13*$D$13","v":0},{"$f":"J13*$D$13","v":0},0,24304,30752,0,0,0,0,0,{"$f":"SUM(S13:AB13)*$AC$11","v":231785.76},{"$f":"$AD$10*B13*$AD$11*F13","v":28190.159999999996},{"$f":"ROUND(VLOOKUP($AE$8, 'исх данные'!$B$3:$D$12, 3,FALSE),2)","v":58000}]
["2015-08-01",{"$f":"DAY(EOMONTH(A14,0))","v":31},null,496,"тех. нужды",9,{"$f":"32.92+25.6+1.24+60.8","v":120.56},{"$f":"IF(E14=\"тех. Нужды\",'ДЭС на тех.нужды'!$E$3,'ДЭС на тех.нужды+прогрев'!$E$3)","v":111},{"$f":"IF(E14=\"тех. нужды\", IF('ДЭС на тех.нужды'!$B$2=1,'ДЭС на тех.нужды'!$A$2,0),IF('ДЭС на тех.нужды+прогрев'!$B$2=1,'ДЭС на тех.нужды+прогрев'!$A$2,0))","v":0},{"$f":"IF(E14=\"тех. нужды\", IF('ДЭС на тех.нужды'!$B$3=1,'ДЭС на тех.нужды'!$A$3,0),IF('ДЭС на тех.нужды+прогрев'!$B$3=1,'ДЭС на тех.нужды+прогрев'!$A$3,0))","v":0},{"$f":"IF(E14=\"тех. нужды\", IF('ДЭС на тех.нужды'!$B$4=1,'ДЭС на тех.нужды'!$A$4,0),IF('ДЭС на тех.нужды+прогрев'!$B$4=1,'ДЭС на тех.нужды+прогрев'!$A$4,0))","v":0},{"$f":"IF(E14=\"тех. нужды\", IF('ДЭС на тех.нужды'!$B$5=1,'ДЭС на тех.нужды'!$A$5,0),IF('ДЭС на тех.нужды+прогрев'!$B$5=1,'ДЭС на тех.нужды+прогрев'!$A$5,0))","v":49},{"$f":"IF(E14=\"тех. нужды\", IF('ДЭС на тех.нужды'!$B$6=1,'ДЭС на тех.нужды'!$A$6,0),IF('ДЭС на тех.нужды+прогрев'!$B$6=1,'ДЭС на тех.нужды+прогрев'!$A$6,0))","v":62},{"$f":"IF(E14=\"тех. нужды\", IF('ДЭС на тех.нужды'!$B$7=1,'ДЭС на тех.нужды'!$A$7,0),IF('ДЭС на тех.нужды+прогрев'!$B$7=1,'ДЭС на тех.нужды+прогрев'!$A$7,0))","v":0},{"$f":"IF(E14=\"тех. нужды\", IF('ДЭС на тех.нужды'!$B$8=1,'ДЭС на тех.нужды'!$A$8,0),IF('ДЭС на тех.нужды+прогрев'!$B$8=1,'ДЭС на тех.нужды+прогрев'!$A$8,0))","v":0},{"$f":"IF(E14=\"тех. нужды\", IF('ДЭС на тех.нужды'!$B$9=1,'ДЭС на тех.нужды'!$A$9,0),IF('ДЭС на тех.нужды+прогрев'!$B$9=1,'ДЭС на тех.нужды+прогрев'!$A$9,0))","v":0},{"$f":"IF(E14=\"тех. нужды\", IF('ДЭС на тех.нужды'!$B$10=1,'ДЭС на тех.нужды'!$A$10,0),IF('ДЭС на тех.нужды+прогрев'!$B$10=1,'ДЭС на тех.нужды+прогрев'!$A$10,0))","v":0},{"$f":"IF(E14=\"тех. нужды\", IF('ДЭС на тех.нужды'!$B$11=1,'ДЭС на тех.нужды'!$A$11,0),IF('ДЭС на тех.нужды+прогрев'!$B$11=1,'ДЭС на тех.нужды+прогрев'!$A$11,0))","v":0},{"$f":"I14*$D$14","v":0},{"$f":"J14*$D$14","v":0},0,24304,30752,0,0,0,0,0,{"$f":"SUM(S14:AB14)*$AC$11","v":231785.76},28190.159999999996,{"$f":"ROUND(VLOOKUP($AE$8, 'исх данные'!$B$3:$D$12, 3,FALSE),2)","v":58000}]
["2015-09-01",{"$f":"DAY(EOMONTH(A15,0))","v":30},null,480,"тех. нужды",9,{"$f":"32.92+25.6+1.24+60.8","v":120.56},{"$f":"IF(E15=\"тех. Нужды\",'ДЭС на тех.нужды'!$E$3,'ДЭС на тех.нужды+прогрев'!$E$3)","v":111},{"$f":"IF(E15=\"тех. нужды\", IF('ДЭС на тех.нужды'!$B$2=1,'ДЭС на тех.нужды'!$A$2,0),IF('ДЭС на тех.нужды+прогрев'!$B$2=1,'ДЭС на тех.нужды+прогрев'!$A$2,0))","v":0},{"$f":"IF(E15=\"тех. нужды\", IF('ДЭС на тех.нужды'!$B$3=1,'ДЭС на тех.нужды'!$A$3,0),IF('ДЭС на тех.нужды+прогрев'!$B$3=1,'ДЭС на тех.нужды+прогрев'!$A$3,0))","v":0},{"$f":"IF(E15=\"тех. нужды\", IF('ДЭС на тех.нужды'!$B$4=1,'ДЭС на тех.нужды'!$A$4,0),IF('ДЭС на тех.нужды+прогрев'!$B$4=1,'ДЭС на тех.нужды+прогрев'!$A$4,0))","v":0},{"$f":"IF(E15=\"тех. нужды\", IF('ДЭС на тех.нужды'!$B$5=1,'ДЭС на тех.нужды'!$A$5,0),IF('ДЭС на тех.нужды+прогрев'!$B$5=1,'ДЭС на тех.нужды+прогрев'!$A$5,0))","v":49},{"$f":"IF(E15=\"тех. нужды\", IF('ДЭС на тех.нужды'!$B$6=1,'ДЭС на тех.нужды'!$A$6,0),IF('ДЭС на тех.нужды+прогрев'!$B$6=1,'ДЭС на тех.нужды+прогрев'!$A$6,0))","v":62},{"$f":"IF(E15=\"тех. нужды\", IF('ДЭС на тех.нужды'!$B$7=1,'ДЭС на тех.нужды'!$A$7,0),IF('ДЭС на тех.нужды+прогрев'!$B$7=1,'ДЭС на тех.нужды+прогрев'!$A$7,0))","v":0},{"$f":"IF(E15=\"тех. нужды\", IF('ДЭС на тех.нужды'!$B$8=1,'ДЭС на тех.нужды'!$A$8,0),IF('ДЭС на тех.нужды+прогрев'!$B$8=1,'ДЭС на тех.нужды+прогрев'!$A$8,0))","v":0},{"$f":"IF(E15=\"тех. нужды\", IF('ДЭС на тех.нужды'!$B$9=1,'ДЭС на тех.нужды'!$A$9,0),IF('ДЭС на тех.нужды+прогрев'!$B$9=1,'ДЭС на тех.нужды+прогрев'!$A$9,0))","v":0},{"$f":"IF(E15=\"тех. нужды\", IF('ДЭС на тех.нужды'!$B$10=1,'ДЭС на тех.нужды'!$A$10,0),IF('ДЭС на тех.нужды+прогрев'!$B$10=1,'ДЭС на тех.нужды+прогрев'!$A$10,0))","v":0},{"$f":"IF(E15=\"тех. нужды\", IF('ДЭС на тех.нужды'!$B$11=1,'ДЭС на тех.нужды'!$A$11,0),IF('ДЭС на тех.нужды+прогрев'!$B$11=1,'ДЭС на тех.нужды+прогрев'!$A$11,0))","v":0},{"$f":"I15*$D$15","v":0},{"$f":"J15*$D$15","v":0},0,23520,29760,0,0,0,0,0,{"$f":"SUM(S15:AB15)*$AC$11","v":224308.8},27280.799999999999,{"$f":"ROUND(VLOOKUP($AE$8, 'исх данные'!$B$3:$D$12, 3,FALSE),2)","v":58000}]
["2015-10-01",31,null,496,"тех. нужды",9,238.22,{"$f":"IF(E16=\"тех. Нужды\",'ДЭС на тех.нужды'!$E$3,'ДЭС на тех.нужды+прогрев'!$E$3)","v":111},{"$f":"IF(E16=\"тех. нужды\", IF('ДЭС на тех.нужды'!$B$2=1,'ДЭС на тех.нужды'!$A$2,0),IF('ДЭС на тех.нужды+прогрев'!$B$2=1,'ДЭС на тех.нужды+прогрев'!$A$2,0))","v":0},{"$f":"IF(E16=\"тех. нужды\", IF('ДЭС на тех.нужды'!$B$3=1,'ДЭС на тех.нужды'!$A$3,0),IF('ДЭС на тех.нужды+прогрев'!$B$3=1,'ДЭС на тех.нужды+прогрев'!$A$3,0))","v":0},{"$f":"IF(E16=\"тех. нужды\", IF('ДЭС на тех.нужды'!$B$4=1,'ДЭС на тех.нужды'!$A$4,0),IF('ДЭС на тех.нужды+прогрев'!$B$4=1,'ДЭС на тех.нужды+прогрев'!$A$4,0))","v":0},{"$f":"IF(E16=\"тех. нужды\", IF('ДЭС на тех.нужды'!$B$5=1,'ДЭС на тех.нужды'!$A$5,0),IF('ДЭС на тех.нужды+прогрев'!$B$5=1,'ДЭС на тех.нужды+прогрев'!$A$5,0))","v":49},{"$f":"IF(E16=\"тех. нужды\", IF('ДЭС на тех.нужды'!$B$6=1,'ДЭС на тех.нужды'!$A$6,0),IF('ДЭС на тех.нужды+прогрев'!$B$6=1,'ДЭС на тех.нужды+прогрев'!$A$6,0))","v":62},{"$f":"IF(E16=\"тех. нужды\", IF('ДЭС на тех.нужды'!$B$7=1,'ДЭС на тех.нужды'!$A$7,0),IF('ДЭС на тех.нужды+прогрев'!$B$7=1,'ДЭС на тех.нужды+прогрев'!$A$7,0))","v":0},{"$f":"IF(E16=\"тех. нужды\", IF('ДЭС на тех.нужды'!$B$8=1,'ДЭС на тех.нужды'!$A$8,0),IF('ДЭС на тех.нужды+прогрев'!$B$8=1,'ДЭС на тех.нужды+прогрев'!$A$8,0))","v":0},{"$f":"IF(E16=\"тех. нужды\", IF('ДЭС на тех.нужды'!$B$9=1,'ДЭС на тех.нужды'!$A$9,0),IF('ДЭС на тех.нужды+прогрев'!$B$9=1,'ДЭС на тех.нужды+прогрев'!$A$9,0))","v":0},{"$f":"IF(E16=\"тех. нужды\", IF('ДЭС на тех.нужды'!$B$10=1,'ДЭС на тех.нужды'!$A$10,0),IF('ДЭС на тех.нужды+прогрев'!$B$10=1,'ДЭС на тех.нужды+прогрев'!$A$10,0))","v":0},{"$f":"IF(E16=\"тех. нужды\", IF('ДЭС на тех.нужды'!$B$11=1,'ДЭС на тех.нужды'!$A$11,0),IF('ДЭС на тех.нужды+прогрев'!$B$11=1,'ДЭС на тех.нужды+прогрев'!$A$11,0))","v":0},{"$f":"I16*$D$16","v":0},{"$f":"J16*$D$16","v":0},0,24304,30752,0,0,0,0,0,{"$f":"SUM(S16:AB16)*$AC$11","v":231785.76},28190.159999999996,{"$f":"ROUND(VLOOKUP($AE$8, 'исх данные'!$B$3:$D$12, 3,FALSE),2)","v":58000}]
["2015-11-01",{"$f":"DAY(EOMONTH(A17,0))","v":30},null,480,"прогрев бетона и тех. Нужды",9,238.22,{"$f":"IF(E17=\"тех. Нужды\",'ДЭС на тех.нужды'!$E$3,'ДЭС на тех.нужды+прогрев'!$E$3)","v":229},{"$f":"IF(E17=\"тех. нужды\", IF('ДЭС на тех.нужды'!$B$2=1,'ДЭС на тех.нужды'!$A$2,0),IF('ДЭС на тех.нужды+прогрев'!$B$2=1,'ДЭС на тех.нужды+прогрев'!$A$2,0))","v":9},{"$f":"IF(E17=\"тех. нужды\", IF('ДЭС на тех.нужды'!$B$3=1,'ДЭС на тех.нужды'!$A$3,0),IF('ДЭС на тех.нужды+прогрев'!$B$3=1,'ДЭС на тех.нужды+прогрев'!$A$3,0))","v":18},{"$f":"IF(E17=\"тех. нужды\", IF('ДЭС на тех.нужды'!$B$4=1,'ДЭС на тех.нужды'!$A$4,0),IF('ДЭС на тех.нужды+прогрев'!$B$4=1,'ДЭС на тех.нужды+прогрев'!$A$4,0))","v":0},{"$f":"IF(E17=\"тех. нужды\", IF('ДЭС на тех.нужды'!$B$5=1,'ДЭС на тех.нужды'!$A$5,0),IF('ДЭС на тех.нужды+прогрев'!$B$5=1,'ДЭС на тех.нужды+прогрев'!$A$5,0))","v":0},{"$f":"IF(E17=\"тех. нужды\", IF('ДЭС на тех.нужды'!$B$6=1,'ДЭС на тех.нужды'!$A$6,0),IF('ДЭС на тех.нужды+прогрев'!$B$6=1,'ДЭС на тех.нужды+прогрев'!$A$6,0))","v":62},{"$f":"IF(E17=\"тех. нужды\", IF('ДЭС на тех.нужды'!$B$7=1,'ДЭС на тех.нужды'!$A$7,0),IF('ДЭС на тех.нужды+прогрев'!$B$7=1,'ДЭС на тех.нужды+прогрев'!$A$7,0))","v":0},{"$f":"IF(E17=\"тех. нужды\", IF('ДЭС на тех.нужды'!$B$8=1,'ДЭС на тех.нужды'!$A$8,0),IF('ДЭС на тех.нужды+прогрев'!$B$8=1,'ДЭС на тех.нужды+прогрев'!$A$8,0))","v":140},{"$f":"IF(E17=\"тех. нужды\", IF('ДЭС на тех.нужды'!$B$9=1,'ДЭС на тех.нужды'!$A$9,0),IF('ДЭС на тех.нужды+прогрев'!$B$9=1,'ДЭС на тех.нужды+прогрев'!$A$9,0))","v":0},{"$f":"IF(E17=\"тех. нужды\", IF('ДЭС на тех.нужды'!$B$10=1,'ДЭС на тех.нужды'!$A$10,0),IF('ДЭС на тех.нужды+прогрев'!$B$10=1,'ДЭС на тех.нужды+прогрев'!$A$10,0))","v":0},{"$f":"IF(E17=\"тех. нужды\", IF('ДЭС на тех.нужды'!$B$11=1,'ДЭС на тех.нужды'!$A$11,0),IF('ДЭС на тех.нужды+прогрев'!$B$11=1,'ДЭС на тех.нужды+прогрев'!$A$11,0))","v":0},{"$f":"I17*$D$17","v":4320},{"$f":"J17*$D$17","v":8640},0,0,29760,0,67200,0,0,0,{"$f":"SUM(S17:AB17)*$AC$11","v":462763.2},27280.799999999999,{"$f":"ROUND(VLOOKUP($AE$8, 'исх данные'!$B$3:$D$12, 3,FALSE),2)","v":58000}]
["2015-12-01",{"$f":"DAY(EOMONTH(A18,0))","v":31},null,496,"прогрев бетона и тех. Нужды",9,238.22,{"$f":"IF(E18=\"тех. Нужды\",'ДЭС на тех.нужды'!$E$3,'ДЭС на тех.нужды+прогрев'!$E$3)","v":229},{"$f":"IF(E18=\"тех. нужды\", IF('ДЭС на тех.нужды'!$B$2=1,'ДЭС на тех.нужды'!$A$2,0),IF('ДЭС на тех.нужды+прогрев'!$B$2=1,'ДЭС на тех.нужды+прогрев'!$A$2,0))","v":9},{"$f":"IF(E18=\"тех. нужды\", IF('ДЭС на тех.нужды'!$B$3=1,'ДЭС на тех.нужды'!$A$3,0),IF('ДЭС на тех.нужды+прогрев'!$B$3=1,'ДЭС на тех.нужды+прогрев'!$A$3,0))","v":18},{"$f":"IF(E18=\"тех. нужды\", IF('ДЭС на тех.нужды'!$B$4=1,'ДЭС на тех.нужды'!$A$4,0),IF('ДЭС на тех.нужды+прогрев'!$B$4=1,'ДЭС на тех.нужды+прогрев'!$A$4,0))","v":0},{"$f":"IF(E18=\"тех. нужды\", IF('ДЭС на тех.нужды'!$B$5=1,'ДЭС на тех.нужды'!$A$5,0),IF('ДЭС на тех.нужды+прогрев'!$B$5=1,'ДЭС на тех.нужды+прогрев'!$A$5,0))","v":0},{"$f":"IF(E18=\"тех. нужды\", IF('ДЭС на тех.нужды'!$B$6=1,'ДЭС на тех.нужды'!$A$6,0),IF('ДЭС на тех.нужды+прогрев'!$B$6=1,'ДЭС на тех.нужды+прогрев'!$A$6,0))","v":62},{"$f":"IF(E18=\"тех. нужды\", IF('ДЭС на тех.нужды'!$B$7=1,'ДЭС на тех.нужды'!$A$7,0),IF('ДЭС на тех.нужды+прогрев'!$B$7=1,'ДЭС на тех.нужды+прогрев'!$A$7,0))","v":0},{"$f":"IF(E18=\"тех. нужды\", IF('ДЭС на тех.нужды'!$B$8=1,'ДЭС на тех.нужды'!$A$8,0),IF('ДЭС на тех.нужды+прогрев'!$B$8=1,'ДЭС на тех.нужды+прогрев'!$A$8,0))","v":140},{"$f":"IF(E18=\"тех. нужды\", IF('ДЭС на тех.нужды'!$B$9=1,'ДЭС на тех.нужды'!$A$9,0),IF('ДЭС на тех.нужды+прогрев'!$B$9=1,'ДЭС на тех.нужды+прогрев'!$A$9,0))","v":0},{"$f":"IF(E18=\"тех. нужды\", IF('ДЭС на тех.нужды'!$B$10=1,'ДЭС на тех.нужды'!$A$10,0),IF('ДЭС на тех.нужды+прогрев'!$B$10=1,'ДЭС на тех.нужды+прогрев'!$A$10,0))","v":0},{"$f":"IF(E18=\"тех. нужды\", IF('ДЭС на тех.нужды'!$B$11=1,'ДЭС на тех.нужды'!$A$11,0),IF('ДЭС на тех.нужды+прогрев'!$B$11=1,'ДЭС на тех.нужды+прогрев'!$A$11,0))","v":0},{"$f":"I18*$D$18","v":4464},{"$f":"J18*$D$18","v":8928},0,0,30752,0,69440,0,0,0,{"$f":"SUM(S18:AB18)*$AC$11","v":478188.64},28190.159999999996,{"$f":"ROUND(VLOOKUP($AE$8, 'исх данные'!$B$3:$D$12, 3,FALSE),2)","v":58000}]
["2016-01-01",{"$f":"DAY(EOMONTH(A19,0))","v":31},null,496,"прогрев бетона и тех. Нужды",9,238.22,{"$f":"IF(E19=\"тех. Нужды\",'ДЭС на тех.нужды'!$E$3,'ДЭС на тех.нужды+прогрев'!$E$3)","v":229},{"$f":"IF(E19=\"тех. нужды\", IF('ДЭС на тех.нужды'!$B$2=1,'ДЭС на тех.нужды'!$A$2,0),IF('ДЭС на тех.нужды+прогрев'!$B$2=1,'ДЭС на тех.нужды+прогрев'!$A$2,0))","v":9},{"$f":"IF(E19=\"тех. нужды\", IF('ДЭС на тех.нужды'!$B$3=1,'ДЭС на тех.нужды'!$A$3,0),IF('ДЭС на тех.нужды+прогрев'!$B$3=1,'ДЭС на тех.нужды+прогрев'!$A$3,0))","v":18},{"$f":"IF(E19=\"тех. нужды\", IF('ДЭС на тех.нужды'!$B$4=1,'ДЭС на тех.нужды'!$A$4,0),IF('ДЭС на тех.нужды+прогрев'!$B$4=1,'ДЭС на тех.нужды+прогрев'!$A$4,0))","v":0},{"$f":"IF(E19=\"тех. нужды\", IF('ДЭС на тех.нужды'!$B$5=1,'ДЭС на тех.нужды'!$A$5,0),IF('ДЭС на тех.нужды+прогрев'!$B$5=1,'ДЭС на тех.нужды+прогрев'!$A$5,0))","v":0},{"$f":"IF(E19=\"тех. нужды\", IF('ДЭС на тех.нужды'!$B$6=1,'ДЭС на тех.нужды'!$A$6,0),IF('ДЭС на тех.нужды+прогрев'!$B$6=1,'ДЭС на тех.нужды+прогрев'!$A$6,0))","v":62},{"$f":"IF(E19=\"тех. нужды\", IF('ДЭС на тех.нужды'!$B$7=1,'ДЭС на тех.нужды'!$A$7,0),IF('ДЭС на тех.нужды+прогрев'!$B$7=1,'ДЭС на тех.нужды+прогрев'!$A$7,0))","v":0},{"$f":"IF(E19=\"тех. нужды\", IF('ДЭС на тех.нужды'!$B$8=1,'ДЭС на тех.нужды'!$A$8,0),IF('ДЭС на тех.нужды+прогрев'!$B$8=1,'ДЭС на тех.нужды+прогрев'!$A$8,0))","v":140},{"$f":"IF(E19=\"тех. нужды\", IF('ДЭС на тех.нужды'!$B$9=1,'ДЭС на тех.нужды'!$A$9,0),IF('ДЭС на тех.нужды+прогрев'!$B$9=1,'ДЭС на тех.нужды+прогрев'!$A$9,0))","v":0},{"$f":"IF(E19=\"тех. нужды\", IF('ДЭС на тех.нужды'!$B$10=1,'ДЭС на тех.нужды'!$A$10,0),IF('ДЭС на тех.нужды+прогрев'!$B$10=1,'ДЭС на тех.нужды+прогрев'!$A$10,0))","v":0},{"$f":"IF(E19=\"тех. нужды\", IF('ДЭС на тех.нужды'!$B$11=1,'ДЭС на тех.нужды'!$A$11,0),IF('ДЭС на тех.нужды+прогрев'!$B$11=1,'ДЭС на тех.нужды+прогрев'!$A$11,0))","v":0},{"$f":"I19*$D$19","v":4464},{"$f":"J19*$D$19","v":8928},0,0,30752,0,69440,0,0,0,{"$f":"SUM(S19:AB19)*$AC$11","v":478188.64},28190.159999999996,{"$f":"ROUND(VLOOKUP($AE$8, 'исх данные'!$B$3:$D$12, 3,FALSE),2)","v":58000}]
["2016-02-01",29,null,464,"прогрев бетона и тех. Нужды",9,{"$f":"32.92+25.6+1.24+60.8","v":120.56},{"$f":"IF(E20=\"тех. Нужды\",'ДЭС на тех.нужды'!$E$3,'ДЭС на тех.нужды+прогрев'!$E$3)","v":229},{"$f":"IF(E20=\"тех. нужды\", IF('ДЭС на тех.нужды'!$B$2=1,'ДЭС на тех.нужды'!$A$2,0),IF('ДЭС на тех.нужды+прогрев'!$B$2=1,'ДЭС на тех.нужды+прогрев'!$A$2,0))","v":9},{"$f":"IF(E20=\"тех. нужды\", IF('ДЭС на тех.нужды'!$B$3=1,'ДЭС на тех.нужды'!$A$3,0),IF('ДЭС на тех.нужды+прогрев'!$B$3=1,'ДЭС на тех.нужды+прогрев'!$A$3,0))","v":18},{"$f":"IF(E20=\"тех. нужды\", IF('ДЭС на тех.нужды'!$B$4=1,'ДЭС на тех.нужды'!$A$4,0),IF('ДЭС на тех.нужды+прогрев'!$B$4=1,'ДЭС на тех.нужды+прогрев'!$A$4,0))","v":0},{"$f":"IF(E20=\"тех. нужды\", IF('ДЭС на тех.нужды'!$B$5=1,'ДЭС на тех.нужды'!$A$5,0),IF('ДЭС на тех.нужды+прогрев'!$B$5=1,'ДЭС на тех.нужды+прогрев'!$A$5,0))","v":0},{"$f":"IF(E20=\"тех. нужды\", IF('ДЭС на тех.нужды'!$B$6=1,'ДЭС на тех.нужды'!$A$6,0),IF('ДЭС на тех.нужды+прогрев'!$B$6=1,'ДЭС на тех.нужды+прогрев'!$A$6,0))","v":62},{"$f":"IF(E20=\"тех. нужды\", IF('ДЭС на тех.нужды'!$B$7=1,'ДЭС на тех.нужды'!$A$7,0),IF('ДЭС на тех.нужды+прогрев'!$B$7=1,'ДЭС на тех.нужды+прогрев'!$A$7,0))","v":0},{"$f":"IF(E20=\"тех. нужды\", IF('ДЭС на тех.нужды'!$B$8=1,'ДЭС на тех.нужды'!$A$8,0),IF('ДЭС на тех.нужды+прогрев'!$B$8=1,'ДЭС на тех.нужды+прогрев'!$A$8,0))","v":140},{"$f":"IF(E20=\"тех. нужды\", IF('ДЭС на тех.нужды'!$B$9=1,'ДЭС на тех.нужды'!$A$9,0),IF('ДЭС на тех.нужды+прогрев'!$B$9=1,'ДЭС на тех.нужды+прогрев'!$A$9,0))","v":0},{"$f":"IF(E20=\"тех. нужды\", IF('ДЭС на тех.нужды'!$B$10=1,'ДЭС на тех.нужды'!$A$10,0),IF('ДЭС на тех.нужды+прогрев'!$B$10=1,'ДЭС на тех.нужды+прогрев'!$A$10,0))","v":0},{"$f":"IF(E20=\"тех. нужды\", IF('ДЭС на тех.нужды'!$B$11=1,'ДЭС на тех.нужды'!$A$11,0),IF('ДЭС на тех.нужды+прогрев'!$B$11=1,'ДЭС на тех.нужды+прогрев'!$A$11,0))","v":0},{"$f":"I20*$D$20","v":4176},{"$f":"J20*$D$20","v":8352},0,0,28768,0,64960,0,0,0,{"$f":"SUM(S20:AB20)*$AC$11","v":447337.76},26371.439999999999,{"$f":"ROUND(VLOOKUP($AE$8, 'исх данные'!$B$3:$D$12, 3,FALSE),2)","v":58000}]
{"$rows_left_out":10}
{"sheet":"ДЭС на тех.нужды+прогрев","index":1,"n_rows":26,"n_cols":5,"rows_kept":26,"cut":false,"hidden":false,"merged":[]}
["кВт при 70% загрузке ДЭС"]
[9,{"$f":"MOD(TRUNC($E$8*2/2^ROW()),2)","v":1},null,"Нагрузка без учета питания от гор.сетей",{"$f":"'калькулятор ДЭС'!G17-'калькулятор ДЭС'!F17","v":229.22}]
[18,{"$f":"MOD(TRUNC($E$8*2/2^ROW()),2)","v":1},null,"Суммарная нагрузка от ДЭС",{"$f":"SUMPRODUCT(A2:A13,B2:B13)","v":229}]
[25,{"$f":"MOD(TRUNC($E$8*2/2^ROW()),2)","v":0},null,"Модуль отклонения",{"$f":"ABS(E2-E3)","v":0.21999999999999886}]
[49,{"$f":"MOD(TRUNC($E$8*2/2^ROW()),2)","v":0}]
[62,{"$f":"MOD(TRUNC($E$8*2/2^ROW()),2)","v":1}]
[76,{"$f":"MOD(TRUNC($E$8*2/2^ROW()),2)","v":0}]
[140,{"$f":"MOD(TRUNC($E$8*2/2^ROW()),2)","v":1},null,"№ решения",{"$f":"MAX((ABS(E2-MMULT(MOD(TRUNC(ROW(2:4096)/2^TRANSPOSE(ROW(2:13)-1)),2)*TRANSPOSE(A2:A13),ROW(2:13)^0))=MIN(ABS(E2-MMULT(MOD(TRUNC(ROW(2:4096)/2^TRANSPOSE(ROW(2:13)-1)),2)*TRANSPOSE(A2:A13),ROW(2:13)^0))))*ROW(2:4096))","v":2215}]
[196,{"$f":"MOD(TRUNC($E$8*2/2^ROW()),2)","v":0}]
[224,{"$f":"MOD(TRUNC($E$8*2/2^ROW()),2)","v":0}]
[280,{"$f":"MOD(TRUNC($E$8*2/2^ROW()),2)","v":0}]
[]
[]
[]
[]
["кВт при 70% загрузке ДЭС"]
[9,{"$f":"MOD(TRUNC($E$23*2/2^ROW()),2)","v":0},null,"Нагрузка без учета питания от гор.сетей",229]
[18,{"$f":"MOD(TRUNC($E$23*2/2^ROW()),2)","v":0},null,"Суммарная нагрузка от ДЭС",{"$f":"SUMPRODUCT(A17:A28,B17:B28)","v":0}]
[25,0,null,"Модуль отклонения",{"$f":"ABS(E17-E18)","v":229}]
[49,0]
{"$rows_left_out":7}
{"sheet":"ДЭС на тех.нужды","index":2,"n_rows":11,"n_cols":5,"rows_kept":11,"cut":false,"hidden":false,"merged":[]}
["кВт при 70% загрузке ДЭС"]
[{"$f":"'калькулятор ДЭС'!I10","v":9},{"$f":"MOD(TRUNC($E$8*2/2^ROW()),2)","v":0},null,"Нагрузка без учета питания от гор.сетей",{"$f":"'калькулятор ДЭС'!G12-'калькулятор ДЭС'!F12","v":111.56}]
[{"$f":"'калькулятор ДЭС'!J10","v":18},{"$f":"MOD(TRUNC($E$8*2/2^ROW()),2)","v":0},null,"Суммарная нагрузка от ДЭС",{"$f":"SUMPRODUCT(A2:A13,B2:B13)","v":111}]
[{"$f":"'калькулятор ДЭС'!K10","v":25},0,null,"Модуль отклонения",{"$f":"ABS(E2-E3)","v":0.56000000000000227}]
[{"$f":"'калькулятор ДЭС'!L10","v":49},1]
[{"$f":"'калькулятор ДЭС'!M10","v":62},1]
[{"$f":"'калькулятор ДЭС'!N10","v":76},0]
[{"$f":"'калькулятор ДЭС'!O10","v":140},0,null,"№ решения",{"$f":"MAX((ABS(E2-MMULT(MOD(TRUNC(ROW(2:4096)/2^TRANSPOSE(ROW(2:13)-1)),2)*TRANSPOSE(A2:A13),ROW(2:13)^0))=MIN(ABS(E2-MMULT(MOD(TRUNC(ROW(2:4096)/2^TRANSPOSE(ROW(2:13)-1)),2)*TRANSPOSE(A2:A13),ROW(2:13)^0))))*ROW(2:4096))","v":2097}]
[{"$f":"'калькулятор ДЭС'!P10","v":196},0]
[{"$f":"'калькулятор ДЭС'!Q10","v":224},0]
[{"$f":"'калькулятор ДЭС'!R10","v":280},0]

{"sheet":"исх данные","index":3,"n_rows":55,"n_cols":8,"rows_kept":55,"cut":false,"hidden":false,"merged":[[17,6,28,6],[30,6,41,6],[43,6,54,6]]}
[]
[null,"ДЭС","стоимость 1 м*час работы","стоимость 1 мес. Резерва","кВА","cosф","кВт"]
[null,"AKSA APD 16, ",280,43000,16,0.8,{"$f":"E3*F3","v":12.8}]
[null,"Wilson P33",350,46000,33,0.8,26.400000000000002]
[null,"AKSA APD 44",400,49000,44,0.8,35.200000000000003]
[null,"Wilson P88",616,52000,88,0.8,70.400000000000006]
[null,"Wilson P110",760,55000,110,0.8,88]
[null,"Wilson P135",800,58000,135,0.8,108]
[null,"Wilson P250",1180,61000,250,0.8,200]
[null,"Wilson P350",1475,64000,350,0.8,280]
[null,"Wilson P400",1800,67000,400,0.8,320]
[null,"Wilson P500",2150,70000,500,0.8,400]
[]
[]
[]
[null,"тех. нужды"]
[null,"прогрев бетона и тех. Нужды"]
[null,null,null,null,null,null,2015,"2015-01-01"]
[null,null,null,null,null,null,null,"2015-02-01"]
[null,null,null,null,null,null,null,"2015-03-01"]
{"$rows_left_out":35}