{"text_format":"1","workbook":"xlsx","n_sheets":3,"sheets":["Запас","База контрагентов","План факт"],"not_rendered":{"charts":0,"images":0,"macros":1,"external_links":0,"defined_names":0,"comments":0,"pivot_tables":0},"unopened":[],"bounds":{"document_bytes":16777216,"sheet_cells":100000,"rows_first":2000,"rows_last":500,"rows_between":2000,"halvings":0,"cell_chars":16384,"cell_head_chars":4096},"cells_cut":0,"cells_raw":0,"read":"whole","date_system":"1900"}

{"sheet":"Запас","index":0,"n_rows":6,"n_cols":5,"rows_kept":6,"cut":false,"hidden":true,"merged":[]}
["Наименование контрагента","Поставляемая продукция","План","Факт","Разница"]
["Луканин",{"$f":"IFERROR(VLOOKUP(A2, 'База контрагентов'!$A$3:$B$6, 2,0),\"\")","v":"ягоды"},90,150,{"$f":"D2 - C2","v":60}]
["Альянс",{"$f":"IFERROR(VLOOKUP(A3, 'База контрагентов'!$A$3:$B$6, 2,0),\"\")","v":"травы"},88,120,32]
["Соки-воды",{"$f":"IFERROR(VLOOKUP(A4, 'База контрагентов'!$A$3:$B$6, 2,0),\"\")","v":"сок"},null,null,0]
["Зеленая планета",{"$f":"IFERROR(VLOOKUP(A5, 'База контрагентов'!$A$3:$B$6, 2,0),\"\")","v":"овощи"},null,null,0]
["Итого",null,{"$f":"SUM(C2:C5)","v":178},{"$f":"SUM(D2:D5)","v":270}]

{"sheet":"База контрагентов","index":1,"n_rows":6,"n_cols":2,"rows_kept":6,"cut":false,"hidden":false,"merged":[]}
["Наименование","Продукция"]
["Амикс групп","грибы"]
["Луканин","ягоды"]
["Альянс","травы"]
["Соки-воды","сок"]
["Зеленая планета","овощи"]

{"sheet":"План факт","index":2,"n_rows":5,"n_cols":5,"rows_kept":5,"cut":false,"hidden":false,"merged":[]}
["Наименование контрагента","Поставляемая продукция","План","Факт","Разница"]
["Амикс групп",{"$f":"IFERROR(VLOOKUP(A2, 'База контрагентов'!$A$2:$B$6, 2,0),\"\")","v":"грибы"},78,56,{"$f":"D2 - C2","v":-22}]
["Луканин",{"$f":"IFERROR(VLOOKUP(A3, 'База контрагентов'!$A$2:$B$6, 2,0),\"\")","v":"ягоды"},90,150,60]
["Альянс",{"$f":"IFERROR(VLOOKUP(A4, 'База контрагентов'!$A$2:$B$6, 2,0),\"\")","v":"травы"},88,120,32]
["Итого",null,{"$f":"SUM(C2:C4)","v":256},{"$f":"SUM(D2:D4)","v":326}]