{"text_format":"1","workbook":"xlsx","n_sheets":4,"sheets":["Лист11","Лист1(а)","Лист2","Лист1"],"not_rendered":{"charts":0,"images":0,"macros":1,"external_links":0,"defined_names":1,"comments":1,"pivot_tables":0},"unopened":[],"bounds":{"document_bytes":16777216,"sheet_cells":100000,"rows_first":2000,"rows_last":500,"rows_between":2000,"halvings":0,"cell_chars":16384,"cell_head_chars":4096},"cells_cut":0,"cells_raw":0,"read":"whole","date_system":"1900"}

{"sheet":"Лист11","index":0,"n_rows":23,"n_cols":6,"rows_kept":23,"cut":false,"hidden":false,"merged":[]}
["Название компании","Адрес","Руководитель","Телефон","Направление деятельности","Собственность"]
[{"$f":"IFERROR(VLOOKUP(ROW($A1)&A$1,Лист2!$B$1:$E$113,4,0),\"\")","v":"«АРД-М» ООО"},{"$f":"IFERROR(VLOOKUP(ROW($A1)&B$1,Лист2!$B$1:$E$113,4,0),\"\")","v":"361411, Кабардино-Балкарская Республика, Чегемский р-н, с. Нартан"},{"$f":"IFERROR(VLOOKUP(ROW($A1)&C$1,Лист2!$B$1:$E$113,4,0),\"\")","v":"Хагабанов Сафраил Хаутиевич"},{"$f":"IFERROR(VLOOKUP(ROW($A1)&D$1,Лист2!$B$1:$E$113,4,0),\"\")","v":"(86630) 4-12-95"},{"$f":"IFERROR(VLOOKUP(ROW($A1)&E$1,Лист2!$B$1:$E$113,4,0),\"\")","v":"зерноводство"},{"$f":"IFERROR(VLOOKUP(ROW($A1)&F$1,Лист2!$B$1:$E$113,4,0),\"\")","v":"частная"}]
[{"$f":"IFERROR(VLOOKUP(ROW($A2)&A$1,Лист2!$B$1:$E$113,4,0),\"\")","v":"«БАКСАНСКИЙ» ПЛОДОПИТОМНИК"},{"$f":"IFERROR(VLOOKUP(ROW($A2)&B$1,Лист2!$B$1:$E$113,4,0),\"\")","v":"361510, Кабардино-Балкарская Республика, Баксанский р-н, с. Псычох"},{"$f":"IFERROR(VLOOKUP(ROW($A2)&C$1,Лист2!$B$1:$E$113,4,0),\"\")","v":"Архестов Хасан Кадырович"},{"$f":"IFERROR(VLOOKUP(ROW($A2)&D$1,Лист2!$B$1:$E$113,4,0),\"\")","v":"(86634) 7-41-38, 7-41-48"},{"$f":"IFERROR(VLOOKUP(ROW($A2)&E$1,Лист2!$B$1:$E$113,4,0),\"\")","v":"выращивание плодово-ягодных культур"},{"$f":"IFERROR(VLOOKUP(ROW($A2)&F$1,Лист2!$B$1:$E$113,4,0),\"\")","v":"государственная"}]
[{"$f":"IFERROR(VLOOKUP(ROW($A3)&A$1,Лист2!$B$1:$E$113,4,0),\"\")","v":"«БЕЛОКАМЕНСКОЕ» СЕЛЬХОЗПРЕДПРИЯТИЕ (ООО)"},{"$f":"IFERROR(VLOOKUP(ROW($A3)&B$1,Лист2!$B$1:$E$113,4,0),\"\")","v":"361720, Кабардино-Балкарская Республика, Зольский р-н, с. Белокаменское, ул. Центральная, 1"},{"$f":"IFERROR(VLOOKUP(ROW($A3)&C$1,Лист2!$B$1:$E$113,4,0),\"\")","v":"Шабатоков Резван Хасинович"},{"$f":"IFERROR(VLOOKUP(ROW($A3)&D$1,Лист2!$B$1:$E$113,4,0),\"\")","v":"(86637) 7-57-18"},{"$f":"IFERROR(VLOOKUP(ROW($A3)&E$1,Лист2!$B$1:$E$113,4,0),\"\")","v":"выращивание зернобобовых культур; животноводство молочное"},{"$f":"IFERROR(VLOOKUP(ROW($A3)&F$1,Лист2!$B$1:$E$113,4,0),\"\")","v":"частная"}]
[{"$f":"IFERROR(VLOOKUP(ROW($A4)&A$1,Лист2!$B$1:$E$113,4,0),\"\")","v":"«ВИНОГРАД» НАРОДНОЕ ПРЕДПРИЯТИЕ (ЗАО)"},{"$f":"IFERROR(VLOOKUP(ROW($A4)&B$1,Лист2!$B$1:$E$113,4,0),\"\")","v":"361044, Кабардино-Балкарская Республика, г. Прохладный, ул. Горького, 59"},{"$f":"IFERROR(VLOOKUP(ROW($A4)&C$1,Лист2!$B$1:$E$113,4,0),\"\")","v":"Тхалиджоков Сафарби Лионович"},{"$f":"IFERROR(VLOOKUP(ROW($A4)&D$1,Лист2!$B$1:$E$113,4,0),\"\")","v":"(86631) 7-74-20, 7-70-50, 7-78-38"},{"$f":"IFERROR(VLOOKUP(ROW($A4)&E$1,Лист2!$B$1:$E$113,4,0),\"\")","v":"виноградарство; животноводство"},{"$f":"IFERROR(VLOOKUP(ROW($A4)&F$1,Лист2!$B$1:$E$113,4,0),\"\")","v":"частная"}]
[{"$f":"IFERROR(VLOOKUP(ROW($A5)&A$1,Лист2!$B$1:$E$113,4,0),\"\")","v":"«ВЛАДИМИР» ПРЕДПРИЯТИЕ"},{"$f":"IFERROR(VLOOKUP(ROW($A5)&B$1,Лист2!$B$1:$E$113,4,0),\"\")","v":"361405, Кабардино-Балкарская Республика, Чегемский р-н, с. Лечинкай"},{"$f":"IFERROR(VLOOKUP(ROW($A5)&C$1,Лист2!$B$1:$E$113,4,0),\"\")","v":"Дышеков Атмир Исуфович"},{"$f":"IFERROR(VLOOKUP(ROW($A5)&D$1,Лист2!$B$1:$E$113,4,0),\"\")","v":"(909) 491-21-02"},{"$f":"IFERROR(VLOOKUP(ROW($A5)&E$1,Лист2!$B$1:$E$113,4,0),\"\")","v":"животноводство"},{"$f":"IFERROR(VLOOKUP(ROW($A5)&F$1,Лист2!$B$1:$E$113,4,0),\"\")","v":"частная"}]
[{"$f":"IFERROR(VLOOKUP(ROW($A6)&A$1,Лист2!$B$1:$E$113,4,0),\"\")","v":"«ВОСХОД» ООО"},{"$f":"IFERROR(VLOOKUP(ROW($A6)&B$1,Лист2!$B$1:$E$113,4,0),\"\")","v":"361011, Кабардино-Балкарская Республика, Прохладненский р-н, с. Пролетарское"},{"$f":"IFERROR(VLOOKUP(ROW($A6)&C$1,Лист2!$B$1:$E$113,4,0),\"\")","v":"Кехер Олег Аликберович"},{"$f":"IFERROR(VLOOKUP(ROW($A6)&D$1,Лист2!$B$1:$E$113,4,0),\"\")","v":"(86631) 6-30-00"},{"$f":"IFERROR(VLOOKUP(ROW($A6)&E$1,Лист2!$B$1:$E$113,4,0),\"\")","v":"животноводство; растениеводство"},{"$f":"IFERROR(VLOOKUP(ROW($A6)&F$1,Лист2!$B$1:$E$113,4,0),\"\")","v":"частная"}]
[{"$f":"IFERROR(VLOOKUP(ROW($A7)&A$1,Лист2!$B$1:$E$113,4,0),\"\")","v":"«ДАЛЬНИЙ» СП. АДМИНИСТРАЦИЯ РАЙОНА"},{"$f":"IFERROR(VLOOKUP(ROW($A7)&B$1,Лист2!$B$1:$E$113,4,0),\"\")","v":"361013, Кабардино-Балкарская Республика, Прохладненский р-н, с. Дальнее"},{"$f":"IFERROR(VLOOKUP(ROW($A7)&C$1,Лист2!$B$1:$E$113,4,0),\"\")","v":""},{"$f":"IFERROR(VLOOKUP(ROW($A7)&D$1,Лист2!$B$1:$E$113,4,0),\"\")","v":"(86631) 9-43-23"},{"$f":"IFERROR(VLOOKUP(ROW($A7)&E$1,Лист2!$B$1:$E$113,4,0),\"\")","v":"животноводство; растениеводство"},{"$f":"IFERROR(VLOOKUP(ROW($A7)&F$1,Лист2!$B$1:$E$113,4,0),\"\")","v":"государственная"}]
[{"$f":"IFERROR(VLOOKUP(ROW($A8)&A$1,Лист2!$B$1:$E$113,4,0),\"\")","v":"ЗАО ИМЕНИ БАЙСУЛТАНОВА"},{"$f":"IFERROR(VLOOKUP(ROW($A8)&B$1,Лист2!$B$1:$E$113,4,0),\"\")","v":"361424, Кабардино-Балкарская Республика, Чегемский р-н, с. Яникой, ул. Мечиева, 84"},{"$f":"IFERROR(VLOOKUP(ROW($A8)&C$1,Лист2!$B$1:$E$113,4,0),\"\")","v":"Гелястанов Мухтар Ахматович"},{"$f":"IFERROR(VLOOKUP(ROW($A8)&D$1,Лист2!$B$1:$E$113,4,0),\"\")","v":"(86630) 7-82-48; (928) 700-11-50"},{"$f":"IFERROR(VLOOKUP(ROW($A8)&E$1,Лист2!$B$1:$E$113,4,0),\"\")","v":"животноводство молочное"},{"$f":"IFERROR(VLOOKUP(ROW($A8)&F$1,Лист2!$B$1:$E$113,4,0),\"\")","v":"акционерная"}]
[{"$f":"IFERROR(VLOOKUP(ROW($A9)&A$1,Лист2!$B$1:$E$113,4,0),\"\")","v":"ЗАО ИМЕНИ КАЛАБЕКОВА"},{"$f":"IFERROR(VLOOKUP(ROW($A9)&B$1,Лист2!$B$1:$E$113,4,0),\"\")","v":"361416, Кабардино-Балкарская Республика, Чегемский р-н, с. Булунгу, ул. Кулиева, 45"},{"$f":"IFERROR(VLOOKUP(ROW($A9)&C$1,Лист2!$B$1:$E$113,4,0),\"\")","v":"Кулиев Зафир Магомедович"},{"$f":"IFERROR(VLOOKUP(ROW($A9)&D$1,Лист2!$B$1:$E$113,4,0),\"\")","v":"(86630) 9-43-44, 7-97-46"},{"$f":"IFERROR(VLOOKUP(ROW($A9)&E$1,Лист2!$B$1:$E$113,4,0),\"\")","v":"животноводство"},{"$f":"IFERROR(VLOOKUP(ROW($A9)&F$1,Лист2!$B$1:$E$113,4,0),\"\")","v":"акционерная"}]
[{"$f":"IFERROR(VLOOKUP(ROW($A10)&A$1,Лист2!$B$1:$E$113,4,0),\"\")","v":"«ЗАРЯ» ООО"},{"$f":"IFERROR(VLOOKUP(ROW($A10)&B$1,Лист2!$B$1:$E$113,4,0),\"\")","v":"361013, Кабардино-Балкарская Республика, Прохладненский р-н, с. Дальнее"},{"$f":"IFERROR(VLOOKUP(ROW($A10)&C$1,Лист2!$B$1:$E$113,4,0),\"\")","v":"Асманов К.М."},{"$f":"IFERROR(VLOOKUP(ROW($A10)&D$1,Лист2!$B$1:$E$113,4,0),\"\")","v":"(86631) 7-01-53"},{"$f":"IFERROR(VLOOKUP(ROW($A10)&E$1,Лист2!$B$1:$E$113,4,0),\"\")","v":"животноводство; растениеводство"},{"$f":"IFERROR(VLOOKUP(ROW($A10)&F$1,Лист2!$B$1:$E$113,4,0),\"\")","v":"частная"}]
[{"$f":"IFERROR(VLOOKUP(ROW($A11)&A$1,Лист2!$B$1:$E$113,4,0),\"\")","v":"«КАМЫШОВАЯ БАЛКА» СЕЛЬХОЗПРЕДПРИЯТИЕ (ООО)"},{"$f":"IFERROR(VLOOKUP(ROW($A11)&B$1,Лист2!$B$1:$E$113,4,0),\"\")","v":"361715, Кабардино-Балкарская Республика, Зольский р-н, с. Камлюково, ул. Калмыкова, 54"},{"$f":"IFERROR(VLOOKUP(ROW($A11)&C$1,Лист2!$B$1:$E$113,4,0),\"\")","v":"Канихов Ахмет Наурбиевич"},{"$f":"IFERROR(VLOOKUP(ROW($A11)&D$1,Лист2!$B$1:$E$113,4,0),\"\")","v":"(86637) 7-33-30"},{"$f":"IFERROR(VLOOKUP(ROW($A11)&E$1,Лист2!$B$1:$E$113,4,0),\"\")","v":"растениеводство"},{"$f":"IFERROR(VLOOKUP(ROW($A11)&F$1,Лист2!$B$1:$E$113,4,0),\"\")","v":"частная"}]
[{"$f":"IFERROR(VLOOKUP(ROW($A12)&A$1,Лист2!$B$1:$E$113,4,0),\"\")","v":"«КАСАЕВО» СЕЛЬСКОХОЗЯЙСТВЕННЫЙ ПРОИЗВОДСТВЕННЫЙ КООПЕРАТИВ"},{"$f":"IFERROR(VLOOKUP(ROW($A12)&B$1,Лист2!$B$1:$E$113,4,0),\"\")","v":"361503, Кабардино-Балкарская Республика, Баксанский р-н, с. Баксаненок, ул. Березгова, 120"},{"$f":"IFERROR(VLOOKUP(ROW($A12)&C$1,Лист2!$B$1:$E$113,4,0),\"\")","v":"Кимахов Гумарби Ксниублевич"},{"$f":"IFERROR(VLOOKUP(ROW($A12)&D$1,Лист2!$B$1:$E$113,4,0),\"\")","v":"(86634) 3-61-79; (926) 690-61-65"},{"$f":"IFERROR(VLOOKUP(ROW($A12)&E$1,Лист2!$B$1:$E$113,4,0),\"\")","v":"выращивание зернобобовых культур"},{"$f":"IFERROR(VLOOKUP(ROW($A12)&F$1,Лист2!$B$1:$E$113,4,0),\"\")","v":"частная"}]
[{"$f":"IFERROR(VLOOKUP(ROW($A13)&A$1,Лист2!$B$1:$E$113,4,0),\"\")","v":"КОЛХОЗ ИМЕНИ ПЕТРОВЫХ"},{"$f":"IFERROR(VLOOKUP(ROW($A13)&B$1,Лист2!$B$1:$E$113,4,0),\"\")","v":"361015, Кабардино-Балкарская Республика, Прохладненский р-н, стан. Ека-териноградская, ул. Ленина, 3"},{"$f":"IFERROR(VLOOKUP(ROW($A13)&C$1,Лист2!$B$1:$E$113,4,0),\"\")","v":"Говоров Сергей Анатольевич"},{"$f":"IFERROR(VLOOKUP(ROW($A13)&D$1,Лист2!$B$1:$E$113,4,0),\"\")","v":"(86631) 7-81-60, 7-85-65"},{"$f":"IFERROR(VLOOKUP(ROW($A13)&E$1,Лист2!$B$1:$E$113,4,0),\"\")","v":"зерноводство"},{"$f":"IFERROR(VLOOKUP(ROW($A13)&F$1,Лист2!$B$1:$E$113,4,0),\"\")","v":"коллективная"}]
[{"$f":"IFERROR(VLOOKUP(ROW($A14)&A$1,Лист2!$B$1:$E$113,4,0),\"\")","v":"«КОНСТАНТИНОВСКОЕ» СЕЛЬХОЗПРЕДПРИЯТИЕ (ООО)"},{"$f":"IFERROR(VLOOKUP(ROW($A14)&B$1,Лист2!$B$1:$E$113,4,0),\"\")","v":"361504, Кабардино-Балкарская Республика, Баксанский р-н, с. Кременчуг-Константиновское, ул. Садовая,"},{"$f":"IFERROR(VLOOKUP(ROW($A14)&C$1,Лист2!$B$1:$E$113,4,0),\"\")","v":"Лобко Александр Викторович"},{"$f":"IFERROR(VLOOKUP(ROW($A14)&D$1,Лист2!$B$1:$E$113,4,0),\"\")","v":"(906) 483-66-06"},{"$f":"IFERROR(VLOOKUP(ROW($A14)&E$1,Лист2!$B$1:$E$113,4,0),\"\")","v":"выращивание зернобобовых культур"},{"$f":"IFERROR(VLOOKUP(ROW($A14)&F$1,Лист2!$B$1:$E$113,4,0),\"\")","v":"частная"}]
{"$rows_left_out":9}
{"sheet":"Лист1(а)","index":1,"n_rows":23,"n_cols":6,"rows_kept":23,"cut":false,"hidden":false,"merged":[]}
["Название компании","Адрес","Руководитель","Телефон","Направление деятельности","Собственность"]
[{"$f":"INDEX(Лист2!$E$1:$E$113,MATCH(ROW(A1)&A$1,Сцеплено,0),1)","v":"«АРД-М» ООО"},{"$f":"INDEX(Лист2!$E$1:$E$113,MATCH(ROW(B1)&B$1,Сцеплено,0),1)","v":"361411, Кабардино-Балкарская Республика, Чегемский р-н, с. Нартан"},{"$f":"INDEX(Лист2!$E$1:$E$113,MATCH(ROW(C1)&C$1,Сцеплено,0),1)","v":"Хагабанов Сафраил Хаутиевич"},{"$f":"INDEX(Лист2!$E$1:$E$113,MATCH(ROW(D1)&D$1,Сцеплено,0),1)","v":"(86630) 4-12-95"},{"$f":"INDEX(Лист2!$E$1:$E$113,MATCH(ROW(E1)&E$1,Сцеплено,0),1)","v":"зерноводство"},{"$f":"INDEX(Лист2!$E$1:$E$113,MATCH(ROW(F1)&F$1,Сцеплено,0),1)","v":"частная"}]
[{"$f":"INDEX(Лист2!$E$1:$E$113,MATCH(ROW(A2)&A$1,Сцеплено,0),1)","v":"«БАКСАНСКИЙ» ПЛОДОПИТОМНИК"},{"$f":"INDEX(Лист2!$E$1:$E$113,MATCH(ROW(B2)&B$1,Сцеплено,0),1)","v":"361510, Кабардино-Балкарская Республика, Баксанский р-н, с. Псычох"},{"$f":"INDEX(Лист2!$E$1:$E$113,MATCH(ROW(C2)&C$1,Сцеплено,0),1)","v":"Архестов Хасан Кадырович"},{"$f":"INDEX(Лист2!$E$1:$E$113,MATCH(ROW(D2)&D$1,Сцеплено,0),1)","v":"(86634) 7-41-38, 7-41-48"},{"$f":"INDEX(Лист2!$E$1:$E$113,MATCH(ROW(E2)&E$1,Сцеплено,0),1)","v":"выращивание плодово-ягодных культур"},{"$f":"INDEX(Лист2!$E$1:$E$113,MATCH(ROW(F2)&F$1,Сцеплено,0),1)","v":"государственная"}]
[{"$f":"INDEX(Лист2!$E$1:$E$113,MATCH(ROW(A3)&A$1,Сцеплено,0),1)","v":"«БЕЛОКАМЕНСКОЕ» СЕЛЬХОЗПРЕДПРИЯТИЕ (ООО)"},{"$f":"INDEX(Лист2!$E$1:$E$113,MATCH(ROW(B3)&B$1,Сцеплено,0),1)","v":"361720, Кабардино-Балкарская Республика, Зольский р-н, с. Белокаменское, ул. Центральная, 1"},{"$f":"INDEX(Лист2!$E$1:$E$113,MATCH(ROW(C3)&C$1,Сцеплено,0),1)","v":"Шабатоков Резван Хасинович"},{"$f":"INDEX(Лист2!$E$1:$E$113,MATCH(ROW(D3)&D$1,Сцеплено,0),1)","v":"(86637) 7-57-18"},{"$f":"INDEX(Лист2!$E$1:$E$113,MATCH(ROW(E3)&E$1,Сцеплено,0),1)","v":"выращивание зернобобовых культур; животноводство молочное"},{"$f":"INDEX(Лист2!$E$1:$E$113,MATCH(ROW(F3)&F$1,Сцеплено,0),1)","v":"частная"}]
[{"$f":"INDEX(Лист2!$E$1:$E$113,MATCH(ROW(A4)&A$1,Сцеплено,0),1)","v":"«ВИНОГРАД» НАРОДНОЕ ПРЕДПРИЯТИЕ (ЗАО)"},{"$f":"INDEX(Лист2!$E$1:$E$113,MATCH(ROW(B4)&B$1,Сцеплено,0),1)","v":"361044, Кабардино-Балкарская Республика, г. Прохладный, ул. Горького, 59"},{"$f":"INDEX(Лист2!$E$1:$E$113,MATCH(ROW(C4)&C$1,Сцеплено,0),1)","v":"Тхалиджоков Сафарби Лионович"},{"$f":"INDEX(Лист2!$E$1:$E$113,MATCH(ROW(D4)&D$1,Сцеплено,0),1)","v":"(86631) 7-74-20, 7-70-50, 7-78-38"},{"$f":"INDEX(Лист2!$E$1:$E$113,MATCH(ROW(E4)&E$1,Сцеплено,0),1)","v":"виноградарство; животноводство"},{"$f":"INDEX(Лист2!$E$1:$E$113,MATCH(ROW(F4)&F$1,Сцеплено,0),1)","v":"частная"}]
[{"$f":"INDEX(Лист2!$E$1:$E$113,MATCH(ROW(A5)&A$1,Сцеплено,0),1)","v":"«ВЛАДИМИР» ПРЕДПРИЯТИЕ"},{"$f":"INDEX(Лист2!$E$1:$E$113,MATCH(ROW(B5)&B$1,Сцеплено,0),1)","v":"361405, Кабардино-Балкарская Республика, Чегемский р-н, с. Лечинкай"},{"$f":"INDEX(Лист2!$E$1:$E$113,MATCH(ROW(C5)&C$1,Сцеплено,0),1)","v":"Дышеков Атмир Исуфович"},{"$f":"INDEX(Лист2!$E$1:$E$113,MATCH(ROW(D5)&D$1,Сцеплено,0),1)","v":"(909) 491-21-02"},{"$f":"INDEX(Лист2!$E$1:$E$113,MATCH(ROW(E5)&E$1,Сцеплено,0),1)","v":"животноводство"},{"$f":"INDEX(Лист2!$E$1:$E$113,MATCH(ROW(F5)&F$1,Сцеплено,0),1)","v":"частная"}]
[{"$f":"INDEX(Лист2!$E$1:$E$113,MATCH(ROW(A6)&A$1,Сцеплено,0),1)","v":"«ВОСХОД» ООО"},{"$f":"INDEX(Лист2!$E$1:$E$113,MATCH(ROW(B6)&B$1,Сцеплено,0),1)","v":"361011, Кабардино-Балкарская Республика, Прохладненский р-н, с. Пролетарское"},{"$f":"INDEX(Лист2!$E$1:$E$113,MATCH(ROW(C6)&C$1,Сцеплено,0),1)","v":"Кехер Олег Аликберович"},{"$f":"INDEX(Лист2!$E$1:$E$113,MATCH(ROW(D6)&D$1,Сцеплено,0),1)","v":"(86631) 6-30-00"},{"$f":"INDEX(Лист2!$E$1:$E$113,MATCH(ROW(E6)&E$1,Сцеплено,0),1)","v":"животноводство; растениеводство"},{"$f":"INDEX(Лист2!$E$1:$E$113,MATCH(ROW(F6)&F$1,Сцеплено,0),1)","v":"частная"}]
[{"$f":"INDEX(Лист2!$E$1:$E$113,MATCH(ROW(A7)&A$1,Сцеплено,0),1)","v":"«ДАЛЬНИЙ» СП. АДМИНИСТРАЦИЯ РАЙОНА"},{"$f":"INDEX(Лист2!$E$1:$E$113,MATCH(ROW(B7)&B$1,Сцеплено,0),1)","v":"361013, Кабардино-Балкарская Республика, Прохладненский р-н, с. Дальнее"},{"$f":"INDEX(Лист2!$E$1:$E$113,MATCH(ROW(C7)&C$1,Сцеплено,0),1)","v":{"$error":"#N/A"}},{"$f":"INDEX(Лист2!$E$1:$E$113,MATCH(ROW(D7)&D$1,Сцеплено,0),1)","v":"(86631) 9-43-23"},{"$f":"INDEX(Лист2!$E$1:$E$113,MATCH(ROW(E7)&E$1,Сцеплено,0),1)","v":"животноводство; растениеводство"},{"$f":"INDEX(Лист2!$E$1:$E$113,MATCH(ROW(F7)&F$1,Сцеплено,0),1)","v":"государственная"}]
[{"$f":"INDEX(Лист2!$E$1:$E$113,MATCH(ROW(A8)&A$1,Сцеплено,0),1)","v":"ЗАО ИМЕНИ БАЙСУЛТАНОВА"},{"$f":"INDEX(Лист2!$E$1:$E$113,MATCH(ROW(B8)&B$1,Сцеплено,0),1)","v":"361424, Кабардино-Балкарская Республика, Чегемский р-н, с. Яникой, ул. Мечиева, 84"},{"$f":"INDEX(Лист2!$E$1:$E$113,MATCH(ROW(C8)&C$1,Сцеплено,0),1)","v":"Гелястанов Мухтар Ахматович"},{"$f":"INDEX(Лист2!$E$1:$E$113,MATCH(ROW(D8)&D$1,Сцеплено,0),1)","v":"(86630) 7-82-48; (928) 700-11-50"},{"$f":"INDEX(Лист2!$E$1:$E$113,MATCH(ROW(E8)&E$1,Сцеплено,0),1)","v":"животноводство молочное"},{"$f":"INDEX(Лист2!$E$1:$E$113,MATCH(ROW(F8)&F$1,Сцеплено,0),1)","v":"акционерная"}]
[{"$f":"INDEX(Лист2!$E$1:$E$113,MATCH(ROW(A9)&A$1,Сцеплено,0),1)","v":"ЗАО ИМЕНИ КАЛАБЕКОВА"},{"$f":"INDEX(Лист2!$E$1:$E$113,MATCH(ROW(B9)&B$1,Сцеплено,0),1)","v":"361416, Кабардино-Балкарская Республика, Чегемский р-н, с. Булунгу, ул. Кулиева, 45"},{"$f":"INDEX(Лист2!$E$1:$E$113,MATCH(ROW(C9)&C$1,Сцеплено,0),1)","v":"Кулиев Зафир Магомедович"},{"$f":"INDEX(Лист2!$E$1:$E$113,MATCH(ROW(D9)&D$1,Сцеплено,0),1)","v":"(86630) 9-43-44, 7-97-46"},{"$f":"INDEX(Лист2!$E$1:$E$113,MATCH(ROW(E9)&E$1,Сцеплено,0),1)","v":"животноводство"},{"$f":"INDEX(Лист2!$E$1:$E$113,MATCH(ROW(F9)&F$1,Сцеплено,0),1)","v":"акционерная"}]
[{"$f":"INDEX(Лист2!$E$1:$E$113,MATCH(ROW(A10)&A$1,Сцеплено,0),1)","v":"«ЗАРЯ» ООО"},{"$f":"INDEX(Лист2!$E$1:$E$113,MATCH(ROW(B10)&B$1,Сцеплено,0),1)","v":"361013, Кабардино-Балкарская Республика, Прохладненский р-н, с. Дальнее"},{"$f":"INDEX(Лист2!$E$1:$E$113,MATCH(ROW(C10)&C$1,Сцеплено,0),1)","v":"Асманов К.М."},{"$f":"INDEX(Лист2!$E$1:$E$113,MATCH(ROW(D10)&D$1,Сцеплено,0),1)","v":"(86631) 7-01-53"},{"$f":"INDEX(Лист2!$E$1:$E$113,MATCH(ROW(E10)&E$1,Сцеплено,0),1)","v":"животноводство; растениеводство"},{"$f":"INDEX(Лист2!$E$1:$E$113,MATCH(ROW(F10)&F$1,Сцеплено,0),1)","v":"частная"}]
[{"$f":"INDEX(Лист2!$E$1:$E$113,MATCH(ROW(A11)&A$1,Сцеплено,0),1)","v":"«КАМЫШОВАЯ БАЛКА» СЕЛЬХОЗПРЕДПРИЯТИЕ (ООО)"},{"$f":"INDEX(Лист2!$E$1:$E$113,MATCH(ROW(B11)&B$1,Сцеплено,0),1)","v":"361715, Кабардино-Балкарская Республика, Зольский р-н, с. Камлюково, ул. Калмыкова, 54"},{"$f":"INDEX(Лист2!$E$1:$E$113,MATCH(ROW(C11)&C$1,Сцеплено,0),1)","v":"Канихов Ахмет Наурбиевич"},{"$f":"INDEX(Лист2!$E$1:$E$113,MATCH(ROW(D11)&D$1,Сцеплено,0),1)","v":"(86637) 7-33-30"},{"$f":"INDEX(Лист2!$E$1:$E$113,MATCH(ROW(E11)&E$1,Сцеплено,0),1)","v":"растениеводство"},{"$f":"INDEX(Лист2!$E$1:$E$113,MATCH(ROW(F11)&F$1,Сцеплено,0),1)","v":"частная"}]
[{"$f":"INDEX(Лист2!$E$1:$E$113,MATCH(ROW(A12)&A$1,Сцеплено,0),1)","v":"«КАСАЕВО» СЕЛЬСКОХОЗЯЙСТВЕННЫЙ ПРОИЗВОДСТВЕННЫЙ КООПЕРАТИВ"},{"$f":"INDEX(Лист2!$E$1:$E$113,MATCH(ROW(B12)&B$1,Сцеплено,0),1)","v":"361503, Кабардино-Балкарская Республика, Баксанский р-н, с. Баксаненок, ул. Березгова, 120"},{"$f":"INDEX(Лист2!$E$1:$E$113,MATCH(ROW(C12)&C$1,Сцеплено,0),1)","v":"Кимахов Гумарби Ксниублевич"},{"$f":"INDEX(Лист2!$E$1:$E$113,MATCH(ROW(D12)&D$1,Сцеплено,0),1)","v":"(86634) 3-61-79; (926) 690-61-65"},{"$f":"INDEX(Лист2!$E$1:$E$113,MATCH(ROW(E12)&E$1,Сцеплено,0),1)","v":"выращивание зернобобовых культур"},{"$f":"INDEX(Лист2!$E$1:$E$113,MATCH(ROW(F12)&F$1,Сцеплено,0),1)","v":"частная"}]
[{"$f":"INDEX(Лист2!$E$1:$E$113,MATCH(ROW(A13)&A$1,Сцеплено,0),1)","v":"КОЛХОЗ ИМЕНИ ПЕТРОВЫХ"},{"$f":"INDEX(Лист2!$E$1:$E$113,MATCH(ROW(B13)&B$1,Сцеплено,0),1)","v":"361015, Кабардино-Балкарская Республика, Прохладненский р-н, стан. Ека-териноградская, ул. Ленина, 3"},{"$f":"INDEX(Лист2!$E$1:$E$113,MATCH(ROW(C13)&C$1,Сцеплено,0),1)","v":"Говоров Сергей Анатольевич"},{"$f":"INDEX(Лист2!$E$1:$E$113,MATCH(ROW(D13)&D$1,Сцеплено,0),1)","v":"(86631) 7-81-60, 7-85-65"},{"$f":"INDEX(Лист2!$E$1:$E$113,MATCH(ROW(E13)&E$1,Сцеплено,0),1)","v":"зерноводство"},{"$f":"INDEX(Лист2!$E$1:$E$113,MATCH(ROW(F13)&F$1,Сцеплено,0),1)","v":"коллективная"}]
[{"$f":"INDEX(Лист2!$E$1:$E$113,MATCH(ROW(A14)&A$1,Сцеплено,0),1)","v":"«КОНСТАНТИНОВСКОЕ» СЕЛЬХОЗПРЕДПРИЯТИЕ (ООО)"},{"$f":"INDEX(Лист2!$E$1:$E$113,MATCH(ROW(B14)&B$1,Сцеплено,0),1)","v":"361504, Кабардино-Балкарская Республика, Баксанский р-н, с. Кременчуг-Константиновское, ул. Садовая,"},{"$f":"INDEX(Лист2!$E$1:$E$113,MATCH(ROW(C14)&C$1,Сцеплено,0),1)","v":"Лобко Александр Викторович"},{"$f":"INDEX(Лист2!$E$1:$E$113,MATCH(ROW(D14)&D$1,Сцеплено,0),1)","v":"(906) 483-66-06"},{"$f":"INDEX(Лист2!$E$1:$E$113,MATCH(ROW(E14)&E$1,Сцеплено,0),1)","v":"выращивание зернобобовых культур"},{"$f":"INDEX(Лист2!$E$1:$E$113,MATCH(ROW(F14)&F$1,Сцеплено,0),1)","v":"частная"}]
{"$rows_left_out":9}
{"sheet":"Лист2","index":2,"n_rows":113,"n_cols":5,"rows_kept":113,"cut":false,"hidden":false,"merged":[]}
["«АРД-М» ООО",{"$f":"C1&D1","v":"1Название компании"},{"$f":"COUNTIF($D$1:D1,\"\")+1","v":1},{"$f":"IF(ISBLANK($A1),\"\",IFERROR(MID($A1,1,SEARCH(\":\",$A1)-1),\"Название компании\"))","v":"Название компании"},{"$f":"IFERROR(MID($A1,SEARCH(\":\",$A1)+2,100),$A1)","v":"«АРД-М» ООО"}]
["Адрес: 361411, Кабардино-Балкарская Республика, Чегемский р-н, с. Нартан",{"$f":"C2&D2","v":"1Адрес"},{"$f":"COUNTIF($D$1:D2,\"\")+1","v":1},{"$f":"IF(ISBLANK($A2),\"\",IFERROR(MID($A2,1,SEARCH(\":\",$A2)-1),\"Название компании\"))","v":"Адрес"},{"$f":"IFERROR(MID($A2,SEARCH(\":\",$A2)+2,100),$A2)","v":"361411, Кабардино-Балкарская Республика, Чегемский р-н, с. Нартан"}]
["Руководитель: Хагабанов Сафраил Хаутиевич","1Руководитель",{"$f":"COUNTIF($D$1:D3,\"\")+1","v":1},"Руководитель","Хагабанов Сафраил Хаутиевич"]
["Телефон: (86630) 4-12-95","1Телефон",{"$f":"COUNTIF($D$1:D4,\"\")+1","v":1},"Телефон","(86630) 4-12-95"]
["Направление деятельности: зерноводство","1Направление деятельности",{"$f":"COUNTIF($D$1:D5,\"\")+1","v":1},"Направление деятельности","зерноводство"]
["Собственность: частная","1Собственность",{"$f":"COUNTIF($D$1:D6,\"\")+1","v":1},"Собственность","частная"]
[null,"2",{"$f":"COUNTIF($D$1:D7,\"\")+1","v":2},"",0]
["«БАКСАНСКИЙ» ПЛОДОПИТОМНИК","2Название компании",{"$f":"COUNTIF($D$1:D8,\"\")+1","v":2},"Название компании","«БАКСАНСКИЙ» ПЛОДОПИТОМНИК"]
["Адрес: 361510, Кабардино-Балкарская Республика, Баксанский р-н, с. Псычох","2Адрес",{"$f":"COUNTIF($D$1:D9,\"\")+1","v":2},"Адрес","361510, Кабардино-Балкарская Республика, Баксанский р-н, с. Псычох"]
["Руководитель: Архестов Хасан Кадырович","2Руководитель",{"$f":"COUNTIF($D$1:D10,\"\")+1","v":2},"Руководитель","Архестов Хасан Кадырович"]
["Телефон: (86634) 7-41-38, 7-41-48","2Телефон",{"$f":"COUNTIF($D$1:D11,\"\")+1","v":2},"Телефон","(86634) 7-41-38, 7-41-48"]
["Направление деятельности: выращивание плодово-ягодных культур","2Направление деятельности",{"$f":"COUNTIF($D$1:D12,\"\")+1","v":2},"Направление деятельности","выращивание плодово-ягодных культур"]
["Собственность: государственная","2Собственность",{"$f":"COUNTIF($D$1:D13,\"\")+1","v":2},"Собственность","государственная"]
[null,"3",{"$f":"COUNTIF($D$1:D14,\"\")+1","v":3},"",0]
["«БЕЛОКАМЕНСКОЕ» СЕЛЬХОЗПРЕДПРИЯТИЕ (ООО)","3Название компании",{"$f":"COUNTIF($D$1:D15,\"\")+1","v":3},"Название компании","«БЕЛОКАМЕНСКОЕ» СЕЛЬХОЗПРЕДПРИЯТИЕ (ООО)"]
{"$rows_left_out":99}
{"sheet":"Лист1","index":3,"n_rows":17,"n_cols":7,"rows_kept":17,"cut":false,"hidden":false,"merged":[]}
["Название компании","Адрес","Руководитель","Телефон","Факс","Направление деятельности","Собственность"]
["«АРД-М» ООО"," 361411, Кабардино-Балкарская Республика, Чегемский р-н, с. Нартан"," Хагабанов Сафраил Хаутиевич"," (86630) 4-12-95",null," зерноводство"," частная"]
["«БАКСАНСКИЙ» ПЛОДОПИТОМНИК"," 361510, Кабардино-Балкарская Республика, Баксанский р-н, с. Псычох"," Архестов Хасан Кадырович"," (86634) 7-41-38, 7-41-48",null," выращивание плодово-ягодных культур"," государственная"]
["«БЕЛОКАМЕНСКОЕ» СЕЛЬХОЗПРЕДПРИЯТИЕ (ООО)"," 361720, Кабардино-Балкарская Республика, Зольский р-н, с. Белокаменское, ул. Центральная, 1"," Шабатоков Резван Хасинович"," (86637) 7-57-18",null," выращивание зернобобовых культур; животноводство молочное"," частная"]
["«ВИНОГРАД» НАРОДНОЕ ПРЕДПРИЯТИЕ (ЗАО)"," 361044, Кабардино-Балкарская Республика, г. Прохладный, ул. Горького, 59"," Тхалиджоков Сафарби Лионович"," (86631) 7-74-20, 7-70-50, 7-78-38"," (86631)7-71-50"," виноградарство; животноводство"," частная"]
["«ВЛАДИМИР» ПРЕДПРИЯТИЕ"," 361405, Кабардино-Балкарская Республика, Чегемский р-н, с. Лечинкай"," Дышеков Атмир Исуфович"," (909) 491-21-02",null," животноводство"," частная"]
["«ВОСХОД» ООО"," 361011, Кабардино-Балкарская Республика, Прохладненский р-н, с. Пролетарское"," Кехер Олег Аликберович"," (86631) 6-30-00",null," животноводство; растениеводство"," частная"]
["«ДАЛЬНИЙ» СП. АДМИНИСТРАЦИЯ РАЙОНА"," 361013, Кабардино-Балкарская Республика, Прохладненский р-н, с. Дальнее",null," (86631) 9-43-23",null," животноводство; растениеводство"," государственная"]
["ЗАО ИМЕНИ БАЙСУЛТАНОВА"," 361424, Кабардино-Балкарская Республика, Чегемский р-н, с. Яникой, ул. Мечиева, 84"," Гелястанов Мухтар Ахматович"," (86630) 7-82-48; (928) 700-11-50",null," животноводство молочное"," акционерная"]
["ЗАО ИМЕНИ КАЛАБЕКОВА"," 361416, Кабардино-Балкарская Республика, Чегемский р-н, с. Булунгу, ул. Кулиева, 45"," Кулиев Зафир Магомедович"," (86630) 9-43-44, 7-97-46",null," животноводство"," акционерная"]
["«ЗАРЯ» ООО"," 361013, Кабардино-Балкарская Республика, Прохладненский р-н, с. Дальнее"," Асманов К.М."," (86631) 7-01-53"," (86631) 7-01-53"," животноводство; растениеводство"," частная"]
["«КАМЫШОВАЯ БАЛКА» СЕЛЬХОЗПРЕДПРИЯТИЕ (ООО)"," 361715, Кабардино-Балкарская Республика, Зольский р-н, с. Камлюково, ул. Калмыкова, 54"," Канихов Ахмет Наурбиевич"," (86637) 7-33-30",null," растениеводство"," частная"]
["«КАСАЕВО» СЕЛЬСКОХОЗЯЙСТВЕННЫЙ ПРОИЗВОДСТВЕННЫЙ КООПЕРАТИВ"," 361503, Кабардино-Балкарская Республика, Баксанский р-н, с. Баксаненок, ул. Березгова, 120"," Кимахов Гумарби Ксниублевич"," (86634) 3-61-79; (926) 690-61-65",null," выращивание зернобобовых культур"," частная"]
["КОЛХОЗ ИМЕНИ ПЕТРОВЫХ"," 361015, Кабардино-Балкарская Республика, Прохладненский р-н, стан. Ека-териноградская, ул. Ленина, 39"," Говоров Сергей Анатольевич"," (86631) 7-81-60, 7-85-65",null," зерноводство"," коллективная"]
["«КОНСТАНТИНОВСКОЕ» СЕЛЬХОЗПРЕДПРИЯТИЕ (ООО)"," 361504, Кабардино-Балкарская Республика, Баксанский р-н, с. Кременчуг-Константиновское, ул. Садовая, 5"," Лобко Александр Викторович"," (906) 483-66-06",null," выращивание зернобобовых культур"," частная"]
{"$rows_left_out":2}