{"text_format":"1","workbook":"xlsx","n_sheets":3,"sheets":["3_15","4_15","СТАТИСТИКА"],"not_rendered":{"charts":0,"images":0,"macros":1,"external_links":0,"defined_names":3,"comments":0,"pivot_tables":0},"unopened":[],"bounds":{"document_bytes":16777216,"sheet_cells":100000,"rows_first":2000,"rows_last":500,"rows_between":2000,"halvings":0,"cell_chars":16384,"cell_head_chars":4096},"cells_cut":0,"cells_raw":0,"read":"whole","date_system":"1900"}

{"sheet":"3_15","index":0,"n_rows":50,"n_cols":14,"rows_kept":50,"cut":false,"hidden":false,"merged":[[0,0,0,8],[0,9,0,11]]}
[null,null,null,null,null,null,null,null,null,3]
[{"$f":"IF(C2>0,1, 0)","v":1},{"$f":"IF(AND(A2=0,C2>1),\"ПОМИЛКА\",IF(AND(F2=0,#REF!=\"РОБОТА\"),\"WI-FI\",IF(#REF!=\"РОБОТА\",\"РОБОТА\",\" \")))","v":{"$error":"#REF!"}},"2015-03-01",149,{"$f":"IF(D2=0,\" \",IF(IFERROR((VLOOKUP(D2,#REF!,2,0)),\"ЗАПОЛНИ БАЗУ\")=0,\"ЗАПОЛНИ БАЗУ\",IFERROR((VLOOKUP(D2,#REF!,2,0)),\"ЗАПОЛНИ БАЗУ\")))","v":"ЗАПОЛНИ БАЗУ"},9,{"$f":"IFERROR(IF(#REF!-(VLOOKUP(D2,#REF!,3,0))<90,#REF!-(VLOOKUP(D2,#REF!,3,0)),\"ПОМИЛКА\"),\" \")","v":" "},{"$f":"IFERROR(IF((VLOOKUP(D2,#REF!,4,0))>0,(VLOOKUP(D2,#REF!,4,0)),\"ПОМИЛКА\"),\" \")","v":" "},null,"10:09:00","10:20:00",{"$f":"IF(AND(J2>0,K2=0),#REF!-J2,IF((K2-J2)<0,\"ПОМИЛКА\",K2-J2))","v":"00:11:00"},{"$f":"IF(F2=0,0,IF(N2=0,0,IF(N2<0.041666667,0,IF(L2=0,0,IF(H2=\"р\",0,N2-0.041666667)*72-SUMIFS($M1:M$2,$C1:C$2,C2,$D1:D$2,D2)))))","v":0},{"$f":"SUMIFS($L$2:L2,$C$2:C2,C2,$D$2:D2,D2)","v":"00:11:00"}]
[{"$f":"IF(AND(A2=1, C3>0), SUM(A2+1), 0)","v":2},{"$f":"IF(AND(A3=0,C3>1),\"ПОМИЛКА\",IF(AND(F3=0,#REF!=\"РОБОТА\"),\"WI-FI\",IF(#REF!=\"РОБОТА\",\"РОБОТА\",\" \")))","v":{"$error":"#REF!"}},"2015-03-01",101,{"$f":"IF(D3=0,\" \",IF(IFERROR((VLOOKUP(D3,#REF!,2,0)),\"ЗАПОЛНИ БАЗУ\")=0,\"ЗАПОЛНИ БАЗУ\",IFERROR((VLOOKUP(D3,#REF!,2,0)),\"ЗАПОЛНИ БАЗУ\")))","v":"ЗАПОЛНИ БАЗУ"},1,{"$f":"IFERROR(IF(#REF!-(VLOOKUP(D3,#REF!,3,0))<90,#REF!-(VLOOKUP(D3,#REF!,3,0)),\"ПОМИЛКА\"),\" \")","v":" "},null,null,"10:20:00","11:20:00",{"$f":"IF(AND(J3>0,K3=0),#REF!-J3,IF((K3-J3)<0,\"ПОМИЛКА\",K3-J3))","v":"01:00:00"},{"$f":"IF(F3=0,0,IF(N3=0,0,IF(N3<0.041666667,0,IF(L3=0,0,IF(H3=\"р\",0,N3-0.041666667)*72-SUMIFS($M$2:M2,$C$2:C2,C3,$D$2:D2,D3)))))","v":0},{"$f":"SUMIFS($L$2:L3,$C$2:C3,C3,$D$2:D3,D3)","v":"01:00:00"}]
[{"$f":"IF(AND(A3-A2=1, C4>0), SUM(A3+1), 0)","v":3},{"$f":"IF(AND(A4=0,C4>1),\"ПОМИЛКА\",IF(AND(F4=0,#REF!=\"РОБОТА\"),\"WI-FI\",IF(#REF!=\"РОБОТА\",\"РОБОТА\",\" \")))","v":{"$error":"#REF!"}},"2015-03-01",103,{"$f":"IF(D4=0,\" \",IF(IFERROR((VLOOKUP(D4,#REF!,2,0)),\"ЗАПОЛНИ БАЗУ\")=0,\"ЗАПОЛНИ БАЗУ\",IFERROR((VLOOKUP(D4,#REF!,2,0)),\"ЗАПОЛНИ БАЗУ\")))","v":"ЗАПОЛНИ БАЗУ"},4,{"$f":"IFERROR(IF(#REF!-(VLOOKUP(D4,#REF!,3,0))<90,#REF!-(VLOOKUP(D4,#REF!,3,0)),\"ПОМИЛКА\"),\" \")","v":" "},{"$f":"IFERROR(IF((VLOOKUP(D4,#REF!,4,0))>0,(VLOOKUP(D4,#REF!,4,0)),\"ПОМИЛКА\"),\" \")","v":" "},null,"10:20:00","11:20:00",{"$f":"IF(AND(J4>0,K4=0),#REF!-J4,IF((K4-J4)<0,\"ПОМИЛКА\",K4-J4))","v":"01:00:00"},{"$f":"IF(F4=0,0,IF(N4=0,0,IF(N4<0.041666667,0,IF(L4=0,0,IF(H4=\"р\",0,N4-0.041666667)*72-SUMIFS($M$2:M3,$C$2:C3,C4,$D$2:D3,D4)))))","v":0},{"$f":"SUMIFS($L$2:L4,$C$2:C4,C4,$D$2:D4,D4)","v":"01:00:00"}]
[4,{"$f":"IF(AND(A5=0,C5>1),\"ПОМИЛКА\",IF(AND(F5=0,#REF!=\"РОБОТА\"),\"WI-FI\",IF(#REF!=\"РОБОТА\",\"РОБОТА\",\" \")))","v":{"$error":"#REF!"}},"2015-03-01",24,{"$f":"IF(D5=0,\" \",IF(IFERROR((VLOOKUP(D5,#REF!,2,0)),\"ЗАПОЛНИ БАЗУ\")=0,\"ЗАПОЛНИ БАЗУ\",IFERROR((VLOOKUP(D5,#REF!,2,0)),\"ЗАПОЛНИ БАЗУ\")))","v":"ЗАПОЛНИ БАЗУ"},9,{"$f":"IFERROR(IF(#REF!-(VLOOKUP(D5,#REF!,3,0))<90,#REF!-(VLOOKUP(D5,#REF!,3,0)),\"ПОМИЛКА\"),\" \")","v":" "},{"$f":"IFERROR(IF((VLOOKUP(D5,#REF!,4,0))>0,(VLOOKUP(D5,#REF!,4,0)),\"ПОМИЛКА\"),\" \")","v":" "},null,"10:38:00","11:38:00",{"$f":"IF(AND(J5>0,K5=0),#REF!-J5,IF((K5-J5)<0,\"ПОМИЛКА\",K5-J5))","v":"01:00:00"},{"$f":"IF(F5=0,0,IF(N5=0,0,IF(N5<0.041666667,0,IF(L5=0,0,IF(H5=\"р\",0,N5-0.041666667)*72-SUMIFS($M$2:M4,$C$2:C4,C5,$D$2:D4,D5)))))","v":0},{"$f":"SUMIFS($L$2:L5,$C$2:C5,C5,$D$2:D5,D5)","v":"01:00:00"}]
[5,{"$f":"IF(AND(A6=0,C6>1),\"ПОМИЛКА\",IF(AND(F6=0,#REF!=\"РОБОТА\"),\"WI-FI\",IF(#REF!=\"РОБОТА\",\"РОБОТА\",\" \")))","v":{"$error":"#REF!"}},"2015-03-01",135,{"$f":"IF(D6=0,\" \",IF(IFERROR((VLOOKUP(D6,#REF!,2,0)),\"ЗАПОЛНИ БАЗУ\")=0,\"ЗАПОЛНИ БАЗУ\",IFERROR((VLOOKUP(D6,#REF!,2,0)),\"ЗАПОЛНИ БАЗУ\")))","v":"ЗАПОЛНИ БАЗУ"},8,{"$f":"IFERROR(IF(#REF!-(VLOOKUP(D6,#REF!,3,0))<90,#REF!-(VLOOKUP(D6,#REF!,3,0)),\"ПОМИЛКА\"),\" \")","v":" "},{"$f":"IFERROR(IF((VLOOKUP(D6,#REF!,4,0))>0,(VLOOKUP(D6,#REF!,4,0)),\"ПОМИЛКА\"),\" \")","v":" "},null,"10:50:00","11:50:00",{"$f":"IF(AND(J6>0,K6=0),#REF!-J6,IF((K6-J6)<0,\"ПОМИЛКА\",K6-J6))","v":"01:00:00"},{"$f":"IF(F6=0,0,IF(N6=0,0,IF(N6<0.041666667,0,IF(L6=0,0,IF(H6=\"р\",0,N6-0.041666667)*72-SUMIFS($M$2:M5,$C$2:C5,C6,$D$2:D5,D6)))))","v":0},{"$f":"SUMIFS($L$2:L6,$C$2:C6,C6,$D$2:D6,D6)","v":"01:00:00"}]
[6,{"$f":"IF(AND(A7=0,C7>1),\"ПОМИЛКА\",IF(AND(F7=0,#REF!=\"РОБОТА\"),\"WI-FI\",IF(#REF!=\"РОБОТА\",\"РОБОТА\",\" \")))","v":{"$error":"#REF!"}},"2015-03-01",85,{"$f":"IF(D7=0,\" \",IF(IFERROR((VLOOKUP(D7,#REF!,2,0)),\"ЗАПОЛНИ БАЗУ\")=0,\"ЗАПОЛНИ БАЗУ\",IFERROR((VLOOKUP(D7,#REF!,2,0)),\"ЗАПОЛНИ БАЗУ\")))","v":"ЗАПОЛНИ БАЗУ"},2,{"$f":"IFERROR(IF(#REF!-(VLOOKUP(D7,#REF!,3,0))<90,#REF!-(VLOOKUP(D7,#REF!,3,0)),\"ПОМИЛКА\"),\" \")","v":" "},{"$f":"IFERROR(IF((VLOOKUP(D7,#REF!,4,0))>0,(VLOOKUP(D7,#REF!,4,0)),\"ПОМИЛКА\"),\" \")","v":" "},null,"10:55:00","11:55:00",{"$f":"IF(AND(J7>0,K7=0),#REF!-J7,IF((K7-J7)<0,\"ПОМИЛКА\",K7-J7))","v":"01:00:00"},{"$f":"IF(F7=0,0,IF(N7=0,0,IF(N7<0.041666667,0,IF(L7=0,0,IF(H7=\"р\",0,N7-0.041666667)*72-SUMIFS($M$2:M6,$C$2:C6,C7,$D$2:D6,D7)))))","v":0},{"$f":"SUMIFS($L$2:L7,$C$2:C7,C7,$D$2:D7,D7)","v":"01:00:00"}]
[7,{"$f":"IF(AND(A8=0,C8>1),\"ПОМИЛКА\",IF(AND(F8=0,#REF!=\"РОБОТА\"),\"WI-FI\",IF(#REF!=\"РОБОТА\",\"РОБОТА\",\" \")))","v":{"$error":"#REF!"}},"2015-03-01",81,{"$f":"IF(D8=0,\" \",IF(IFERROR((VLOOKUP(D8,#REF!,2,0)),\"ЗАПОЛНИ БАЗУ\")=0,\"ЗАПОЛНИ БАЗУ\",IFERROR((VLOOKUP(D8,#REF!,2,0)),\"ЗАПОЛНИ БАЗУ\")))","v":"ЗАПОЛНИ БАЗУ"},6,{"$f":"IFERROR(IF(#REF!-(VLOOKUP(D8,#REF!,3,0))<90,#REF!-(VLOOKUP(D8,#REF!,3,0)),\"ПОМИЛКА\"),\" \")","v":" "},{"$f":"IFERROR(IF((VLOOKUP(D8,#REF!,4,0))>0,(VLOOKUP(D8,#REF!,4,0)),\"ПОМИЛКА\"),\" \")","v":" "},null,"11:01:00","12:01:00",{"$f":"IF(AND(J8>0,K8=0),#REF!-J8,IF((K8-J8)<0,\"ПОМИЛКА\",K8-J8))","v":"01:00:00"},{"$f":"IF(F8=0,0,IF(N8=0,0,IF(N8<0.041666667,0,IF(L8=0,0,IF(H8=\"р\",0,N8-0.041666667)*72-SUMIFS($M$2:M7,$C$2:C7,C8,$D$2:D7,D8)))))","v":0},{"$f":"SUMIFS($L$2:L8,$C$2:C8,C8,$D$2:D8,D8)","v":"01:00:00"}]
{"$rows_left_out":43}
{"sheet":"4_15","index":1,"n_rows":68,"n_cols":14,"rows_kept":68,"cut":false,"hidden":false,"merged":[[0,0,0,8],[0,9,0,11]]}
[]
[{"$f":"IF(C2>0,1, 0)","v":1},{"$f":"IF(AND(A2=0,C2>1),\"ПОМИЛКА\",IF(AND(F2=0,#REF!=\"РОБОТА\"),\"WI-FI\",IF(#REF!=\"РОБОТА\",\"РОБОТА\",\" \")))","v":{"$error":"#REF!"}},"2015-04-01",18,{"$f":"IF(D2=0,\" \",IF(IFERROR((VLOOKUP(D2,#REF!,2,0)),\"ЗАПОЛНИ БАЗУ\")=0,\"ЗАПОЛНИ БАЗУ\",IFERROR((VLOOKUP(D2,#REF!,2,0)),\"ЗАПОЛНИ БАЗУ\")))","v":"ЗАПОЛНИ БАЗУ"},9,{"$f":"IFERROR(IF(#REF!-(VLOOKUP(D2,#REF!,3,0))<90,#REF!-(VLOOKUP(D2,#REF!,3,0)),\"ПОМИЛКА\"),\" \")","v":" "},{"$f":"IFERROR(IF((VLOOKUP(D2,#REF!,4,0))>0,(VLOOKUP(D2,#REF!,4,0)),\"ПОМИЛКА\"),\" \")","v":" "},null,"09:34:00","10:34:00",{"$f":"IF(AND(J2>0,K2=0),#REF!-J2,IF((K2-J2)<0,\"ПОМИЛКА\",K2-J2))","v":"01:00:00"},{"$f":"IF(F2=0,0,IF(N2=0,0,IF(N2<0.041666667,0,IF(L2=0,0,IF(H2=\"р\",0,N2-0.041666667)*72-SUMIFS($M1:M$2,$C1:C$2,C2,$D1:D$2,D2)))))","v":0},{"$f":"SUMIFS($L$2:L2,$C$2:C2,C2,$D$2:D2,D2)","v":"01:00:00"}]
[{"$f":"IF(AND(A2=1, C3>0), SUM(A2+1), 0)","v":2},{"$f":"IF(AND(A3=0,C3>1),\"ПОМИЛКА\",IF(AND(F3=0,#REF!=\"РОБОТА\"),\"WI-FI\",IF(#REF!=\"РОБОТА\",\"РОБОТА\",\" \")))","v":{"$error":"#REF!"}},"2015-04-01",214,{"$f":"IF(D3=0,\" \",IF(IFERROR((VLOOKUP(D3,#REF!,2,0)),\"ЗАПОЛНИ БАЗУ\")=0,\"ЗАПОЛНИ БАЗУ\",IFERROR((VLOOKUP(D3,#REF!,2,0)),\"ЗАПОЛНИ БАЗУ\")))","v":"ЗАПОЛНИ БАЗУ"},8,{"$f":"IFERROR(IF(#REF!-(VLOOKUP(D3,#REF!,3,0))<90,#REF!-(VLOOKUP(D3,#REF!,3,0)),\"ПОМИЛКА\"),\" \")","v":" "},null,null,"09:46:00","10:46:00",{"$f":"IF(AND(J3>0,K3=0),#REF!-J3,IF((K3-J3)<0,\"ПОМИЛКА\",K3-J3))","v":"01:00:00"},{"$f":"IF(F3=0,0,IF(N3=0,0,IF(N3<0.041666667,0,IF(L3=0,0,IF(H3=\"р\",0,N3-0.041666667)*72-SUMIFS($M$2:M2,$C$2:C2,C3,$D$2:D2,D3)))))","v":0},{"$f":"SUMIFS($L$2:L3,$C$2:C3,C3,$D$2:D3,D3)","v":"01:00:00"}]
[{"$f":"IF(AND(A3-A2=1, C4>0), SUM(A3+1), 0)","v":3},{"$f":"IF(AND(A4=0,C4>1),\"ПОМИЛКА\",IF(AND(F4=0,#REF!=\"РОБОТА\"),\"WI-FI\",IF(#REF!=\"РОБОТА\",\"РОБОТА\",\" \")))","v":{"$error":"#REF!"}},"2015-04-01",369,{"$f":"IF(D4=0,\" \",IF(IFERROR((VLOOKUP(D4,#REF!,2,0)),\"ЗАПОЛНИ БАЗУ\")=0,\"ЗАПОЛНИ БАЗУ\",IFERROR((VLOOKUP(D4,#REF!,2,0)),\"ЗАПОЛНИ БАЗУ\")))","v":"ЗАПОЛНИ БАЗУ"},3,{"$f":"IFERROR(IF(#REF!-(VLOOKUP(D4,#REF!,3,0))<90,#REF!-(VLOOKUP(D4,#REF!,3,0)),\"ПОМИЛКА\"),\" \")","v":" "},{"$f":"IFERROR(IF((VLOOKUP(D4,#REF!,4,0))>0,(VLOOKUP(D4,#REF!,4,0)),\"ПОМИЛКА\"),\" \")","v":" "},"П","09:49:00","10:49:00",{"$f":"IF(AND(J4>0,K4=0),#REF!-J4,IF((K4-J4)<0,\"ПОМИЛКА\",K4-J4))","v":"01:00:00"},{"$f":"IF(F4=0,0,IF(N4=0,0,IF(N4<0.041666667,0,IF(L4=0,0,IF(H4=\"р\",0,N4-0.041666667)*72-SUMIFS($M$2:M3,$C$2:C3,C4,$D$2:D3,D4)))))","v":0},{"$f":"SUMIFS($L$2:L4,$C$2:C4,C4,$D$2:D4,D4)","v":"01:00:00"}]
[4,{"$f":"IF(AND(A5=0,C5>1),\"ПОМИЛКА\",IF(AND(F5=0,#REF!=\"РОБОТА\"),\"WI-FI\",IF(#REF!=\"РОБОТА\",\"РОБОТА\",\" \")))","v":{"$error":"#REF!"}},"2015-04-01",370,{"$f":"IF(D5=0,\" \",IF(IFERROR((VLOOKUP(D5,#REF!,2,0)),\"ЗАПОЛНИ БАЗУ\")=0,\"ЗАПОЛНИ БАЗУ\",IFERROR((VLOOKUP(D5,#REF!,2,0)),\"ЗАПОЛНИ БАЗУ\")))","v":"ЗАПОЛНИ БАЗУ"},4,{"$f":"IFERROR(IF(#REF!-(VLOOKUP(D5,#REF!,3,0))<90,#REF!-(VLOOKUP(D5,#REF!,3,0)),\"ПОМИЛКА\"),\" \")","v":" "},{"$f":"IFERROR(IF((VLOOKUP(D5,#REF!,4,0))>0,(VLOOKUP(D5,#REF!,4,0)),\"ПОМИЛКА\"),\" \")","v":" "},"Н","09:52:00","10:52:00",{"$f":"IF(AND(J5>0,K5=0),#REF!-J5,IF((K5-J5)<0,\"ПОМИЛКА\",K5-J5))","v":"01:00:00"},{"$f":"IF(F5=0,0,IF(N5=0,0,IF(N5<0.041666667,0,IF(L5=0,0,IF(H5=\"р\",0,N5-0.041666667)*72-SUMIFS($M$2:M4,$C$2:C4,C5,$D$2:D4,D5)))))","v":0},{"$f":"SUMIFS($L$2:L5,$C$2:C5,C5,$D$2:D5,D5)","v":"01:00:00"}]
[5,{"$f":"IF(AND(A6=0,C6>1),\"ПОМИЛКА\",IF(AND(F6=0,#REF!=\"РОБОТА\"),\"WI-FI\",IF(#REF!=\"РОБОТА\",\"РОБОТА\",\" \")))","v":{"$error":"#REF!"}},"2015-04-01",349,{"$f":"IF(D6=0,\" \",IF(IFERROR((VLOOKUP(D6,#REF!,2,0)),\"ЗАПОЛНИ БАЗУ\")=0,\"ЗАПОЛНИ БАЗУ\",IFERROR((VLOOKUP(D6,#REF!,2,0)),\"ЗАПОЛНИ БАЗУ\")))","v":"ЗАПОЛНИ БАЗУ"},10,{"$f":"IFERROR(IF(#REF!-(VLOOKUP(D6,#REF!,3,0))<90,#REF!-(VLOOKUP(D6,#REF!,3,0)),\"ПОМИЛКА\"),\" \")","v":" "},{"$f":"IFERROR(IF((VLOOKUP(D6,#REF!,4,0))>0,(VLOOKUP(D6,#REF!,4,0)),\"ПОМИЛКА\"),\" \")","v":" "},null,"10:45:00","11:45:00",{"$f":"IF(AND(J6>0,K6=0),#REF!-J6,IF((K6-J6)<0,\"ПОМИЛКА\",K6-J6))","v":"01:00:00"},{"$f":"IF(F6=0,0,IF(N6=0,0,IF(N6<0.041666667,0,IF(L6=0,0,IF(H6=\"р\",0,N6-0.041666667)*72-SUMIFS($M$2:M5,$C$2:C5,C6,$D$2:D5,D6)))))","v":0},{"$f":"SUMIFS($L$2:L6,$C$2:C6,C6,$D$2:D6,D6)","v":"01:00:00"}]
[6,{"$f":"IF(AND(A7=0,C7>1),\"ПОМИЛКА\",IF(AND(F7=0,#REF!=\"РОБОТА\"),\"WI-FI\",IF(#REF!=\"РОБОТА\",\"РОБОТА\",\" \")))","v":{"$error":"#REF!"}},"2015-04-01",28,{"$f":"IF(D7=0,\" \",IF(IFERROR((VLOOKUP(D7,#REF!,2,0)),\"ЗАПОЛНИ БАЗУ\")=0,\"ЗАПОЛНИ БАЗУ\",IFERROR((VLOOKUP(D7,#REF!,2,0)),\"ЗАПОЛНИ БАЗУ\")))","v":"ЗАПОЛНИ БАЗУ"},7,{"$f":"IFERROR(IF(#REF!-(VLOOKUP(D7,#REF!,3,0))<90,#REF!-(VLOOKUP(D7,#REF!,3,0)),\"ПОМИЛКА\"),\" \")","v":" "},{"$f":"IFERROR(IF((VLOOKUP(D7,#REF!,4,0))>0,(VLOOKUP(D7,#REF!,4,0)),\"ПОМИЛКА\"),\" \")","v":" "},null,"11:00:00","11:44:00",{"$f":"IF(AND(J7>0,K7=0),#REF!-J7,IF((K7-J7)<0,\"ПОМИЛКА\",K7-J7))","v":"00:44:00"},{"$f":"IF(F7=0,0,IF(N7=0,0,IF(N7<0.041666667,0,IF(L7=0,0,IF(H7=\"р\",0,N7-0.041666667)*72-SUMIFS($M$2:M6,$C$2:C6,C7,$D$2:D6,D7)))))","v":0},{"$f":"SUMIFS($L$2:L7,$C$2:C7,C7,$D$2:D7,D7)","v":"00:44:00"}]
[7,{"$f":"IF(AND(A8=0,C8>1),\"ПОМИЛКА\",IF(AND(F8=0,#REF!=\"РОБОТА\"),\"WI-FI\",IF(#REF!=\"РОБОТА\",\"РОБОТА\",\" \")))","v":{"$error":"#REF!"}},"2015-04-01",371,{"$f":"IF(D8=0,\" \",IF(IFERROR((VLOOKUP(D8,#REF!,2,0)),\"ЗАПОЛНИ БАЗУ\")=0,\"ЗАПОЛНИ БАЗУ\",IFERROR((VLOOKUP(D8,#REF!,2,0)),\"ЗАПОЛНИ БАЗУ\")))","v":"ЗАПОЛНИ БАЗУ"},9,{"$f":"IFERROR(IF(#REF!-(VLOOKUP(D8,#REF!,3,0))<90,#REF!-(VLOOKUP(D8,#REF!,3,0)),\"ПОМИЛКА\"),\" \")","v":" "},{"$f":"IFERROR(IF((VLOOKUP(D8,#REF!,4,0))>0,(VLOOKUP(D8,#REF!,4,0)),\"ПОМИЛКА\"),\" \")","v":" "},"Н","11:34:00","12:26:00",{"$f":"IF(AND(J8>0,K8=0),#REF!-J8,IF((K8-J8)<0,\"ПОМИЛКА\",K8-J8))","v":"00:52:00"},{"$f":"IF(F8=0,0,IF(N8=0,0,IF(N8<0.041666667,0,IF(L8=0,0,IF(H8=\"р\",0,N8-0.041666667)*72-SUMIFS($M$2:M7,$C$2:C7,C8,$D$2:D7,D8)))))","v":0},{"$f":"SUMIFS($L$2:L8,$C$2:C8,C8,$D$2:D8,D8)","v":"00:52:00"}]
{"$rows_left_out":61}
{"sheet":"СТАТИСТИКА","index":2,"n_rows":9,"n_cols":33,"rows_kept":9,"cut":false,"hidden":false,"merged":[[6,0,6,1],[7,0,7,1],[8,0,8,1],[1,2,1,32],[3,0,3,1],[4,0,4,1],[5,0,5,1]]}
[null,null,null,null,null,null,null,null,null,"ДВССЫЛ(\"'\"B23\"'!$C$19:$C$3001\")"]
["РІК",2015,"СТАТИСТИЧНІ ДАНІ"]
["МІСЯЦЬ",3]
["День неділі",null,{"$f":"WEEKDAY(C5,1)","v":"1900-01-01"},{"$f":"WEEKDAY(D5,1)","v":"1900-01-02"},{"$f":"WEEKDAY(E5,1)","v":"1900-01-03"},{"$f":"WEEKDAY(F5,1)","v":"1900-01-04"},{"$f":"WEEKDAY(G5,1)","v":"1900-01-05"},{"$f":"WEEKDAY(H5,1)","v":"1900-01-06"},{"$f":"WEEKDAY(I5,1)","v":"1900-01-07"},{"$f":"WEEKDAY(J5,1)","v":"1900-01-01"},{"$f":"WEEKDAY(K5,1)","v":"1900-01-02"},{"$f":"WEEKDAY(L5,1)","v":"1900-01-03"},{"$f":"WEEKDAY(M5,1)","v":"1900-01-04"},{"$f":"WEEKDAY(N5,1)","v":"1900-01-05"},{"$f":"WEEKDAY(O5,1)","v":"1900-01-06"},{"$f":"WEEKDAY(P5,1)","v":"1900-01-07"},{"$f":"WEEKDAY(Q5,1)","v":"1900-01-01"},{"$f":"WEEKDAY(R5,1)","v":"1900-01-02"},{"$f":"WEEKDAY(S5,1)","v":"1900-01-03"},{"$f":"WEEKDAY(T5,1)","v":"1900-01-04"},{"$f":"WEEKDAY(U5,1)","v":"1900-01-05"},{"$f":"WEEKDAY(V5,1)","v":"1900-01-06"},{"$f":"WEEKDAY(W5,1)","v":"1900-01-07"},{"$f":"WEEKDAY(X5,1)","v":"1900-01-01"},{"$f":"WEEKDAY(Y5,1)","v":"1900-01-02"},{"$f":"WEEKDAY(Z5,1)","v":"1900-01-03"},{"$f":"WEEKDAY(AA5,1)","v":"1900-01-04"},{"$f":"WEEKDAY(AB5,1)","v":"1900-01-05"},{"$f":"WEEKDAY(AC5,1)","v":"1900-01-06"},{"$f":"WEEKDAY(AD5,1)","v":"1900-01-07"},{"$f":"WEEKDAY(AE5,1)","v":"1900-01-01"},{"$f":"WEEKDAY(AF5,1)","v":"1900-01-02"},{"$f":"WEEKDAY(AG5,1)","v":"1900-01-03"}]
["число місяця",null,{"$f":"(\"1.\"&B3&\".\"&B2)*1","v":"2015-03-01"},{"$f":"C5+1","v":"2015-03-02"},{"$f":"D5+1","v":"2015-03-03"},"2015-03-04","2015-03-05","2015-03-06","2015-03-07","2015-03-08","2015-03-09","2015-03-10","2015-03-11","2015-03-12","2015-03-13","2015-03-14","2015-03-15","2015-03-16","2015-03-17","2015-03-18","2015-03-19","2015-03-20","2015-03-21","2015-03-22","2015-03-23","2015-03-24","2015-03-25","2015-03-26","2015-03-27","2015-03-28","2015-03-29","2015-03-30","2015-03-31"]
["циклов",null,{"$f":"COUNTIF(INDIRECT(\"'\"&$B$3&\"_\"&RIGHTB($B$2,2)&\"'!C3:C68\"),C5)","v":48},{"$f":"COUNTIF('4_15'!$C$3:$C$68,D5)","v":0},{"$f":"COUNTIF('4_15'!$C$3:$C$68,E5)","v":0},{"$f":"COUNTIF('4_15'!$C$3:$C$68,F5)","v":0},{"$f":"COUNTIF('4_15'!$C$3:$C$68,G5)","v":0},{"$f":"COUNTIF('4_15'!$C$3:$C$68,H5)","v":0},{"$f":"COUNTIF('4_15'!$C$3:$C$68,I5)","v":0},{"$f":"COUNTIF('4_15'!$C$3:$C$68,J5)","v":0},{"$f":"COUNTIF('4_15'!$C$3:$C$68,K5)","v":0},{"$f":"COUNTIF('4_15'!$C$3:$C$68,L5)","v":0},{"$f":"COUNTIF('4_15'!$C$3:$C$68,M5)","v":0},{"$f":"COUNTIF('4_15'!$C$3:$C$68,N5)","v":0},{"$f":"COUNTIF('4_15'!$C$3:$C$68,O5)","v":0},{"$f":"COUNTIF('4_15'!$C$3:$C$68,P5)","v":0},{"$f":"COUNTIF('4_15'!$C$3:$C$68,Q5)","v":0},{"$f":"COUNTIF('4_15'!$C$3:$C$68,R5)","v":0},{"$f":"COUNTIF('4_15'!$C$3:$C$68,S5)","v":0},{"$f":"COUNTIF('4_15'!$C$3:$C$68,T5)","v":0},{"$f":"COUNTIF('4_15'!$C$3:$C$68,U5)","v":0},{"$f":"COUNTIF('4_15'!$C$3:$C$68,V5)","v":0},{"$f":"COUNTIF('4_15'!$C$3:$C$68,W5)","v":0},{"$f":"COUNTIF('4_15'!$C$3:$C$68,X5)","v":0},{"$f":"COUNTIF('4_15'!$C$3:$C$68,Y5)","v":0},{"$f":"COUNTIF('4_15'!$C$3:$C$68,Z5)","v":0},{"$f":"COUNTIF('4_15'!$C$3:$C$68,AA5)","v":0},{"$f":"COUNTIF('4_15'!$C$3:$C$68,AB5)","v":0},{"$f":"COUNTIF('4_15'!$C$3:$C$68,AC5)","v":0},{"$f":"COUNTIF('4_15'!$C$3:$C$68,AD5)","v":0},{"$f":"COUNTIF('4_15'!$C$3:$C$68,AE5)","v":0},{"$f":"COUNTIF('4_15'!$C$3:$C$68,AF5)","v":0},{"$f":"COUNTIF('4_15'!$C$3:$C$68,AG5)","v":0}]
["работников",null,{"$f":"SUM(IF(FREQUENCY('4_15'!$D$3:$D$68*('4_15'!$C$3:$C$68=C5),'4_15'!$D$3:$D$68*('4_15'!$C$3:$C$68=C5))>0,1))-1","v":0},{"$f":"SUM(IF(FREQUENCY('4_15'!$D$3:$D$68*('4_15'!$C$3:$C$68=D5),'4_15'!$D$3:$D$68*('4_15'!$C$3:$C$68=D5))>0,1))-1","v":0},{"$f":"SUM(IF(FREQUENCY('4_15'!$D$3:$D$68*('4_15'!$C$3:$C$68=E5),'4_15'!$D$3:$D$68*('4_15'!$C$3:$C$68=E5))>0,1))-1","v":0},{"$f":"SUM(IF(FREQUENCY('4_15'!$D$3:$D$68*('4_15'!$C$3:$C$68=F5),'4_15'!$D$3:$D$68*('4_15'!$C$3:$C$68=F5))>0,1))-1","v":0},{"$f":"SUM(IF(FREQUENCY('4_15'!$D$3:$D$68*('4_15'!$C$3:$C$68=G5),'4_15'!$D$3:$D$68*('4_15'!$C$3:$C$68=G5))>0,1))-1","v":0},{"$f":"SUM(IF(FREQUENCY('4_15'!$D$3:$D$68*('4_15'!$C$3:$C$68=H5),'4_15'!$D$3:$D$68*('4_15'!$C$3:$C$68=H5))>0,1))-1","v":0},{"$f":"SUM(IF(FREQUENCY('4_15'!$D$3:$D$68*('4_15'!$C$3:$C$68=I5),'4_15'!$D$3:$D$68*('4_15'!$C$3:$C$68=I5))>0,1))-1","v":0},{"$f":"SUM(IF(FREQUENCY('4_15'!$D$3:$D$68*('4_15'!$C$3:$C$68=J5),'4_15'!$D$3:$D$68*('4_15'!$C$3:$C$68=J5))>0,1))-1","v":0},{"$f":"SUM(IF(FREQUENCY('4_15'!$D$3:$D$68*('4_15'!$C$3:$C$68=K5),'4_15'!$D$3:$D$68*('4_15'!$C$3:$C$68=K5))>0,1))-1","v":0},{"$f":"SUM(IF(FREQUENCY('4_15'!$D$3:$D$68*('4_15'!$C$3:$C$68=L5),'4_15'!$D$3:$D$68*('4_15'!$C$3:$C$68=L5))>0,1))-1","v":0},{"$f":"SUM(IF(FREQUENCY('4_15'!$D$3:$D$68*('4_15'!$C$3:$C$68=M5),'4_15'!$D$3:$D$68*('4_15'!$C$3:$C$68=M5))>0,1))-1","v":0},{"$f":"SUM(IF(FREQUENCY('4_15'!$D$3:$D$68*('4_15'!$C$3:$C$68=N5),'4_15'!$D$3:$D$68*('4_15'!$C$3:$C$68=N5))>0,1))-1","v":0},{"$f":"SUM(IF(FREQUENCY('4_15'!$D$3:$D$68*('4_15'!$C$3:$C$68=O5),'4_15'!$D$3:$D$68*('4_15'!$C$3:$C$68=O5))>0,1))-1","v":0},{"$f":"SUM(IF(FREQUENCY('4_15'!$D$3:$D$68*('4_15'!$C$3:$C$68=P5),'4_15'!$D$3:$D$68*('4_15'!$C$3:$C$68=P5))>0,1))-1","v":0},{"$f":"SUM(IF(FREQUENCY('4_15'!$D$3:$D$68*('4_15'!$C$3:$C$68=Q5),'4_15'!$D$3:$D$68*('4_15'!$C$3:$C$68=Q5))>0,1))-1","v":0},{"$f":"SUM(IF(FREQUENCY('4_15'!$D$3:$D$68*('4_15'!$C$3:$C$68=R5),'4_15'!$D$3:$D$68*('4_15'!$C$3:$C$68=R5))>0,1))-1","v":0},{"$f":"SUM(IF(FREQUENCY('4_15'!$D$3:$D$68*('4_15'!$C$3:$C$68=S5),'4_15'!$D$3:$D$68*('4_15'!$C$3:$C$68=S5))>0,1))-1","v":0},{"$f":"SUM(IF(FREQUENCY('4_15'!$D$3:$D$68*('4_15'!$C$3:$C$68=T5),'4_15'!$D$3:$D$68*('4_15'!$C$3:$C$68=T5))>0,1))-1","v":0},{"$f":"SUM(IF(FREQUENCY('4_15'!$D$3:$D$68*('4_15'!$C$3:$C$68=U5),'4_15'!$D$3:$D$68*('4_15'!$C$3:$C$68=U5))>0,1))-1","v":0},{"$f":"SUM(IF(FREQUENCY('4_15'!$D$3:$D$68*('4_15'!$C$3:$C$68=V5),'4_15'!$D$3:$D$68*('4_15'!$C$3:$C$68=V5))>0,1))-1","v":0},{"$f":"SUM(IF(FREQUENCY('4_15'!$D$3:$D$68*('4_15'!$C$3:$C$68=W5),'4_15'!$D$3:$D$68*('4_15'!$C$3:$C$68=W5))>0,1))-1","v":0},{"$f":"SUM(IF(FREQUENCY('4_15'!$D$3:$D$68*('4_15'!$C$3:$C$68=X5),'4_15'!$D$3:$D$68*('4_15'!$C$3:$C$68=X5))>0,1))-1","v":0},{"$f":"SUM(IF(FREQUENCY('4_15'!$D$3:$D$68*('4_15'!$C$3:$C$68=Y5),'4_15'!$D$3:$D$68*('4_15'!$C$3:$C$68=Y5))>0,1))-1","v":0},{"$f":"SUM(IF(FREQUENCY('4_15'!$D$3:$D$68*('4_15'!$C$3:$C$68=Z5),'4_15'!$D$3:$D$68*('4_15'!$C$3:$C$68=Z5))>0,1))-1","v":0},{"$f":"SUM(IF(FREQUENCY('4_15'!$D$3:$D$68*('4_15'!$C$3:$C$68=AA5),'4_15'!$D$3:$D$68*('4_15'!$C$3:$C$68=AA5))>0,1))-1","v":0},{"$f":"SUM(IF(FREQUENCY('4_15'!$D$3:$D$68*('4_15'!$C$3:$C$68=AB5),'4_15'!$D$3:$D$68*('4_15'!$C$3:$C$68=AB5))>0,1))-1","v":0},{"$f":"SUM(IF(FREQUENCY('4_15'!$D$3:$D$68*('4_15'!$C$3:$C$68=AC5),'4_15'!$D$3:$D$68*('4_15'!$C$3:$C$68=AC5))>0,1))-1","v":0},{"$f":"SUM(IF(FREQUENCY('4_15'!$D$3:$D$68*('4_15'!$C$3:$C$68=AD5),'4_15'!$D$3:$D$68*('4_15'!$C$3:$C$68=AD5))>0,1))-1","v":0},{"$f":"SUM(IF(FREQUENCY('4_15'!$D$3:$D$68*('4_15'!$C$3:$C$68=AE5),'4_15'!$D$3:$D$68*('4_15'!$C$3:$C$68=AE5))>0,1))-1","v":0},{"$f":"SUM(IF(FREQUENCY('4_15'!$D$3:$D$68*('4_15'!$C$3:$C$68=AF5),'4_15'!$D$3:$D$68*('4_15'!$C$3:$C$68=AF5))>0,1))-1","v":0},{"$f":"SUM(IF(FREQUENCY('4_15'!$D$3:$D$68*('4_15'!$C$3:$C$68=AG5),'4_15'!$D$3:$D$68*('4_15'!$C$3:$C$68=AG5))>0,1))-1","v":0}]
[" документів",null,{"$f":"COUNTIFS('4_15'!$I$2:$I$68,\"*\",'4_15'!$C$2:$C$68,C5)","v":0},{"$f":"COUNTIFS('4_15'!$I$2:$I$68,\"*\",'4_15'!$C$2:$C$68,D5)","v":0},{"$f":"COUNTIFS('4_15'!$I$2:$I$68,\"*\",'4_15'!$C$2:$C$68,E5)","v":0},{"$f":"COUNTIFS('4_15'!$I$2:$I$68,\"*\",'4_15'!$C$2:$C$68,F5)","v":0},{"$f":"COUNTIFS('4_15'!$I$2:$I$68,\"*\",'4_15'!$C$2:$C$68,G5)","v":0},{"$f":"COUNTIFS('4_15'!$I$2:$I$68,\"*\",'4_15'!$C$2:$C$68,H5)","v":0},{"$f":"COUNTIFS('4_15'!$I$2:$I$68,\"*\",'4_15'!$C$2:$C$68,I5)","v":0},{"$f":"COUNTIFS('4_15'!$I$2:$I$68,\"*\",'4_15'!$C$2:$C$68,J5)","v":0},{"$f":"COUNTIFS('4_15'!$I$2:$I$68,\"*\",'4_15'!$C$2:$C$68,K5)","v":0},{"$f":"COUNTIFS('4_15'!$I$2:$I$68,\"*\",'4_15'!$C$2:$C$68,L5)","v":0},{"$f":"COUNTIFS('4_15'!$I$2:$I$68,\"*\",'4_15'!$C$2:$C$68,M5)","v":0},{"$f":"COUNTIFS('4_15'!$I$2:$I$68,\"*\",'4_15'!$C$2:$C$68,N5)","v":0},{"$f":"COUNTIFS('4_15'!$I$2:$I$68,\"*\",'4_15'!$C$2:$C$68,O5)","v":0},{"$f":"COUNTIFS('4_15'!$I$2:$I$68,\"*\",'4_15'!$C$2:$C$68,P5)","v":0},{"$f":"COUNTIFS('4_15'!$I$2:$I$68,\"*\",'4_15'!$C$2:$C$68,Q5)","v":0},{"$f":"COUNTIFS('4_15'!$I$2:$I$68,\"*\",'4_15'!$C$2:$C$68,R5)","v":0},{"$f":"COUNTIFS('4_15'!$I$2:$I$68,\"*\",'4_15'!$C$2:$C$68,S5)","v":0},{"$f":"COUNTIFS('4_15'!$I$2:$I$68,\"*\",'4_15'!$C$2:$C$68,T5)","v":0},{"$f":"COUNTIFS('4_15'!$I$2:$I$68,\"*\",'4_15'!$C$2:$C$68,U5)","v":0},{"$f":"COUNTIFS('4_15'!$I$2:$I$68,\"*\",'4_15'!$C$2:$C$68,V5)","v":0},{"$f":"COUNTIFS('4_15'!$I$2:$I$68,\"*\",'4_15'!$C$2:$C$68,W5)","v":0},{"$f":"COUNTIFS('4_15'!$I$2:$I$68,\"*\",'4_15'!$C$2:$C$68,X5)","v":0},{"$f":"COUNTIFS('4_15'!$I$2:$I$68,\"*\",'4_15'!$C$2:$C$68,Y5)","v":0},{"$f":"COUNTIFS('4_15'!$I$2:$I$68,\"*\",'4_15'!$C$2:$C$68,Z5)","v":0},{"$f":"COUNTIFS('4_15'!$I$2:$I$68,\"*\",'4_15'!$C$2:$C$68,AA5)","v":0},{"$f":"COUNTIFS('4_15'!$I$2:$I$68,\"*\",'4_15'!$C$2:$C$68,AB5)","v":0},{"$f":"COUNTIFS('4_15'!$I$2:$I$68,\"*\",'4_15'!$C$2:$C$68,AC5)","v":0},{"$f":"COUNTIFS('4_15'!$I$2:$I$68,\"*\",'4_15'!$C$2:$C$68,AD5)","v":0},{"$f":"COUNTIFS('4_15'!$I$2:$I$68,\"*\",'4_15'!$C$2:$C$68,AE5)","v":0},{"$f":"COUNTIFS('4_15'!$I$2:$I$68,\"*\",'4_15'!$C$2:$C$68,AF5)","v":0},{"$f":"COUNTIFS('4_15'!$I$2:$I$68,\"*\",'4_15'!$C$2:$C$68,AG5)","v":0}]
{"$rows_left_out":1}