{"text_format":"1","workbook":"xlsx","n_sheets":4,"sheets":["J-League","Шахматка","0","00"],"not_rendered":{"charts":0,"images":0,"macros":1,"external_links":0,"defined_names":1,"comments":0,"pivot_tables":0},"unopened":[],"bounds":{"document_bytes":16777216,"sheet_cells":100000,"rows_first":2000,"rows_last":500,"rows_between":2000,"halvings":0,"cell_chars":16384,"cell_head_chars":4096},"cells_cut":0,"cells_raw":0,"read":"whole","date_system":"1900"}

{"sheet":"J-League","index":0,"n_rows":18,"n_cols":6,"rows_kept":18,"cut":false,"hidden":false,"merged":[[0,1,0,4]]}
["AlbirexNiigata","J-League",null,null,null,2]
["C.Osaka",{"$f":"IF(ISNUMBER('0'!A2),\"\",'0'!A2)","v":"AlbirexNiigata"},{"$f":"IF(ISNUMBER('0'!$B$2),\"\",'0'!$B$2)","v":"2"},{"$f":"IF(ISNUMBER('0'!$C$2),\"\",'0'!$C$2)","v":"1"},{"$f":"IF(ISNUMBER('0'!D2),\"\",'0'!D2)","v":"Oita"}]
["Chiba",{"$f":"IF(ISNUMBER('0'!A3),\"\",'0'!A3)","v":"Iwata"},{"$f":"IF(ISNUMBER('0'!$B$3),\"\",'0'!$B$3)","v":"0"},{"$f":"IF(ISNUMBER('0'!$C$3),\"\",'0'!$C$3)","v":"3"},{"$f":"IF(ISNUMBER('0'!D3),\"\",'0'!D3)","v":"Nagoya"}]
["FCTokyo",{"$f":"IF(ISNUMBER('0'!A4),\"\",'0'!A4)","v":"Chiba"},{"$f":"IF(ISNUMBER('0'!$B$4),\"\",'0'!$B$4)","v":"2"},{"$f":"IF(ISNUMBER('0'!$C$4),\"\",'0'!$C$4)","v":"2"},{"$f":"IF(ISNUMBER('0'!D4),\"\",'0'!D4)","v":"Kashiwa"}]
["G.Osaka",{"$f":"IF(ISNUMBER('0'!A5),\"\",'0'!A5)","v":"C.Osaka"},{"$f":"IF(ISNUMBER('0'!$B$5),\"\",'0'!$B$5)","v":"2"},{"$f":"IF(ISNUMBER('0'!$C$5),\"\",'0'!$C$5)","v":"3"},{"$f":"IF(ISNUMBER('0'!D5),\"\",'0'!D5)","v":"YokohamaM."}]
["Hiroshima",{"$f":"IF(ISNUMBER('0'!A6),\"\",'0'!A6)","v":"Hiroshima"},{"$f":"IF(ISNUMBER('0'!$B$6),\"\",'0'!$B$6)","v":"0"},{"$f":"IF(ISNUMBER('0'!$C$6),\"\",'0'!$C$6)","v":"0"},{"$f":"IF(ISNUMBER('0'!D6),\"\",'0'!D6)","v":"FCTokyo"}]
["Iwata",{"$f":"IF(ISNUMBER('0'!A7),\"\",'0'!A7)","v":"Kashima"},{"$f":"IF(ISNUMBER('0'!$B$7),\"\",'0'!$B$7)","v":"2"},{"$f":"IF(ISNUMBER('0'!$C$7),\"\",'0'!$C$7)","v":"2"},{"$f":"IF(ISNUMBER('0'!D7),\"\",'0'!D7)","v":"G.Osaka"}]
["Kashima",{"$f":"IF(ISNUMBER('0'!A8),\"\",'0'!A8)","v":"KawasakiFrontale"},{"$f":"IF(ISNUMBER('0'!$B$8),\"\",'0'!$B$8)","v":"3"},{"$f":"IF(ISNUMBER('0'!$C$8),\"\",'0'!$C$8)","v":"3"},{"$f":"IF(ISNUMBER('0'!D8),\"\",'0'!D8)","v":"Urawa"}]
["Kashiwa",{"$f":"IF(ISNUMBER('0'!A9),\"\",'0'!A9)","v":"OmiyaArdija"},{"$f":"IF(ISNUMBER('0'!$B$9),\"\",'0'!$B$9)","v":"1"},{"$f":"IF(ISNUMBER('0'!$C$9),\"\",'0'!$C$9)","v":"1"},{"$f":"IF(ISNUMBER('0'!D9),\"\",'0'!D9)","v":"Kobe"}]
["KawasakiFrontale",{"$f":"IF(ISNUMBER('0'!A10),\"\",'0'!A10)","v":"Verdy"},{"$f":"IF(ISNUMBER('0'!$B$10),\"\",'0'!$B$10)","v":"0"},{"$f":"IF(ISNUMBER('0'!$C$10),\"\",'0'!$C$10)","v":"0"},{"$f":"IF(ISNUMBER('0'!D10),\"\",'0'!D10)","v":"Shimizu"}]
["Kobe"]
["Nagoya"]
["Oita"]
["OmiyaArdija"]
["Shimizu"]
["Urawa"]
["Verdy"]
["YokohamaM."]

{"sheet":"Шахматка","index":1,"n_rows":38,"n_cols":72,"rows_kept":38,"cut":false,"hidden":false,"merged":[[0,1,0,2],[0,3,0,4],[0,5,0,6],[0,7,0,8],[0,9,0,10],[0,21,0,22],[0,11,0,12],[0,13,0,14],[0,15,0,16],[0,17,0,18],[0,19,0,20],[0,23,0,24],[0,33,0,34],[0,35,0,36],[0,25,0,26],[0,27,0,28],[0,29,0,30],[0,31,0,32],[19,38,19,39],[19,40,19,41],[19,42,19,43],[19,44,19,45],[19,46,19,47],[19,48,19,49],[19,50,19,51],[19,52,19,53],[19,54,19,55],[19,56,19,57],[19,68,19,69],[19,70,19,71],[19,58,19,59],[19,60,19,61],[19,62,19,63],[19,64,19,65],[19,66,19,67]]}
[null,{"$f":"A2","v":"AlbirexNiigata"},null,{"$f":"A3","v":"C.Osaka"},null,{"$f":"A4","v":"Chiba"},null,{"$f":"A5","v":"FCTokyo"},null,{"$f":"A6","v":"G.Osaka"},null,{"$f":"A7","v":"Hiroshima"},null,{"$f":"A8","v":"Iwata"},null,{"$f":"A9","v":"Kashima"},null,{"$f":"A10","v":"Kashiwa"},null,{"$f":"A11","v":"KawasakiFrontale"},null,{"$f":"A12","v":"Kobe"},null,{"$f":"A13","v":"Nagoya"},null,{"$f":"A14","v":"Oita"},null,{"$f":"A15","v":"OmiyaArdija"},null,{"$f":"A16","v":"Shimizu"},null,{"$f":"A17","v":"Urawa"},null,{"$f":"A18","v":"Verdy"},null,{"$f":"A19","v":"YokohamaM."},null,null,"з","п","з","п","з","п","з","п","з","п","з","п","з","п","з","п","з","п","з","п","з","п","з","п","з","п","з","п","з","п","з","п","з","п"]
[{"$f":"'J-League'!A1","v":"AlbirexNiigata"},null,null,null,null,null,null,null,null,null,null,null,null,null,null,null,null,null,null,null,null,null,null,null,null,2,1,null,null,null,null,null,null,null,null,null,null,null,2,1]
[{"$f":"'J-League'!A2","v":"C.Osaka"},null,null,null,null,null,null,null,null,null,null,null,null,null,null,null,null,null,null,null,null,null,null,null,null,null,null,null,null,null,null,null,null,null,null,2,3,null,2,3]
[{"$f":"'J-League'!A3","v":"Chiba"},null,null,null,null,null,null,null,null,null,null,null,null,null,null,null,null,2,2,null,null,null,null,null,null,null,null,null,null,null,null,null,null,null,null,null,null,null,2,2]
[{"$f":"'J-League'!A4","v":"FCTokyo"},4,0,null,null,null,null,null,null,null,null,null,null,null,null,null,null,null,null,null,null,null,null,null,null,null,null,null,null,null,null,null,null,null,null,null,null,null,4,0]
[{"$f":"'J-League'!A5","v":"G.Osaka"},null,null,null,null,null,null,null,null,null,null,null,null,null,null,null,null,null,null,null,null,null,null,null,null,null,null,0,2,null,null,null,null,null,null,null,null,null,0,2]
[{"$f":"'J-League'!A6","v":"Hiroshima"},null,null,null,null,null,null,0,0,null,null,null,null,null,null,null,null,null,null,null,null,null,null,null,null,null,null,null,null,null,null,null,null,null,null,null,null,null,0,0]
[{"$f":"'J-League'!A7","v":"Iwata"},null,null,null,null,null,null,null,null,null,null,null,null,null,null,null,null,null,null,null,null,null,null,0,3,null,null,null,null,null,null,null,null,null,null,null,null,null,0,3]
[{"$f":"'J-League'!A8","v":"Kashima"},null,null,null,null,null,null,null,null,2,2,null,null,null,null,null,null,null,null,null,null,null,null,null,null,null,null,null,null,null,null,null,null,null,null,null,null,null,2,2]
[{"$f":"'J-League'!A9","v":"Kashiwa"},null,null,null,null,null,null,null,null,null,null,null,null,null,null,null,null,null,null,1,1,null,null,null,null,null,null,null,null,null,null,null,null,null,null,null,null,null,1,1]
[{"$f":"'J-League'!A10","v":"KawasakiFrontale"},null,null,null,null,null,null,null,null,null,null,null,null,null,null,null,null,null,null,null,null,null,null,null,null,null,null,null,null,null,null,3,3,null,null,null,null,null,3,3]
[{"$f":"'J-League'!A11","v":"Kobe"},null,null,3,1,null,null,null,null,null,null,null,null,null,null,null,null,null,null,null,null,null,null,null,null,null,null,null,null,null,null,null,null,null,null,null,null,null,3,1]
[{"$f":"'J-League'!A12","v":"Nagoya"},null,null,null,null,2,2,null,null,null,null,null,null,null,null,null,null,null,null,null,null,null,null,null,null,null,null,null,null,null,null,null,null,null,null,null,null,null,2,2]
[{"$f":"'J-League'!A13","v":"Oita"},null,null,null,null,null,null,null,null,null,null,null,null,null,null,null,null,null,null,null,null,null,null,null,null,null,null,null,null,null,null,null,null,1,2,null,null,null,1,2]
[{"$f":"'J-League'!A14","v":"OmiyaArdija"},null,null,null,null,null,null,null,null,null,null,null,null,null,null,null,null,null,null,null,null,1,1,null,null,null,null,null,null,null,null,null,null,null,null,null,null,null,1,1]
[{"$f":"'J-League'!A15","v":"Shimizu"},null,null,null,null,null,null,null,null,null,null,1,1,null,null,null,null,null,null,null,null,null,null,null,null,null,null,null,null,null,null,null,null,null,null,null,null,null,1,1]
[{"$f":"'J-League'!A16","v":"Urawa"},null,null,null,null,null,null,null,null,null,null,null,null,null,null,0,1,null,null,null,null,null,null,null,null,null,null,null,null,null,null,null,null,null,null,null,null,null,0,1]
[{"$f":"'J-League'!A17","v":"Verdy"},null,null,null,null,null,null,null,null,null,null,null,null,null,null,null,null,null,null,null,null,null,null,null,null,null,null,null,null,0,0,null,null,null,null,null,null,null,0,0]
[{"$f":"'J-League'!A18","v":"YokohamaM."},null,null,null,null,null,null,null,null,null,null,null,null,0,1,null,null,null,null,null,null,null,null,null,null,null,null,null,null,null,null,null,null,null,null,null,null,null,0,1]
[]
[null,null,null,null,null,null,null,null,null,null,null,null,null,null,null,null,null,null,null,null,null,null,null,null,null,null,null,null,null,null,null,null,null,null,null,null,null,null,0,4]
[null,null,null,null,null,null,null,null,null,null,null,null,null,null,null,null,null,null,null,null,null,null,null,null,null,null,null,null,null,null,null,null,null,null,null,null,null,null,1,3]
[null,null,null,null,null,null,null,null,null,null,null,null,null,null,null,null,null,null,null,null,null,null,null,null,null,null,null,null,null,null,null,null,null,null,null,null,null,null,2,2]
[null,null,null,null,null,null,null,null,null,null,null,null,null,null,null,null,null,null,null,null,null,null,null,null,null,null,null,null,null,null,null,null,null,null,null,null,null,null,null,null,0,0]
[null,null,null,null,null,null,null,null,null,null,null,null,null,null,null,null,null,null,null,null,null,null,null,null,null,null,null,null,null,null,null,null,null,null,null,null,null,null,null,null,2,2]
[null,null,null,null,null,null,null,null,null,null,null,null,null,null,null,null,null,null,null,null,null,null,null,null,null,null,null,null,null,null,null,null,null,null,null,null,null,null,1,1]
[null,null,null,null,null,null,null,null,null,null,null,null,null,null,null,null,null,null,null,null,null,null,null,null,null,null,null,null,null,null,null,null,null,null,null,null,null,null,1,0]
[null,null,null,null,null,null,null,null,null,null,null,null,null,null,null,null,null,null,null,null,null,null,null,null,null,null,null,null,null,null,null,null,null,null,null,null,null,null,1,0]
[null,null,null,null,null,null,null,null,null,null,null,null,null,null,null,null,null,null,null,null,null,null,null,null,null,null,null,null,null,null,null,null,null,null,null,null,null,null,null,null,2,2]
[null,null,null,null,null,null,null,null,null,null,null,null,null,null,null,null,null,null,null,null,null,null,null,null,null,null,null,null,null,null,null,null,null,null,null,null,null,null,1,1]
[null,null,null,null,null,null,null,null,null,null,null,null,null,null,null,null,null,null,null,null,null,null,null,null,null,null,null,null,null,null,null,null,null,null,null,null,null,null,null,null,1,1]
[null,null,null,null,null,null,null,null,null,null,null,null,null,null,null,null,null,null,null,null,null,null,null,null,null,null,null,null,null,null,null,null,null,null,null,null,null,null,null,null,3,0]
[null,null,null,null,null,null,null,null,null,null,null,null,null,null,null,null,null,null,null,null,null,null,null,null,null,null,null,null,null,null,null,null,null,null,null,null,null,null,null,null,1,2]
[null,null,null,null,null,null,null,null,null,null,null,null,null,null,null,null,null,null,null,null,null,null,null,null,null,null,null,null,null,null,null,null,null,null,null,null,null,null,2,0]
[null,null,null,null,null,null,null,null,null,null,null,null,null,null,null,null,null,null,null,null,null,null,null,null,null,null,null,null,null,null,null,null,null,null,null,null,null,null,null,null,0,0]
[null,null,null,null,null,null,null,null,null,null,null,null,null,null,null,null,null,null,null,null,null,null,null,null,null,null,null,null,null,null,null,null,null,null,null,null,null,null,null,null,3,3]
[null,null,null,null,null,null,null,null,null,null,null,null,null,null,null,null,null,null,null,null,null,null,null,null,null,null,null,null,null,null,null,null,null,null,null,null,null,null,2,1]
[null,null,null,null,null,null,null,null,null,null,null,null,null,null,null,null,null,null,null,null,null,null,null,null,null,null,null,null,null,null,null,null,null,null,null,null,null,null,null,null,3,2]

{"sheet":"0","index":2,"n_rows":52,"n_cols":9,"rows_kept":52,"cut":false,"hidden":false,"merged":[]}
["home team","-","-","away team"]
[{"$f":"IF(A1=0,0,INDEX('00'!B$1:B$993,MATCH($F$5,'00'!$A$1:$A$993,)+ROW(A1)-1))","v":"AlbirexNiigata"},{"$f":"IF(B1=0,0,INDEX('00'!C$1:C$993,MATCH($F$5,'00'!$A$1:$A$993,)+ROW(B1)-1))","v":"2"},{"$f":"IF(C1=0,0,INDEX('00'!D$1:D$993,MATCH($F$5,'00'!$A$1:$A$993,)+ROW(C1)-1))","v":"1"},{"$f":"IF(D1=0,0,INDEX('00'!E$1:E$993,MATCH($F$5,'00'!$A$1:$A$993,)+ROW(D1)-1))","v":"Oita"}]
[{"$f":"IF(A2=0,0,INDEX('00'!B$1:B$993,MATCH($F$5,'00'!$A$1:$A$993,)+ROW(A2)-1))","v":"Iwata"},{"$f":"IF(B2=0,0,INDEX('00'!C$1:C$993,MATCH($F$5,'00'!$A$1:$A$993,)+ROW(B2)-1))","v":"0"},{"$f":"IF(C2=0,0,INDEX('00'!D$1:D$993,MATCH($F$5,'00'!$A$1:$A$993,)+ROW(C2)-1))","v":"3"},{"$f":"IF(D2=0,0,INDEX('00'!E$1:E$993,MATCH($F$5,'00'!$A$1:$A$993,)+ROW(D2)-1))","v":"Nagoya"},null,null,null,null,1]
[{"$f":"IF(A3=0,0,INDEX('00'!B$1:B$993,MATCH($F$5,'00'!$A$1:$A$993,)+ROW(A3)-1))","v":"Chiba"},{"$f":"IF(B3=0,0,INDEX('00'!C$1:C$993,MATCH($F$5,'00'!$A$1:$A$993,)+ROW(B3)-1))","v":"2"},{"$f":"IF(C3=0,0,INDEX('00'!D$1:D$993,MATCH($F$5,'00'!$A$1:$A$993,)+ROW(C3)-1))","v":"2"},{"$f":"IF(D3=0,0,INDEX('00'!E$1:E$993,MATCH($F$5,'00'!$A$1:$A$993,)+ROW(D3)-1))","v":"Kashiwa"},null,"round",null,null,2]
[{"$f":"IF(A4=0,0,INDEX('00'!B$1:B$993,MATCH($F$5,'00'!$A$1:$A$993,)+ROW(A4)-1))","v":"C.Osaka"},{"$f":"IF(B4=0,0,INDEX('00'!C$1:C$993,MATCH($F$5,'00'!$A$1:$A$993,)+ROW(B4)-1))","v":"2"},{"$f":"IF(C4=0,0,INDEX('00'!D$1:D$993,MATCH($F$5,'00'!$A$1:$A$993,)+ROW(C4)-1))","v":"3"},{"$f":"IF(D4=0,0,INDEX('00'!E$1:E$993,MATCH($F$5,'00'!$A$1:$A$993,)+ROW(D4)-1))","v":"YokohamaM."},null,{"$f":"'J-League'!F1","v":2},null,null,3]
[{"$f":"IF(A5=0,0,INDEX('00'!B$1:B$993,MATCH($F$5,'00'!$A$1:$A$993,)+ROW(A5)-1))","v":"Hiroshima"},{"$f":"IF(B5=0,0,INDEX('00'!C$1:C$993,MATCH($F$5,'00'!$A$1:$A$993,)+ROW(B5)-1))","v":"0"},{"$f":"IF(C5=0,0,INDEX('00'!D$1:D$993,MATCH($F$5,'00'!$A$1:$A$993,)+ROW(C5)-1))","v":"0"},{"$f":"IF(D5=0,0,INDEX('00'!E$1:E$993,MATCH($F$5,'00'!$A$1:$A$993,)+ROW(D5)-1))","v":"FCTokyo"},null,null,null,null,4]
[{"$f":"IF(A6=0,0,INDEX('00'!B$1:B$993,MATCH($F$5,'00'!$A$1:$A$993,)+ROW(A6)-1))","v":"Kashima"},{"$f":"IF(B6=0,0,INDEX('00'!C$1:C$993,MATCH($F$5,'00'!$A$1:$A$993,)+ROW(B6)-1))","v":"2"},{"$f":"IF(C6=0,0,INDEX('00'!D$1:D$993,MATCH($F$5,'00'!$A$1:$A$993,)+ROW(C6)-1))","v":"2"},{"$f":"IF(D6=0,0,INDEX('00'!E$1:E$993,MATCH($F$5,'00'!$A$1:$A$993,)+ROW(D6)-1))","v":"G.Osaka"},null,null,null,null,5]
[{"$f":"IF(A7=0,0,INDEX('00'!B$1:B$993,MATCH($F$5,'00'!$A$1:$A$993,)+ROW(A7)-1))","v":"KawasakiFrontale"},{"$f":"IF(B7=0,0,INDEX('00'!C$1:C$993,MATCH($F$5,'00'!$A$1:$A$993,)+ROW(B7)-1))","v":"3"},{"$f":"IF(C7=0,0,INDEX('00'!D$1:D$993,MATCH($F$5,'00'!$A$1:$A$993,)+ROW(C7)-1))","v":"3"},{"$f":"IF(D7=0,0,INDEX('00'!E$1:E$993,MATCH($F$5,'00'!$A$1:$A$993,)+ROW(D7)-1))","v":"Urawa"},null,null,null,null,6]
[{"$f":"IF(A8=0,0,INDEX('00'!B$1:B$993,MATCH($F$5,'00'!$A$1:$A$993,)+ROW(A8)-1))","v":"OmiyaArdija"},{"$f":"IF(B8=0,0,INDEX('00'!C$1:C$993,MATCH($F$5,'00'!$A$1:$A$993,)+ROW(B8)-1))","v":"1"},{"$f":"IF(C8=0,0,INDEX('00'!D$1:D$993,MATCH($F$5,'00'!$A$1:$A$993,)+ROW(C8)-1))","v":"1"},{"$f":"IF(D8=0,0,INDEX('00'!E$1:E$993,MATCH($F$5,'00'!$A$1:$A$993,)+ROW(D8)-1))","v":"Kobe"},null,null,null,null,7]
[{"$f":"IF(A9=0,0,INDEX('00'!B$1:B$993,MATCH($F$5,'00'!$A$1:$A$993,)+ROW(A9)-1))","v":"Verdy"},{"$f":"IF(B9=0,0,INDEX('00'!C$1:C$993,MATCH($F$5,'00'!$A$1:$A$993,)+ROW(B9)-1))","v":"0"},{"$f":"IF(C9=0,0,INDEX('00'!D$1:D$993,MATCH($F$5,'00'!$A$1:$A$993,)+ROW(C9)-1))","v":"0"},{"$f":"IF(D9=0,0,INDEX('00'!E$1:E$993,MATCH($F$5,'00'!$A$1:$A$993,)+ROW(D9)-1))","v":"Shimizu"},null,null,null,null,8]
[null,null,null,null,null,null,null,null,9]
[null,null,null,null,null,null,null,null,10]
[null,null,null,null,null,null,null,null,11]
[null,null,null,null,null,null,null,null,12]
[null,null,null,null,null,null,null,null,13]
[null,null,null,null,null,null,null,null,14]
[null,null,null,null,null,null,null,null,15]
[null,null,null,null,null,null,null,null,16]
[null,null,null,null,null,null,null,null,17]
[null,null,null,null,null,null,null,null,18]
[null,null,null,null,null,null,null,null,19]
[null,null,null,null,null,null,null,null,20]
[null,null,null,null,null,null,null,null,21]
[null,null,null,null,null,null,null,null,22]
[null,null,null,null,null,null,null,null,23]
[null,null,null,null,null,null,null,null,24]
[null,null,null,null,null,null,null,null,25]
[null,null,null,null,null,null,null,null,26]
[null,null,null,null,null,null,null,null,27]
[null,null,null,null,null,null,null,null,28]
[null,null,null,null,null,null,null,null,29]
[null,null,null,null,null,null,null,null,30]
[null,null,null,null,null,null,null,null,31]
[null,null,null,null,null,null,null,null,32]
[null,null,null,null,null,null,null,null,33]
[null,null,null,null,null,null,null,null,34]
[null,null,null,null,null,null,null,null,35]
[null,null,null,null,null,null,null,null,36]
[null,null,null,null,null,null,null,null,37]
[null,null,null,null,null,null,null,null,38]
[null,null,null,null,null,null,null,null,39]
[null,null,null,null,null,null,null,null,40]
[null,null,null,null,null,null,null,null,41]
[null,null,null,null,null,null,null,null,42]
[null,null,null,null,null,null,null,null,43]
[null,null,null,null,null,null,null,null,44]
[null,null,null,null,null,null,null,null,45]
[null,null,null,null,null,null,null,null,46]
[null,null,null,null,null,null,null,null,47]
[null,null,null,null,null,null,null,null,48]
[null,null,null,null,null,null,null,null,49]
[null,null,null,null,null,null,null,null,50]

{"sheet":"00","index":3,"n_rows":339,"n_cols":5,"rows_kept":339,"cut":false,"hidden":false,"merged":[]}
[34,"Chiba","2","1","Nagoya"]
[34,"C.Osaka","2","2","FCTokyo"]
[34,"Hiroshima","3","1","Shimizu"]
[34,"Iwata","1","0","Kobe"]
[34,"Kashima","4","0","Kashiwa"]
[34,"KawasakiFrontale","2","4","G.Osaka"]
[34,"OmiyaArdija","1","1","YokohamaM."]
[34,"Verdy","4","2","Oita"]
[34,"AlbirexNiigata","0","4","Urawa"]
[]
[33,"Kobe","2","3","Hiroshima"]
[33,"Nagoya","0","1","AlbirexNiigata"]
[33,"FCTokyo","1","1","KawasakiFrontale"]
[33,"G.Osaka","1","2","Chiba"]
[33,"Kashiwa","5","1","Verdy"]
[33,"Oita","2","1","OmiyaArdija"]
[33,"Shimizu","2","2","Kashima"]
[33,"Urawa","1","0","Iwata"]
[33,"YokohamaM.","1","1","C.Osaka"]
[]
[32,"AlbirexNiigata","0","1","FCTokyo"]
[32,"Chiba","1","0","Urawa"]
[32,"C.Osaka","1","1","Oita"]
[32,"Hiroshima","0","0","Kashiwa"]
[32,"Kashima","0","2","YokohamaM."]
[32,"KawasakiFrontale","0","2","Iwata"]
[32,"OmiyaArdija","1","0","G.Osaka"]
[32,"Shimizu","1","0","Kobe"]
[32,"Verdy","0","0","Nagoya"]
[]
[31,"C.Osaka","2","0","KawasakiFrontale"]
[31,"FCTokyo","2","1","Chiba"]
[31,"Iwata","2","3","AlbirexNiigata"]
[31,"Kashiwa","1","2","Shimizu"]
[31,"Kobe","0","1","OmiyaArdija"]
[31,"Nagoya","2","1","G.Osaka"]
[31,"Oita","1","1","Kashima"]
[31,"Urawa","4","1","Verdy"]
[31,"YokohamaM.","3","1","Hiroshima"]
[]
[30,"Chiba","2","2","Iwata"]
[30,"G.Osaka","2","1","Urawa"]
[30,"Hiroshima","0","4","Oita"]
[30,"Kashima","1","1","FCTokyo"]
[30,"KawasakiFrontale","3","1","Kobe"]
[30,"OmiyaArdija","3","2","Nagoya"]
[30,"Shimizu","0","1","YokohamaM."]
[30,"AlbirexNiigata","2","2","Kashiwa"]
[30,"Verdy","0","1","C.Osaka"]
[]
[29,"C.Osaka","0","0","Kashima"]
[29,"FCTokyo","2","1","G.Osaka"]
[29,"Iwata","1","3","Hiroshima"]
[29,"Kashiwa","1","2","OmiyaArdija"]
[29,"Kobe","1","1","AlbirexNiigata"]
[29,"Nagoya","1","2","Shimizu"]
[29,"Oita","0","1","Chiba"]
[29,"Urawa","3","2","KawasakiFrontale"]
[29,"YokohamaM.","1","0","Verdy"]
[]
[28,"Hiroshima","1","2","C.Osaka"]
[28,"KawasakiFrontale","3","1","Kashiwa"]
[28,"AlbirexNiigata","1","0","YokohamaM."]
[28,"Chiba","4","0","Kobe"]
[28,"Kashima","1","0","Nagoya"]
[28,"OmiyaArdija","1","3","Urawa"]
[28,"Shimizu","1","1","Iwata"]
[28,"Verdy","1","2","FCTokyo"]
[28,"G.Osaka","1","2","Oita"]
[]
[27,"Chiba","2","2","YokohamaM."]
[27,"Iwata","1","1","Kashima"]
[27,"Kobe","1","4","G.Osaka"]
[27,"AlbirexNiigata","1","1","Verdy"]
[27,"C.Osaka","1","0","OmiyaArdija"]
[27,"FCTokyo","2","2","Hiroshima"]
[27,"Nagoya","1","4","KawasakiFrontale"]
[27,"Oita","5","0","Shimizu"]
[27,"Urawa","7","0","Kashiwa"]
[]
[26,"C.Osaka","3","1","Urawa"]
[26,"Shimizu","1","4","G.Osaka"]
[26,"Hiroshima","1","2","Nagoya"]
[26,"Kashima","2","2","Chiba"]
[26,"Kashiwa","1","0","Kobe"]
[26,"KawasakiFrontale","3","0","AlbirexNiigata"]
[26,"OmiyaArdija","0","1","FCTokyo"]
[26,"Verdy","4","4","Iwata"]
[26,"YokohamaM.","0","3","Oita"]
[]
[25,"AlbirexNiigata","0","1","Hiroshima"]
[25,"Chiba","2","1","Shimizu"]
[25,"FCTokyo","0","0","Oita"]
[25,"G.Osaka","3","3","Kashima"]
[25,"Iwata","1","0","Kashiwa"]
[25,"KawasakiFrontale","2","1","OmiyaArdija"]
[25,"Kobe","1","1","Verdy"]
[25,"Nagoya","1","3","C.Osaka"]
[25,"Urawa","0","0","YokohamaM."]
[]
[24,"Hiroshima","3","4","Urawa"]
[24,"Shimizu","2","1","AlbirexNiigata"]
[24,"C.Osaka","2","0","Iwata"]
[24,"Kashima","4","0","Kobe"]
[24,"Kashiwa","2","1","G.Osaka"]
[24,"Oita","2","0","Nagoya"]
[24,"OmiyaArdija","0","1","Chiba"]
[24,"Verdy","1","2","KawasakiFrontale"]
[24,"YokohamaM.","0","0","FCTokyo"]
[]
[23,"Chiba","1","0","Verdy"]
[23,"KawasakiFrontale","2","1","Kashima"]
[23,"AlbirexNiigata","1","2","C.Osaka"]
[23,"FCTokyo","1","0","Shimizu"]
[23,"G.Osaka","4","2","Hiroshima"]
[23,"Iwata","2","0","OmiyaArdija"]
[23,"Kobe","0","2","YokohamaM."]
[23,"Nagoya","4","0","Kashiwa"]
[23,"Urawa","1","2","Oita"]
[]
[22,"C.Osaka","2","1","Kobe"]
[22,"Hiroshima","1","1","Chiba"]
[22,"Kashima","2","2","Urawa"]
[22,"Kashiwa","4","2","FCTokyo"]
[22,"Oita","1","2","Iwata"]
[22,"OmiyaArdija","1","4","AlbirexNiigata"]
[22,"Shimizu","3","2","KawasakiFrontale"]
[22,"Verdy","0","1","G.Osaka"]
[22,"YokohamaM.","2","2","Nagoya"]
[]
[21,"Kashiwa","1","1","C.Osaka"]
[21,"OmiyaArdija","3","2","Shimizu"]
[21,"AlbirexNiigata","1","1","Chiba"]
[21,"G.Osaka","3","2","YokohamaM."]
[21,"Iwata","1","1","FCTokyo"]
[21,"KawasakiFrontale","1","1","Hiroshima"]
[21,"Kobe","2","1","Oita"]
[21,"Nagoya","0","2","Urawa"]
[21,"Verdy","2","0","Kashima"]
[]
[20,"Chiba","1","2","C.Osaka"]
[20,"FCTokyo","1","1","Nagoya"]
[20,"G.Osaka","3","1","Iwata"]
[20,"Hiroshima","2","1","OmiyaArdija"]
[20,"Kashima","7","2","AlbirexNiigata"]
[20,"Oita","1","1","Kashiwa"]
[20,"Shimizu","1","2","Verdy"]
[20,"Urawa","2","2","Kobe"]
[20,"YokohamaM.","0","2","KawasakiFrontale"]
[]
[19,"Kashiwa","1","2","Chiba"]
[19,"Verdy","1","1","OmiyaArdija"]
[19,"AlbirexNiigata","4","2","G.Osaka"]
[19,"C.Osaka","1","1","Shimizu"]
[19,"Iwata","3","1","YokohamaM."]
[19,"Kashima","1","2","Hiroshima"]
[19,"KawasakiFrontale","2","1","Oita"]
[19,"Kobe","1","0","Nagoya"]
[19,"Urawa","2","1","FCTokyo"]
[]
[18,"Nagoya","2","0","Iwata"]
[18,"Oita","1","3","AlbirexNiigata"]
[18,"Chiba","1","0","KawasakiFrontale"]
[18,"FCTokyo","1","1","Kobe"]
[18,"G.Osaka","4","1","C.Osaka"]
[18,"Hiroshima","3","0","Verdy"]
[18,"OmiyaArdija","0","2","Kashima"]
[18,"Shimizu","0","1","Urawa"]
[18,"YokohamaM.","0","0","Kashiwa"]
[]
[17,"Chiba","2","0","OmiyaArdija"]
[17,"Urawa","2","0","Hiroshima"]
[17,"AlbirexNiigata","3","0","Nagoya"]
[17,"FCTokyo","4","0","YokohamaM."]
[17,"G.Osaka","3","3","Shimizu"]
[17,"Iwata","6","0","Verdy"]
[17,"Kashima","1","1","Oita"]
[17,"KawasakiFrontale","3","2","C.Osaka"]
[17,"Kobe","0","4","Kashiwa"]
[]
[16,"C.Osaka","1","0","AlbirexNiigata"]
[16,"Hiroshima","0","0","Iwata"]
[16,"Kashiwa","3","0","Urawa"]
[16,"Nagoya","3","0","Kashima"]
[16,"Oita","0","2","G.Osaka"]
[16,"OmiyaArdija","1","0","KawasakiFrontale"]
[16,"Shimizu","0","1","FCTokyo"]
[16,"Verdy","3","3","Kobe"]
[16,"YokohamaM.","2","1","Chiba"]
[]
[15,"G.Osaka","3","2","Kashiwa"]
[15,"Oita","0","1","Hiroshima"]
[15,"Chiba","3","2","AlbirexNiigata"]
[15,"FCTokyo","0","0","Verdy"]
[15,"Iwata","3","0","C.Osaka"]
[15,"Kashima","2","0","KawasakiFrontale"]
[15,"Kobe","0","3","Shimizu"]
[15,"Nagoya","1","1","YokohamaM."]
[15,"Urawa","1","2","OmiyaArdija"]
[]
{"$rows_left_out":139}