{"text_format":"1","workbook":"xlsx","n_sheets":3,"sheets":["Měsíční rekapitulace","Roční rekapitulace","List1"],"not_rendered":{"charts":0,"images":0,"macros":1,"external_links":0,"defined_names":13,"comments":0,"pivot_tables":1},"unopened":[],"bounds":{"document_bytes":16777216,"sheet_cells":100000,"rows_first":2000,"rows_last":500,"rows_between":2000,"halvings":0,"cell_chars":16384,"cell_head_chars":4096},"cells_cut":0,"cells_raw":0,"read":"whole","date_system":"1900"}

{"sheet":"Měsíční rekapitulace","index":0,"n_rows":144,"n_cols":20,"rows_kept":144,"cut":false,"hidden":false,"merged":[[141,0,141,1],[141,4,141,14],[142,0,142,1],[142,4,142,14],[136,11,136,12],[136,13,136,16],[137,0,137,3],[137,4,137,14],[138,0,138,1],[138,4,138,14],[139,0,139,1],[139,4,139,14],[140,0,140,1],[140,4,140,14],[111,0,111,1],[111,4,111,14],[106,0,106,3],[106,4,106,14],[120,0,120,1],[120,4,120,14],[117,0,117,3],[117,4,117,14],[118,0,118,1],[118,4,118,14],[119,0,119,1],[119,4,119,14],[100,0,100,1],[100,4,100,14],[99,0,99,1],[99,4,99,14],[109,0,109,1],[109,4,109,14],[110,0,110,1],[110,4,110,14],[107,0,107,1],[107,4,107,14],[108,0,108,1],[102,0,102,1],[102,4,102,14],[108,4,108,14],[101,0,101,1],[101,4,101,14],[78,4,78,14],[77,0,77,1],[93,0,93,3],[93,4,93,14],[67,0,67,1],[61,4,61,14],[62,0,62,1],[97,0,97,1],[79,0,79,1],[79,4,79,14],[83,11,83,12],[83,13,83,16],[85,0,85,1],[85,4,85,14],[63,4,63,14],[69,15,69,16],[64,0,64,1],[64,4,64,14],[97,4,97,14],[84,0,84,3],[84,4,84,14],[75,0,75,1],[75,4,75,14],[65,4,65,14],[48,0,48,3],[51,4,51,14],[58,4,58,14],[50,4,50,14],[52,0,52,1],[52,4,52,14],[54,0,54,1],[59,0,59,1],[59,4,59,14],[53,0,53,1],[57,13,57,16],[58,0,58,3],[8,0,8,1],[8,4,8,14],[9,0,9,1],[9,4,9,14],[13,0,13,3],[13,4,13,14],[14,0,14,1],[14,4,14,14],[98,0,98,1],[98,4,98,14],[86,0,86,1],[86,4,86,14],[87,0,87,1],[87,4,87,14],[88,0,88,1],[88,4,88,14],[94,0,94,1],[94,4,94,14],[49,4,49,14],[71,0,71,3],[71,4,71,14],[72,0,72,1],[61,0,61,1],[47,11,47,12],[36,4,36,14],[37,0,37,1],[37,4,37,14],[35,13,35,16],[32,0,32,1],[0,13,0,16],[0,11,0,12],[1,0,1,3],[1,4,1,14],[2,0,2,1],[2,4,2,14],[3,0,3,1],[3,4,3,14],[4,0,4,1],[4,4,4,14],[5,0,5,1],[5,4,5,14],[6,0,6,1],[6,4,6,14],[7,0,7,1],[7,4,7,14],[12,11,12,12],[15,0,15,1],[15,4,15,14],[60,4,60,14],[76,0,76,1],[76,4,76,14],[77,4,77,14],[57,11,57,12],[70,11,70,12],[70,13,70,16],[50,0,50,1],[49,0,49,1],[51,0,51,1],[73,4,73,14],[74,0,74,1],[74,4,74,14],[60,0,60,1],[62,4,62,14],[67,4,67,14],[66,0,66,1],[66,4,66,14],[65,0,65,1],[126,11,126,12],[126,13,126,16],[105,11,105,12],[105,13,105,16],[114,11,114,12],[114,13,114,16],[12,13,12,16],[16,0,16,1],[44,0,44,1],[44,4,44,14],[18,0,18,1],[18,4,18,14],[19,0,19,1],[19,4,19,14],[20,0,20,1],[20,4,20,14],[21,0,21,1],[21,4,21,14],[26,4,26,14],[27,0,27,1],[32,4,32,14],[29,4,29,14],[27,4,27,14],[40,0,40,1],[43,0,43,1],[41,0,41,1],[41,4,41,14],[63,0,63,1],[53,4,53,14],[121,0,121,1],[121,4,121,14],[116,11,116,12],[116,13,116,16],[92,11,92,12],[92,13,92,16],[95,0,95,1],[95,4,95,14],[96,0,96,1],[96,4,96,14],[43,4,43,14],[48,4,48,14],[54,4,54,14],[80,0,80,1],[80,4,80,14],[78,0,78,1],[47,13,47,16],[72,4,72,14],[73,0,73,1],[25,4,25,14],[25,0,25,3],[24,13,24,16],[24,11,24,12],[17,0,17,1],[17,4,17,14],[16,4,16,14],[42,0,42,1],[42,4,42,14],[26,0,26,1],[28,0,28,1],[28,4,28,14],[31,0,31,1],[40,4,40,14],[29,0,29,1],[30,0,30,1],[31,4,31,14],[30,4,30,14],[38,0,38,1],[38,4,38,14],[39,0,39,1],[35,11,35,12],[39,4,39,14],[36,0,36,3],[127,0,127,3],[127,4,127,14],[128,0,128,1],[128,4,128,14],[129,0,129,1],[129,4,129,14],[130,0,130,1],[130,4,130,14],[131,4,131,14],[131,0,131,1]]}
[null,null,null,null,null,null,null,null,null,null,null,"2015-01-01",null,"2015-01-31",null,null,null,null,null,{"$f":"SUMIF(O1:O46,O11,Q1:Q46)","v":1013}]
["Zkratka projektu",null,null,null,"Název projektu",null,null,null,null,null,null,null,null,null,null,null,"Počet hodin"]
["Řízení",null,null,null,"Řízení existujících a příprava nových projektů, realizovaných v rámci servisu",null,null,null,null,null,null,null,null,null,null,null,50.5]
["S-2109",null,null,null,"Evidence revize závazku provedené z pověření správní rady",null,null,null,null,null,null,null,null,null,null,null,37]
["S-2398",null,null,null,"(SLP) Oprávnění na změnu stavu řešení uzavřené ŠU s klasifikací 24_2a",null,null,null,null,null,null,null,null,null,null,null,1.5]
["S-2422",null,null,null,"Výměna verze wrapperu",null,null,null,null,null,null,null,null,null,null,null,8]
["S-2508",null,null,null,"Kontrola datumu ŠU",null,null,null,null,null,null,null,null,null,null,null,2]
["S-2546",null,null,null,"Přechod na elektronický spis",null,null,null,null,null,null,null,null,null,null,null,2.5]
["S-2589",null,null,null,"P3WS - Přepočítání hodnot IC - program SPSg",null,null,null,null,null,null,null,null,null,null,null,30]
["Servis2015",null,null,null,"Práce podle servisní smlouvy na rok 2015",null,null,null,null,null,null,null,null,null,null,null,61]
[null,null,null,null,null,null,null,null,null,null,null,null,null,null,"suma:",null,{"$f":"SUM(Q3:Q10)","v":192.5},{"$f":"SUM(Q2:Q10)","v":192.5}]
[]
[null,null,null,null,null,null,null,null,null,null,null,"2015-02-01",null,"2015-02-28"]
["Zkratka projektu",null,null,null,"Název projektu",null,null,null,null,null,null,null,null,null,null,null,"Počet hodin"]
["Řízení",null,null,null,"Řízení existujících a příprava nových projektů, realizovaných v rámci servisu",null,null,null,null,null,null,null,null,null,null,null,49]
["S-1787",null,null,null,"Automatické zasílání mailu",null,null,null,null,null,null,null,null,null,null,null,2]
["S-2414",null,null,null,"Změna logování a uvolňování paměti webových aplikací",null,null,null,null,null,null,null,null,null,null,null,16]
["S-2546",null,null,null,"Přechod na elektronický spis",null,null,null,null,null,null,null,null,null,null,null,21]
["S-2561",null,null,null,"SALIPU nárok, který je v uzavřeném delegačním procesu",null,null,null,null,null,null,null,null,null,null,null,1]
["S-2682",null,null,null,"P3WS - školení nastavování parametrů",null,null,null,null,null,null,null,null,null,null,null,16.5]
["S-2683",null,null,null,"Změna algoritmu ACM pro interní aplikace",null,null,null,null,null,null,null,null,null,null,null,6]
["Servis2015",null,null,null,"Práce podle servisní smlouvy na rok 2015",null,null,null,null,null,null,null,null,null,null,null,51]
[null,null,null,null,null,null,null,null,null,null,null,null,null,null,"suma:",null,{"$f":"SUM(Q$11:Q$18)","v":280.5},{"$f":"SUM(Q14:Q22)","v":162.5}]
[]
[null,null,null,null,null,null,null,null,null,null,null,"2015-03-01",null,"2015-03-31"]
["Zkratka projektu",null,null,null,"Název projektu",null,null,null,null,null,null,null,null,null,null,null,"Počet hodin"]
["Řízení",null,null,null,"Řízení existujících a příprava nových projektů, realizovaných v rámci servisu",null,null,null,null,null,null,null,null,null,null,null,47]
["S-2414",null,null,null,"Změna logování a uvolňování paměti webových aplikací",null,null,null,null,null,null,null,null,null,null,null,22.5]
["S-2437",null,null,null,"Úprava automatického uzavírání ŠU po revizi posledního závazku",null,null,null,null,null,null,null,null,null,null,null,19]
["S-2561",null,null,null,"SALIPU nárok, který je v uzavřeném delegačním procesu",null,null,null,null,null,null,null,null,null,null,null,11.5]
["S-2628",null,null,null,"Vyjmutí číselníku partnerů z metadat",null,null,null,null,null,null,null,null,null,null,null,6]
["S-2683",null,null,null,"Změna algoritmu ACM pro interní aplikace",null,null,null,null,null,null,null,null,null,null,null,12]
["Servis2015",null,null,null,"Práce podle servisní smlouvy na rok 2015",null,null,null,null,null,null,null,null,null,null,null,92.5]
[null,null,null,null,null,null,null,null,null,null,null,null,null,null,"suma:",null,{"$f":"SUM(Q$11:Q$17)","v":259.5},{"$f":"SUM(Q25:Q33)","v":210.5}]
[]
[null,null,null,null,null,null,null,null,null,null,null,"2015-04-01",null,"2015-04-30"]
["Zkratka projektu",null,null,null,"Název projektu",null,null,null,null,null,null,null,null,null,null,null,"Počet hodin"]
["Řízení",null,null,null,"Řízení existujících a příprava nových projektů, realizovaných v rámci servisu",null,null,null,null,null,null,null,null,null,null,null,69.5]
["S-1787",null,null,null,"Automatické zasílání mailu",null,null,null,null,null,null,null,null,null,null,null,3]
["S-1868",null,null,null,"Doplnění údajů předávaných Policií ČR do ČKP v rámci Relace DN",null,null,null,null,null,null,null,null,null,null,null,92]
["S-2437",null,null,null,"Úprava automatického uzavírání ŠU po revizi posledního závazku",null,null,null,null,null,null,null,null,null,null,null,7]
["S-2628",null,null,null,"Vyjmutí číselníku partnerů z metadat",null,null,null,null,null,null,null,null,null,null,null,85.5]
["S-2685",null,null,null,"Rozšíření definice podtypů škody „ Totální škoda vozidla“",null,null,null,null,null,null,null,null,null,null,null,6]
["S-2695",null,null,null,"Úprava chování metody B1 -  Get_NositelAgr",null,null,null,null,null,null,null,null,null,null,null,49.5]
["Servis2015",null,null,null,"Práce podle servisní smlouvy na rok 2015",null,null,null,null,null,null,null,null,null,null,null,61.5]
[null,null,null,null,null,null,null,null,null,null,null,null,null,null,"suma:",null,{"$f":"SUM(Q$11:Q$18)","v":280.5},{"$f":"SUM(Q37:Q45)","v":374}]
[]
[null,null,null,null,null,null,null,null,null,null,null,"2014-05-01",null,"2014-05-31"]
["Zkratka projektu",null,null,null,"Název projektu",null,null,null,null,null,null,null,null,null,null,null,"Počet hodin"]
["Řízení",null,null,null,"Řízení existujících a příprava nových projektů, realizovaných v rámci servisu",null,null,null,null,null,null,null,null,null,null,null,99]
["S-1403",null,null,null,"Připomínky z bezpečnostních testů WS B3 a L5",null,null,null,null,null,null,null,null,null,null,null,8.5]
["S-1537",null,null,null,"Rozšíření P1 o flotily",null,null,null,null,null,null,null,null,null,null,null,35]
["S-1936",null,null,null,"Úprava business inteligence SLP",null,null,null,null,null,null,null,null,null,null,null,40]
["S-2024",null,null,null,"Doplnění SSY do seznamu závazků",null,null,null,null,null,null,null,null,null,null,null,10]
["Servis2014",null,null,null,"Práce podle servisní smlouvy na rok 2014",null,null,null,null,null,null,null,null,null,null,null,25.5]
[null,null,null,null,null,null,null,null,null,null,null,null,null,null,"suma:",null,{"$f":"SUM(Q50:Q55)","v":218},{"$f":"SUM(Q48:Q55)","v":218}]
[]
[null,null,null,null,null,null,null,null,null,null,null,"2014-06-01",null,"2014-06-30"]
["Zkratka projektu",null,null,null,"Název projektu",null,null,null,null,null,null,null,null,null,null,null,"Počet hodin"]
["Řízení",null,null,null,"Řízení existujících a příprava nových projektů, realizovaných v rámci servisu",null,null,null,null,null,null,null,null,null,null,null,131]
["S-1394",null,null,null,"Změna chování WS B1 ve vztahu k velkým objemům dat",null,null,null,null,null,null,null,null,null,null,null,27]
["S-1537",null,null,null,"Rozšíření P1 o flotily",null,null,null,null,null,null,null,null,null,null,null,13]
["S-1549",null,null,null,"Kontrola tarifní skupiny „Tahač“",null,null,null,null,null,null,null,null,null,null,null,24]
["S-1936",null,null,null,"Úprava business inteligence SLP",null,null,null,null,null,null,null,null,null,null,null,3]
["S-2058",null,null,null,"Úprava systému VR pro externí subsystém",null,null,null,null,null,null,null,null,null,null,null,31]
["S-559",null,null,null,"Revize restriktivních pravidel u záznamu SetPrenosPSP (B1/L1)",null,null,null,null,null,null,null,null,null,null,null,12]
["S-633",null,null,null,"(SLP) Předání svědka Salipu",null,null,null,null,null,null,null,null,null,null,null,11]
["Servis2014",null,null,null,"Práce podle servisní smlouvy na rok 2014",null,null,null,null,null,null,null,null,null,null,null,31.5]
[null,null,null,null,null,null,null,null,null,null,null,null,null,null,"suma:",null,{"$f":"SUM(Q60:Q68)","v":283.5},{"$f":"SUM(Q60:Q68)","v":283.5}]
[]
[null,null,null,null,null,null,null,null,null,null,null,"2014-07-01",null,"2014-07-31"]
["Zkratka projektu",null,null,null,"Název projektu",null,null,null,null,null,null,null,null,null,null,null,"Počet hodin"]
["Řízení",null,null,null,"Řízení existujících a příprava nových projektů, realizovaných v rámci servisu",null,null,null,null,null,null,null,null,null,null,null,82.5]
["S-1322",null,null,null,"Úprava zpracování nároků pro L6",null,null,null,null,null,null,null,null,null,null,null,23]
["S-1394",null,null,null,"Změna chování WS B1 ve vztahu k velkým objemům dat",null,null,null,null,null,null,null,null,null,null,null,132]
["S-1549",null,null,null,"Kontrola tarifní skupiny „Tahač“",null,null,null,null,null,null,null,null,null,null,null,22.5]
["S-1954",null,null,null,"Původní záznamy adres",null,null,null,null,null,null,null,null,null,null,null,16]
["S-2058",null,null,null,"Úprava systému VR pro externí subsystém",null,null,null,null,null,null,null,null,null,null,null,2]
["S-2126",null,null,null,"Logování změněných přenesených znaků do FIS CODA",null,null,null,null,null,null,null,null,null,null,null,2]
["S-559",null,null,null,"Revize restriktivních pravidel u záznamu SetPrenosPSP (B1/L1)",null,null,null,null,null,null,null,null,null,null,null,58]
["Servis2014",null,null,null,"Práce podle servisní smlouvy na rok 2014",null,null,null,null,null,null,null,null,null,null,null,42]
[null,null,null,null,null,null,null,null,null,null,null,null,null,null,"suma:",null,{"$f":"SUM(P73:Q81)","v":380},{"$f":"SUM(Q73:Q81)","v":380}]
[]
[null,null,null,null,null,null,null,null,null,null,null,"2014-08-01",null,"2014-08-31"]
["Zkratka projektu",null,null,null,"Název projektu",null,null,null,null,null,null,null,null,null,null,null,"Počet hodin"]
["Řízení",null,null,null,"Řízení existujících a příprava nových projektů, realizovaných v rámci servisu",null,null,null,null,null,null,null,null,null,null,null,90.5]
["S-2058",null,null,null,"Úprava systému VR pro externí subsystém",null,null,null,null,null,null,null,null,null,null,null,290.5]
["S-2162",null,null,null,"Úprava APV pro zrychlení zpracování dávek L1 a P1",null,null,null,null,null,null,null,null,null,null,null,18]
["Servis2014",null,null,null,"Práce podle servisní smlouvy na rok 2014",null,null,null,null,null,null,null,null,null,null,null,26.5]
[null,null,null,null,null,null,null,null,null,null,null,null,null,null,"suma:",null,{"$f":"SUM(Q86:Q89)","v":425.5}]
[]
[]
[null,null,null,null,null,null,null,null,null,null,null,"2014-09-01",null,"2014-09-30"]
["Zkratka projektu",null,null,null,"Název projektu",null,null,null,null,null,null,null,null,null,null,null,"Počet hodin"]
["Řízení",null,null,null,"Řízení existujících a příprava nových projektů, realizovaných v rámci servisu",null,null,null,null,null,null,null,null,null,null,null,48]
["S-1154",null,null,null,"Automatická kontrola POV",null,null,null,null,null,null,null,null,null,null,null,4]
["S-1936",null,null,null,"Úprava business inteligence SLP",null,null,null,null,null,null,null,null,null,null,null,58]
["S-2058",null,null,null,"Úprava systému VR pro externí subsystém",null,null,null,null,null,null,null,null,null,null,null,7]
["S-2126",null,null,null,"Logování změněných přenesených znaků do FIS CODA",null,null,null,null,null,null,null,null,null,null,null,17]
["S-2259",null,null,null,"Administrace plánovaných řídících operací",null,null,null,null,null,null,null,null,null,null,null,3]
["S-2260",null,null,null,"Zrušené smlouvy a program XDSg",null,null,null,null,null,null,null,null,null,null,null,27]
["S-2263",null,null,null,"Číselník SLP: \"Hromadný přenos metadat\" omezit právem",null,null,null,null,null,null,null,null,null,null,null,6]
["Servis2014",null,null,null,"Práce podle servisní smlouvy na rok 2014",null,null,null,null,null,null,null,null,null,null,null,73.5]
[null,null,null,null,null,null,null,null,null,null,null,null,null,null,"suma:",null,{"$f":"SUM(P95:Q103)","v":243.5},{"$f":"SUM(Q95:Q103)","v":243.5}]
[]
[null,null,null,null,null,null,null,null,null,null,null,"2014-10-01",null,"2014-10-31"]
["Zkratka projektu",null,null,null,"Název projektu",null,null,null,null,null,null,null,null,null,null,null,"Počet hodin"]
["Řízení",null,null,null,"Řízení existujících a příprava nových projektů, realizovaných v rámci servisu",null,null,null,null,null,null,null,null,null,null,null,31]
["S-1975SYPO",null,null,null,"Úprava výdeje dat o ŠU – Protokol L6",null,null,null,null,null,null,null,null,null,null,null,5]
["S-2259",null,null,null,"Administrace plánovaných řídících operací",null,null,null,null,null,null,null,null,null,null,null,46.5]
["S-2260",null,null,null,"Zrušené smlouvy a program XDSg",null,null,null,null,null,null,null,null,null,null,null,2]
["Servis2014",null,null,null,"Práce podle servisní smlouvy na rok 2014",null,null,null,null,null,null,null,null,null,null,null,117]
[null,null,null,null,null,null,null,null,null,null,null,null,null,null,"suma:",null,{"$f":"SUM(Q108:Q112)","v":201.5},{"$f":"SUM(Q107:Q112)","v":201.5}]
[]
[null,null,null,null,null,null,null,null,null,null,null,"2014-11-01",null,"2014-11-30"]
[]
[null,null,null,null,null,null,null,null,null,null,null,"2015-11-01",null,"2015-11-30"]
["Zkratka projektu",null,null,null,"Název projektu",null,null,null,null,null,null,null,null,null,null,null,"Počet hodin"]
["Řízení",null,null,null,"Řízení existujících a příprava nových projektů, realizovaných v rámci servisu",null,null,null,null,null,null,null,null,null,null,null,31.5]
["S-2151",null,null,null,"Tvorba rezervy na odměnu Salipu",null,null,null,null,null,null,null,null,null,null,null,22]
["S-2398",null,null,null,"(SLP) Oprávnění na změnu stavu řešení uzavřené ŠU s klasifikací 24_2a",null,null,null,null,null,null,null,null,null,null,null,13]
["Servis2014",null,null,null,"Práce podle servisní smlouvy na rok 2014",null,null,null,null,null,null,null,null,null,null,null,27]
[null,null,null,null,null,null,null,null,null,null,null,null,null,null,"suma:",null,{"$f":"SUM(Q119:Q122)","v":93.5},{"$f":"SUM(Q118:Q122)","v":93.5}]
[]
[]
[]
[null,null,null,null,null,null,null,null,null,null,null,"2015-12-01",null,"2015-12-30"]
["Zkratka projektu",null,null,null,"Název projektu",null,null,null,null,null,null,null,null,null,null,null,"Počet hodin"]
["Řízení",null,null,null,"Řízení existujících a příprava nových projektů, realizovaných v rámci servisu",null,null,null,null,null,null,null,null,null,null,null,31.5]
["S-2151",null,null,null,"Tvorba rezervy na odměnu Salipu",null,null,null,null,null,null,null,null,null,null,null,22]
["S-2398",null,null,null,"(SLP) Oprávnění na změnu stavu řešení uzavřené ŠU s klasifikací 24_2a",null,null,null,null,null,null,null,null,null,null,null,13]
["Servis2014",null,null,null,"Práce podle servisní smlouvy na rok 2014",null,null,null,null,null,null,null,null,null,null,null,27]
[null,null,null,null,null,null,null,null,null,null,null,null,null,null,"suma:",null,{"$f":"SUM(Q129:Q132)","v":93.5},{"$f":"SUM(Q128:Q132)","v":93.5}]
[]
[]
[]
[null,null,null,null,null,null,null,null,null,null,null,"2015-12-01",null,"2016-12-31"]
["Zkratka projektu",null,null,null,"Název projektu",null,null,null,null,null,null,null,null,null,null,null,"Počet hodin"]
["Řízení",null,null,null,"Řízení existujících a příprava nových projektů, realizovaných v rámci servisu",null,null,null,null,null,null,null,null,null,null,null,31]
["S-1975SYPO",null,null,null,"Úprava výdeje dat o ŠU – Protokol L6",null,null,null,null,null,null,null,null,null,null,null,5]
["S-2259",null,null,null,"Administrace plánovaných řídících operací",null,null,null,null,null,null,null,null,null,null,null,46.5]
["S-2260",null,null,null,"Zrušené smlouvy a program XDSg",null,null,null,null,null,null,null,null,null,null,null,2]
["Servis2014",null,null,null,"Práce podle servisní smlouvy na rok 2014",null,null,null,null,null,null,null,null,null,null,null,117]
[null,null,null,null,null,null,null,null,null,null,null,null,null,null,"suma:",null,{"$f":"SUM(Q139:Q143)","v":201.5},{"$f":"SUM(Q138:Q143)","v":201.5}]

{"sheet":"Roční rekapitulace","index":1,"n_rows":138,"n_cols":16,"rows_kept":138,"cut":false,"hidden":false,"merged":[]}
[null,"Celková spotřeba hodin",{"$f":"SUM(P6:P49)","v":1328}]
[null,"Řízení",{"$f":"P6","v":310},{"$f":"C2/C1","v":0.23343373493975902}]
[null,"Servis",{"$f":"P7","v":266},{"$f":"C3/C1","v":0.2003012048192771}]
[null,null,null,"2015-01-01","2015-02-01","2015-03-01","2015-04-01","2015-05-01","2015-06-01","2015-07-01","2015-08-01","2015-09-01","2015-10-01","2015-11-01","2015-12-01"]
["Zkratka projektu","Název projektu","Čerpání v předchozím roce","Počet hodin","Počet hodin","Počet hodin","Počet hodin","Počet hodin","Počet hodin","Počet hodin","Počet hodin","Počet hodin","Počet hodin","Počet hodin","Počet hodin","Celkem"]
["Řízení",{"$f":"IFERROR(INDEX('Měsíční rekapitulace'!E$3:E$999,MATCH(A6,'Měsíční rekapitulace'!A$3:A$999,)),\"\")","v":"Řízení existujících a příprava nových projektů, realizovaných v rámci servisu"},null,{"$f":"IF($A6=\"\",,SUMPRODUCT((LOOKUP(ROW(D$1:D$997),ROW(D$1:D$997)/ISNUMBER('Měsíční rekapitulace'!$L$1:$L$997),'Měsíční rekapitulace'!$L$1:$L$997)=D$4)*('Měsíční rekapitulace'!$A$3:$A$999=$A6)*TEXT('Měsíční rekapitulace'!$Q$3:$Q$999,\"0,0;0;0;\\0\")))","v":50.5},{"$f":"IF($A6=\"\",,SUMPRODUCT((LOOKUP(ROW(E$1:E$997),ROW(E$1:E$997)/ISNUMBER('Měsíční rekapitulace'!$L$1:$L$997),'Měsíční rekapitulace'!$L$1:$L$997)=E$4)*('Měsíční rekapitulace'!$A$3:$A$999=$A6)*TEXT('Měsíční rekapitulace'!$Q$3:$Q$999,\"0,0;0;0;\\0\")))","v":49},{"$f":"IF($A6=\"\",,SUMPRODUCT((LOOKUP(ROW(F$1:F$997),ROW(F$1:F$997)/ISNUMBER('Měsíční rekapitulace'!$L$1:$L$997),'Měsíční rekapitulace'!$L$1:$L$997)=F$4)*('Měsíční rekapitulace'!$A$3:$A$999=$A6)*TEXT('Měsíční rekapitulace'!$Q$3:$Q$999,\"0,0;0;0;\\0\")))","v":47},{"$f":"IF($A6=\"\",,SUMPRODUCT((LOOKUP(ROW(G$1:G$997),ROW(G$1:G$997)/ISNUMBER('Měsíční rekapitulace'!$L$1:$L$997),'Měsíční rekapitulace'!$L$1:$L$997)=G$4)*('Měsíční rekapitulace'!$A$3:$A$999=$A6)*TEXT('Měsíční rekapitulace'!$Q$3:$Q$999,\"0,0;0;0;\\0\")))","v":69.5},{"$f":"IF($A6=\"\",,SUMPRODUCT((LOOKUP(ROW(H$1:H$997),ROW(H$1:H$997)/ISNUMBER('Měsíční rekapitulace'!$L$1:$L$997),'Měsíční rekapitulace'!$L$1:$L$997)=H$4)*('Měsíční rekapitulace'!$A$3:$A$999=$A6)*TEXT('Měsíční rekapitulace'!$Q$3:$Q$999,\"0,0;0;0;\\0\")))","v":0},{"$f":"IF($A6=\"\",,SUMPRODUCT((LOOKUP(ROW(I$1:I$997),ROW(I$1:I$997)/ISNUMBER('Měsíční rekapitulace'!$L$1:$L$997),'Měsíční rekapitulace'!$L$1:$L$997)=I$4)*('Měsíční rekapitulace'!$A$3:$A$999=$A6)*TEXT('Měsíční rekapitulace'!$Q$3:$Q$999,\"0,0;0;0;\\0\")))","v":0},{"$f":"IF($A6=\"\",,SUMPRODUCT((LOOKUP(ROW(J$1:J$997),ROW(J$1:J$997)/ISNUMBER('Měsíční rekapitulace'!$L$1:$L$997),'Měsíční rekapitulace'!$L$1:$L$997)=J$4)*('Měsíční rekapitulace'!$A$3:$A$999=$A6)*TEXT('Měsíční rekapitulace'!$Q$3:$Q$999,\"0,0;0;0;\\0\")))","v":0},{"$f":"IF($A6=\"\",,SUMPRODUCT((LOOKUP(ROW(K$1:K$997),ROW(K$1:K$997)/ISNUMBER('Měsíční rekapitulace'!$L$1:$L$997),'Měsíční rekapitulace'!$L$1:$L$997)=K$4)*('Měsíční rekapitulace'!$A$3:$A$999=$A6)*TEXT('Měsíční rekapitulace'!$Q$3:$Q$999,\"0,0;0;0;\\0\")))","v":0},{"$f":"IF($A6=\"\",,SUMPRODUCT((LOOKUP(ROW(L$1:L$997),ROW(L$1:L$997)/ISNUMBER('Měsíční rekapitulace'!$L$1:$L$997),'Měsíční rekapitulace'!$L$1:$L$997)=L$4)*('Měsíční rekapitulace'!$A$3:$A$999=$A6)*TEXT('Měsíční rekapitulace'!$Q$3:$Q$999,\"0,0;0;0;\\0\")))","v":0},{"$f":"IF($A6=\"\",,SUMPRODUCT((LOOKUP(ROW(M$1:M$997),ROW(M$1:M$997)/ISNUMBER('Měsíční rekapitulace'!$L$1:$L$997),'Měsíční rekapitulace'!$L$1:$L$997)=M$4)*('Měsíční rekapitulace'!$A$3:$A$999=$A6)*TEXT('Měsíční rekapitulace'!$Q$3:$Q$999,\"0,0;0;0;\\0\")))","v":0},{"$f":"IF($A6=\"\",,SUMPRODUCT((LOOKUP(ROW(N$1:N$997),ROW(N$1:N$997)/ISNUMBER('Měsíční rekapitulace'!$L$1:$L$997),'Měsíční rekapitulace'!$L$1:$L$997)=N$4)*('Měsíční rekapitulace'!$A$3:$A$999=$A6)*TEXT('Měsíční rekapitulace'!$Q$3:$Q$999,\"0,0;0;0;\\0\")))","v":31.5},{"$f":"IF($A6=\"\",,SUMPRODUCT((LOOKUP(ROW(O$1:O$997),ROW(O$1:O$997)/ISNUMBER('Měsíční rekapitulace'!$L$1:$L$997),'Měsíční rekapitulace'!$L$1:$L$997)=O$4)*('Měsíční rekapitulace'!$A$3:$A$999=$A6)*TEXT('Měsíční rekapitulace'!$Q$3:$Q$999,\"0,0;0;0;\\0\")))","v":62.5},{"$f":"SUM(C6:O6)","v":310}]
["Servis2015",{"$f":"IFERROR(INDEX('Měsíční rekapitulace'!E$3:E$999,MATCH(A7,'Měsíční rekapitulace'!A$3:A$999,)),\"\")","v":"Práce podle servisní smlouvy na rok 2015"},null,{"$f":"IF($A7=\"\",,SUMPRODUCT((LOOKUP(ROW(D$1:D$997),ROW(D$1:D$997)/ISNUMBER('Měsíční rekapitulace'!$L$1:$L$997),'Měsíční rekapitulace'!$L$1:$L$997)=D$4)*('Měsíční rekapitulace'!$A$3:$A$999=$A7)*TEXT('Měsíční rekapitulace'!$Q$3:$Q$999,\"0,0;0;0;\\0\")))","v":61},{"$f":"IF($A7=\"\",,SUMPRODUCT((LOOKUP(ROW(E$1:E$997),ROW(E$1:E$997)/ISNUMBER('Měsíční rekapitulace'!$L$1:$L$997),'Měsíční rekapitulace'!$L$1:$L$997)=E$4)*('Měsíční rekapitulace'!$A$3:$A$999=$A7)*TEXT('Měsíční rekapitulace'!$Q$3:$Q$999,\"0,0;0;0;\\0\")))","v":51},{"$f":"IF($A7=\"\",,SUMPRODUCT((LOOKUP(ROW(F$1:F$997),ROW(F$1:F$997)/ISNUMBER('Měsíční rekapitulace'!$L$1:$L$997),'Měsíční rekapitulace'!$L$1:$L$997)=F$4)*('Měsíční rekapitulace'!$A$3:$A$999=$A7)*TEXT('Měsíční rekapitulace'!$Q$3:$Q$999,\"0,0;0;0;\\0\")))","v":92.5},{"$f":"IF($A7=\"\",,SUMPRODUCT((LOOKUP(ROW(G$1:G$997),ROW(G$1:G$997)/ISNUMBER('Měsíční rekapitulace'!$L$1:$L$997),'Měsíční rekapitulace'!$L$1:$L$997)=G$4)*('Měsíční rekapitulace'!$A$3:$A$999=$A7)*TEXT('Měsíční rekapitulace'!$Q$3:$Q$999,\"0,0;0;0;\\0\")))","v":61.5},{"$f":"IF($A7=\"\",,SUMPRODUCT((LOOKUP(ROW(H$1:H$997),ROW(H$1:H$997)/ISNUMBER('Měsíční rekapitulace'!$L$1:$L$997),'Měsíční rekapitulace'!$L$1:$L$997)=H$4)*('Měsíční rekapitulace'!$A$3:$A$999=$A7)*TEXT('Měsíční rekapitulace'!$Q$3:$Q$999,\"0,0;0;0;\\0\")))","v":0},{"$f":"IF($A7=\"\",,SUMPRODUCT((LOOKUP(ROW(I$1:I$997),ROW(I$1:I$997)/ISNUMBER('Měsíční rekapitulace'!$L$1:$L$997),'Měsíční rekapitulace'!$L$1:$L$997)=I$4)*('Měsíční rekapitulace'!$A$3:$A$999=$A7)*TEXT('Měsíční rekapitulace'!$Q$3:$Q$999,\"0,0;0;0;\\0\")))","v":0},{"$f":"IF($A7=\"\",,SUMPRODUCT((LOOKUP(ROW(J$1:J$997),ROW(J$1:J$997)/ISNUMBER('Měsíční rekapitulace'!$L$1:$L$997),'Měsíční rekapitulace'!$L$1:$L$997)=J$4)*('Měsíční rekapitulace'!$A$3:$A$999=$A7)*TEXT('Měsíční rekapitulace'!$Q$3:$Q$999,\"0,0;0;0;\\0\")))","v":0},{"$f":"IF($A7=\"\",,SUMPRODUCT((LOOKUP(ROW(K$1:K$997),ROW(K$1:K$997)/ISNUMBER('Měsíční rekapitulace'!$L$1:$L$997),'Měsíční rekapitulace'!$L$1:$L$997)=K$4)*('Měsíční rekapitulace'!$A$3:$A$999=$A7)*TEXT('Měsíční rekapitulace'!$Q$3:$Q$999,\"0,0;0;0;\\0\")))","v":0},{"$f":"IF($A7=\"\",,SUMPRODUCT((LOOKUP(ROW(L$1:L$997),ROW(L$1:L$997)/ISNUMBER('Měsíční rekapitulace'!$L$1:$L$997),'Měsíční rekapitulace'!$L$1:$L$997)=L$4)*('Měsíční rekapitulace'!$A$3:$A$999=$A7)*TEXT('Měsíční rekapitulace'!$Q$3:$Q$999,\"0,0;0;0;\\0\")))","v":0},{"$f":"IF($A7=\"\",,SUMPRODUCT((LOOKUP(ROW(M$1:M$997),ROW(M$1:M$997)/ISNUMBER('Měsíční rekapitulace'!$L$1:$L$997),'Měsíční rekapitulace'!$L$1:$L$997)=M$4)*('Měsíční rekapitulace'!$A$3:$A$999=$A7)*TEXT('Měsíční rekapitulace'!$Q$3:$Q$999,\"0,0;0;0;\\0\")))","v":0},{"$f":"IF($A7=\"\",,SUMPRODUCT((LOOKUP(ROW(N$1:N$997),ROW(N$1:N$997)/ISNUMBER('Měsíční rekapitulace'!$L$1:$L$997),'Měsíční rekapitulace'!$L$1:$L$997)=N$4)*('Měsíční rekapitulace'!$A$3:$A$999=$A7)*TEXT('Měsíční rekapitulace'!$Q$3:$Q$999,\"0,0;0;0;\\0\")))","v":0},{"$f":"IF($A7=\"\",,SUMPRODUCT((LOOKUP(ROW(O$1:O$997),ROW(O$1:O$997)/ISNUMBER('Měsíční rekapitulace'!$L$1:$L$997),'Měsíční rekapitulace'!$L$1:$L$997)=O$4)*('Měsíční rekapitulace'!$A$3:$A$999=$A7)*TEXT('Měsíční rekapitulace'!$Q$3:$Q$999,\"0,0;0;0;\\0\")))","v":0},266]
[{"$f":"IFERROR(INDEX('Měsíční rekapitulace'!A$3:A$999,SMALL(IF(('Měsíční rekapitulace'!A$3:A$999<>\"\")*('Měsíční rekapitulace'!A$3:A$999<>'Měsíční rekapitulace'!$A$2)*(COUNTIF(A$5:A7,'Měsíční rekapitulace'!A$3:A$999)=0),ROW('Měsíční rekapitulace'!A$3:A$999)-2),1)),\"\")","v":"S-2109"},{"$f":"IFERROR(INDEX('Měsíční rekapitulace'!E$3:E$999,MATCH(A8,'Měsíční rekapitulace'!A$3:A$999,)),\"\")","v":"Evidence revize závazku provedené z pověření správní rady"},null,{"$f":"IF($A8=\"\",,SUMPRODUCT((LOOKUP(ROW(D$1:D$997),ROW(D$1:D$997)/ISNUMBER('Měsíční rekapitulace'!$L$1:$L$997),'Měsíční rekapitulace'!$L$1:$L$997)=D$4)*('Měsíční rekapitulace'!$A$3:$A$999=$A8)*TEXT('Měsíční rekapitulace'!$Q$3:$Q$999,\"0,0;0;0;\\0\")))","v":37},{"$f":"IF($A8=\"\",,SUMPRODUCT((LOOKUP(ROW(E$1:E$997),ROW(E$1:E$997)/ISNUMBER('Měsíční rekapitulace'!$L$1:$L$997),'Měsíční rekapitulace'!$L$1:$L$997)=E$4)*('Měsíční rekapitulace'!$A$3:$A$999=$A8)*TEXT('Měsíční rekapitulace'!$Q$3:$Q$999,\"0,0;0;0;\\0\")))","v":0},{"$f":"IF($A8=\"\",,SUMPRODUCT((LOOKUP(ROW(F$1:F$997),ROW(F$1:F$997)/ISNUMBER('Měsíční rekapitulace'!$L$1:$L$997),'Měsíční rekapitulace'!$L$1:$L$997)=F$4)*('Měsíční rekapitulace'!$A$3:$A$999=$A8)*TEXT('Měsíční rekapitulace'!$Q$3:$Q$999,\"0,0;0;0;\\0\")))","v":0},{"$f":"IF($A8=\"\",,SUMPRODUCT((LOOKUP(ROW(G$1:G$997),ROW(G$1:G$997)/ISNUMBER('Měsíční rekapitulace'!$L$1:$L$997),'Měsíční rekapitulace'!$L$1:$L$997)=G$4)*('Měsíční rekapitulace'!$A$3:$A$999=$A8)*TEXT('Měsíční rekapitulace'!$Q$3:$Q$999,\"0,0;0;0;\\0\")))","v":0},{"$f":"IF($A8=\"\",,SUMPRODUCT((LOOKUP(ROW(H$1:H$997),ROW(H$1:H$997)/ISNUMBER('Měsíční rekapitulace'!$L$1:$L$997),'Měsíční rekapitulace'!$L$1:$L$997)=H$4)*('Měsíční rekapitulace'!$A$3:$A$999=$A8)*TEXT('Měsíční rekapitulace'!$Q$3:$Q$999,\"0,0;0;0;\\0\")))","v":0},{"$f":"IF($A8=\"\",,SUMPRODUCT((LOOKUP(ROW(I$1:I$997),ROW(I$1:I$997)/ISNUMBER('Měsíční rekapitulace'!$L$1:$L$997),'Měsíční rekapitulace'!$L$1:$L$997)=I$4)*('Měsíční rekapitulace'!$A$3:$A$999=$A8)*TEXT('Měsíční rekapitulace'!$Q$3:$Q$999,\"0,0;0;0;\\0\")))","v":0},{"$f":"IF($A8=\"\",,SUMPRODUCT((LOOKUP(ROW(J$1:J$997),ROW(J$1:J$997)/ISNUMBER('Měsíční rekapitulace'!$L$1:$L$997),'Měsíční rekapitulace'!$L$1:$L$997)=J$4)*('Měsíční rekapitulace'!$A$3:$A$999=$A8)*TEXT('Měsíční rekapitulace'!$Q$3:$Q$999,\"0,0;0;0;\\0\")))","v":0},{"$f":"IF($A8=\"\",,SUMPRODUCT((LOOKUP(ROW(K$1:K$997),ROW(K$1:K$997)/ISNUMBER('Měsíční rekapitulace'!$L$1:$L$997),'Měsíční rekapitulace'!$L$1:$L$997)=K$4)*('Měsíční rekapitulace'!$A$3:$A$999=$A8)*TEXT('Měsíční rekapitulace'!$Q$3:$Q$999,\"0,0;0;0;\\0\")))","v":0},{"$f":"IF($A8=\"\",,SUMPRODUCT((LOOKUP(ROW(L$1:L$997),ROW(L$1:L$997)/ISNUMBER('Měsíční rekapitulace'!$L$1:$L$997),'Měsíční rekapitulace'!$L$1:$L$997)=L$4)*('Měsíční rekapitulace'!$A$3:$A$999=$A8)*TEXT('Měsíční rekapitulace'!$Q$3:$Q$999,\"0,0;0;0;\\0\")))","v":0},{"$f":"IF($A8=\"\",,SUMPRODUCT((LOOKUP(ROW(M$1:M$997),ROW(M$1:M$997)/ISNUMBER('Měsíční rekapitulace'!$L$1:$L$997),'Měsíční rekapitulace'!$L$1:$L$997)=M$4)*('Měsíční rekapitulace'!$A$3:$A$999=$A8)*TEXT('Měsíční rekapitulace'!$Q$3:$Q$999,\"0,0;0;0;\\0\")))","v":0},{"$f":"IF($A8=\"\",,SUMPRODUCT((LOOKUP(ROW(N$1:N$997),ROW(N$1:N$997)/ISNUMBER('Měsíční rekapitulace'!$L$1:$L$997),'Měsíční rekapitulace'!$L$1:$L$997)=N$4)*('Měsíční rekapitulace'!$A$3:$A$999=$A8)*TEXT('Měsíční rekapitulace'!$Q$3:$Q$999,\"0,0;0;0;\\0\")))","v":0},{"$f":"IF($A8=\"\",,SUMPRODUCT((LOOKUP(ROW(O$1:O$997),ROW(O$1:O$997)/ISNUMBER('Měsíční rekapitulace'!$L$1:$L$997),'Měsíční rekapitulace'!$L$1:$L$997)=O$4)*('Měsíční rekapitulace'!$A$3:$A$999=$A8)*TEXT('Měsíční rekapitulace'!$Q$3:$Q$999,\"0,0;0;0;\\0\")))","v":0},37]
[{"$f":"IFERROR(INDEX('Měsíční rekapitulace'!A$3:A$999,SMALL(IF(('Měsíční rekapitulace'!A$3:A$999<>\"\")*('Měsíční rekapitulace'!A$3:A$999<>'Měsíční rekapitulace'!$A$2)*(COUNTIF(A$5:A8,'Měsíční rekapitulace'!A$3:A$999)=0),ROW('Měsíční rekapitulace'!A$3:A$999)-2),1)),\"\")","v":"S-2398"},{"$f":"IFERROR(INDEX('Měsíční rekapitulace'!E$3:E$999,MATCH(A9,'Měsíční rekapitulace'!A$3:A$999,)),\"\")","v":"(SLP) Oprávnění na změnu stavu řešení uzavřené ŠU s klasifikací 24_2a"},null,{"$f":"IF($A9=\"\",,SUMPRODUCT((LOOKUP(ROW(D$1:D$997),ROW(D$1:D$997)/ISNUMBER('Měsíční rekapitulace'!$L$1:$L$997),'Měsíční rekapitulace'!$L$1:$L$997)=D$4)*('Měsíční rekapitulace'!$A$3:$A$999=$A9)*TEXT('Měsíční rekapitulace'!$Q$3:$Q$999,\"0,0;0;0;\\0\")))","v":1.5},{"$f":"IF($A9=\"\",,SUMPRODUCT((LOOKUP(ROW(E$1:E$997),ROW(E$1:E$997)/ISNUMBER('Měsíční rekapitulace'!$L$1:$L$997),'Měsíční rekapitulace'!$L$1:$L$997)=E$4)*('Měsíční rekapitulace'!$A$3:$A$999=$A9)*TEXT('Měsíční rekapitulace'!$Q$3:$Q$999,\"0,0;0;0;\\0\")))","v":0},{"$f":"IF($A9=\"\",,SUMPRODUCT((LOOKUP(ROW(F$1:F$997),ROW(F$1:F$997)/ISNUMBER('Měsíční rekapitulace'!$L$1:$L$997),'Měsíční rekapitulace'!$L$1:$L$997)=F$4)*('Měsíční rekapitulace'!$A$3:$A$999=$A9)*TEXT('Měsíční rekapitulace'!$Q$3:$Q$999,\"0,0;0;0;\\0\")))","v":0},{"$f":"IF($A9=\"\",,SUMPRODUCT((LOOKUP(ROW(G$1:G$997),ROW(G$1:G$997)/ISNUMBER('Měsíční rekapitulace'!$L$1:$L$997),'Měsíční rekapitulace'!$L$1:$L$997)=G$4)*('Měsíční rekapitulace'!$A$3:$A$999=$A9)*TEXT('Měsíční rekapitulace'!$Q$3:$Q$999,\"0,0;0;0;\\0\")))","v":0},{"$f":"IF($A9=\"\",,SUMPRODUCT((LOOKUP(ROW(H$1:H$997),ROW(H$1:H$997)/ISNUMBER('Měsíční rekapitulace'!$L$1:$L$997),'Měsíční rekapitulace'!$L$1:$L$997)=H$4)*('Měsíční rekapitulace'!$A$3:$A$999=$A9)*TEXT('Měsíční rekapitulace'!$Q$3:$Q$999,\"0,0;0;0;\\0\")))","v":0},{"$f":"IF($A9=\"\",,SUMPRODUCT((LOOKUP(ROW(I$1:I$997),ROW(I$1:I$997)/ISNUMBER('Měsíční rekapitulace'!$L$1:$L$997),'Měsíční rekapitulace'!$L$1:$L$997)=I$4)*('Měsíční rekapitulace'!$A$3:$A$999=$A9)*TEXT('Měsíční rekapitulace'!$Q$3:$Q$999,\"0,0;0;0;\\0\")))","v":0},{"$f":"IF($A9=\"\",,SUMPRODUCT((LOOKUP(ROW(J$1:J$997),ROW(J$1:J$997)/ISNUMBER('Měsíční rekapitulace'!$L$1:$L$997),'Měsíční rekapitulace'!$L$1:$L$997)=J$4)*('Měsíční rekapitulace'!$A$3:$A$999=$A9)*TEXT('Měsíční rekapitulace'!$Q$3:$Q$999,\"0,0;0;0;\\0\")))","v":0},{"$f":"IF($A9=\"\",,SUMPRODUCT((LOOKUP(ROW(K$1:K$997),ROW(K$1:K$997)/ISNUMBER('Měsíční rekapitulace'!$L$1:$L$997),'Měsíční rekapitulace'!$L$1:$L$997)=K$4)*('Měsíční rekapitulace'!$A$3:$A$999=$A9)*TEXT('Měsíční rekapitulace'!$Q$3:$Q$999,\"0,0;0;0;\\0\")))","v":0},{"$f":"IF($A9=\"\",,SUMPRODUCT((LOOKUP(ROW(L$1:L$997),ROW(L$1:L$997)/ISNUMBER('Měsíční rekapitulace'!$L$1:$L$997),'Měsíční rekapitulace'!$L$1:$L$997)=L$4)*('Měsíční rekapitulace'!$A$3:$A$999=$A9)*TEXT('Měsíční rekapitulace'!$Q$3:$Q$999,\"0,0;0;0;\\0\")))","v":0},{"$f":"IF($A9=\"\",,SUMPRODUCT((LOOKUP(ROW(M$1:M$997),ROW(M$1:M$997)/ISNUMBER('Měsíční rekapitulace'!$L$1:$L$997),'Měsíční rekapitulace'!$L$1:$L$997)=M$4)*('Měsíční rekapitulace'!$A$3:$A$999=$A9)*TEXT('Měsíční rekapitulace'!$Q$3:$Q$999,\"0,0;0;0;\\0\")))","v":0},{"$f":"IF($A9=\"\",,SUMPRODUCT((LOOKUP(ROW(N$1:N$997),ROW(N$1:N$997)/ISNUMBER('Měsíční rekapitulace'!$L$1:$L$997),'Měsíční rekapitulace'!$L$1:$L$997)=N$4)*('Měsíční rekapitulace'!$A$3:$A$999=$A9)*TEXT('Měsíční rekapitulace'!$Q$3:$Q$999,\"0,0;0;0;\\0\")))","v":13},{"$f":"IF($A9=\"\",,SUMPRODUCT((LOOKUP(ROW(O$1:O$997),ROW(O$1:O$997)/ISNUMBER('Měsíční rekapitulace'!$L$1:$L$997),'Měsíční rekapitulace'!$L$1:$L$997)=O$4)*('Měsíční rekapitulace'!$A$3:$A$999=$A9)*TEXT('Měsíční rekapitulace'!$Q$3:$Q$999,\"0,0;0;0;\\0\")))","v":13},27.5]
[{"$f":"IFERROR(INDEX('Měsíční rekapitulace'!A$3:A$999,SMALL(IF(('Měsíční rekapitulace'!A$3:A$999<>\"\")*('Měsíční rekapitulace'!A$3:A$999<>'Měsíční rekapitulace'!$A$2)*(COUNTIF(A$5:A9,'Měsíční rekapitulace'!A$3:A$999)=0),ROW('Měsíční rekapitulace'!A$3:A$999)-2),1)),\"\")","v":"S-2422"},{"$f":"IFERROR(INDEX('Měsíční rekapitulace'!E$3:E$999,MATCH(A10,'Měsíční rekapitulace'!A$3:A$999,)),\"\")","v":"Výměna verze wrapperu"},null,{"$f":"IF($A10=\"\",,SUMPRODUCT((LOOKUP(ROW(D$1:D$997),ROW(D$1:D$997)/ISNUMBER('Měsíční rekapitulace'!$L$1:$L$997),'Měsíční rekapitulace'!$L$1:$L$997)=D$4)*('Měsíční rekapitulace'!$A$3:$A$999=$A10)*TEXT('Měsíční rekapitulace'!$Q$3:$Q$999,\"0,0;0;0;\\0\")))","v":8},{"$f":"IF($A10=\"\",,SUMPRODUCT((LOOKUP(ROW(E$1:E$997),ROW(E$1:E$997)/ISNUMBER('Měsíční rekapitulace'!$L$1:$L$997),'Měsíční rekapitulace'!$L$1:$L$997)=E$4)*('Měsíční rekapitulace'!$A$3:$A$999=$A10)*TEXT('Měsíční rekapitulace'!$Q$3:$Q$999,\"0,0;0;0;\\0\")))","v":0},{"$f":"IF($A10=\"\",,SUMPRODUCT((LOOKUP(ROW(F$1:F$997),ROW(F$1:F$997)/ISNUMBER('Měsíční rekapitulace'!$L$1:$L$997),'Měsíční rekapitulace'!$L$1:$L$997)=F$4)*('Měsíční rekapitulace'!$A$3:$A$999=$A10)*TEXT('Měsíční rekapitulace'!$Q$3:$Q$999,\"0,0;0;0;\\0\")))","v":0},{"$f":"IF($A10=\"\",,SUMPRODUCT((LOOKUP(ROW(G$1:G$997),ROW(G$1:G$997)/ISNUMBER('Měsíční rekapitulace'!$L$1:$L$997),'Měsíční rekapitulace'!$L$1:$L$997)=G$4)*('Měsíční rekapitulace'!$A$3:$A$999=$A10)*TEXT('Měsíční rekapitulace'!$Q$3:$Q$999,\"0,0;0;0;\\0\")))","v":0},{"$f":"IF($A10=\"\",,SUMPRODUCT((LOOKUP(ROW(H$1:H$997),ROW(H$1:H$997)/ISNUMBER('Měsíční rekapitulace'!$L$1:$L$997),'Měsíční rekapitulace'!$L$1:$L$997)=H$4)*('Měsíční rekapitulace'!$A$3:$A$999=$A10)*TEXT('Měsíční rekapitulace'!$Q$3:$Q$999,\"0,0;0;0;\\0\")))","v":0},{"$f":"IF($A10=\"\",,SUMPRODUCT((LOOKUP(ROW(I$1:I$997),ROW(I$1:I$997)/ISNUMBER('Měsíční rekapitulace'!$L$1:$L$997),'Měsíční rekapitulace'!$L$1:$L$997)=I$4)*('Měsíční rekapitulace'!$A$3:$A$999=$A10)*TEXT('Měsíční rekapitulace'!$Q$3:$Q$999,\"0,0;0;0;\\0\")))","v":0},{"$f":"IF($A10=\"\",,SUMPRODUCT((LOOKUP(ROW(J$1:J$997),ROW(J$1:J$997)/ISNUMBER('Měsíční rekapitulace'!$L$1:$L$997),'Měsíční rekapitulace'!$L$1:$L$997)=J$4)*('Měsíční rekapitulace'!$A$3:$A$999=$A10)*TEXT('Měsíční rekapitulace'!$Q$3:$Q$999,\"0,0;0;0;\\0\")))","v":0},{"$f":"IF($A10=\"\",,SUMPRODUCT((LOOKUP(ROW(K$1:K$997),ROW(K$1:K$997)/ISNUMBER('Měsíční rekapitulace'!$L$1:$L$997),'Měsíční rekapitulace'!$L$1:$L$997)=K$4)*('Měsíční rekapitulace'!$A$3:$A$999=$A10)*TEXT('Měsíční rekapitulace'!$Q$3:$Q$999,\"0,0;0;0;\\0\")))","v":0},{"$f":"IF($A10=\"\",,SUMPRODUCT((LOOKUP(ROW(L$1:L$997),ROW(L$1:L$997)/ISNUMBER('Měsíční rekapitulace'!$L$1:$L$997),'Měsíční rekapitulace'!$L$1:$L$997)=L$4)*('Měsíční rekapitulace'!$A$3:$A$999=$A10)*TEXT('Měsíční rekapitulace'!$Q$3:$Q$999,\"0,0;0;0;\\0\")))","v":0},{"$f":"IF($A10=\"\",,SUMPRODUCT((LOOKUP(ROW(M$1:M$997),ROW(M$1:M$997)/ISNUMBER('Měsíční rekapitulace'!$L$1:$L$997),'Měsíční rekapitulace'!$L$1:$L$997)=M$4)*('Měsíční rekapitulace'!$A$3:$A$999=$A10)*TEXT('Měsíční rekapitulace'!$Q$3:$Q$999,\"0,0;0;0;\\0\")))","v":0},{"$f":"IF($A10=\"\",,SUMPRODUCT((LOOKUP(ROW(N$1:N$997),ROW(N$1:N$997)/ISNUMBER('Měsíční rekapitulace'!$L$1:$L$997),'Měsíční rekapitulace'!$L$1:$L$997)=N$4)*('Měsíční rekapitulace'!$A$3:$A$999=$A10)*TEXT('Měsíční rekapitulace'!$Q$3:$Q$999,\"0,0;0;0;\\0\")))","v":0},{"$f":"IF($A10=\"\",,SUMPRODUCT((LOOKUP(ROW(O$1:O$997),ROW(O$1:O$997)/ISNUMBER('Měsíční rekapitulace'!$L$1:$L$997),'Měsíční rekapitulace'!$L$1:$L$997)=O$4)*('Měsíční rekapitulace'!$A$3:$A$999=$A10)*TEXT('Měsíční rekapitulace'!$Q$3:$Q$999,\"0,0;0;0;\\0\")))","v":0},8]
[{"$f":"IFERROR(INDEX('Měsíční rekapitulace'!A$3:A$999,SMALL(IF(('Měsíční rekapitulace'!A$3:A$999<>\"\")*('Měsíční rekapitulace'!A$3:A$999<>'Měsíční rekapitulace'!$A$2)*(COUNTIF(A$5:A10,'Měsíční rekapitulace'!A$3:A$999)=0),ROW('Měsíční rekapitulace'!A$3:A$999)-2),1)),\"\")","v":"S-2508"},{"$f":"IFERROR(INDEX('Měsíční rekapitulace'!E$3:E$999,MATCH(A11,'Měsíční rekapitulace'!A$3:A$999,)),\"\")","v":"Kontrola datumu ŠU"},null,{"$f":"IF($A11=\"\",,SUMPRODUCT((LOOKUP(ROW(D$1:D$997),ROW(D$1:D$997)/ISNUMBER('Měsíční rekapitulace'!$L$1:$L$997),'Měsíční rekapitulace'!$L$1:$L$997)=D$4)*('Měsíční rekapitulace'!$A$3:$A$999=$A11)*TEXT('Měsíční rekapitulace'!$Q$3:$Q$999,\"0,0;0;0;\\0\")))","v":2},{"$f":"IF($A11=\"\",,SUMPRODUCT((LOOKUP(ROW(E$1:E$997),ROW(E$1:E$997)/ISNUMBER('Měsíční rekapitulace'!$L$1:$L$997),'Měsíční rekapitulace'!$L$1:$L$997)=E$4)*('Měsíční rekapitulace'!$A$3:$A$999=$A11)*TEXT('Měsíční rekapitulace'!$Q$3:$Q$999,\"0,0;0;0;\\0\")))","v":0},{"$f":"IF($A11=\"\",,SUMPRODUCT((LOOKUP(ROW(F$1:F$997),ROW(F$1:F$997)/ISNUMBER('Měsíční rekapitulace'!$L$1:$L$997),'Měsíční rekapitulace'!$L$1:$L$997)=F$4)*('Měsíční rekapitulace'!$A$3:$A$999=$A11)*TEXT('Měsíční rekapitulace'!$Q$3:$Q$999,\"0,0;0;0;\\0\")))","v":0},{"$f":"IF($A11=\"\",,SUMPRODUCT((LOOKUP(ROW(G$1:G$997),ROW(G$1:G$997)/ISNUMBER('Měsíční rekapitulace'!$L$1:$L$997),'Měsíční rekapitulace'!$L$1:$L$997)=G$4)*('Měsíční rekapitulace'!$A$3:$A$999=$A11)*TEXT('Měsíční rekapitulace'!$Q$3:$Q$999,\"0,0;0;0;\\0\")))","v":0},{"$f":"IF($A11=\"\",,SUMPRODUCT((LOOKUP(ROW(H$1:H$997),ROW(H$1:H$997)/ISNUMBER('Měsíční rekapitulace'!$L$1:$L$997),'Měsíční rekapitulace'!$L$1:$L$997)=H$4)*('Měsíční rekapitulace'!$A$3:$A$999=$A11)*TEXT('Měsíční rekapitulace'!$Q$3:$Q$999,\"0,0;0;0;\\0\")))","v":0},{"$f":"IF($A11=\"\",,SUMPRODUCT((LOOKUP(ROW(I$1:I$997),ROW(I$1:I$997)/ISNUMBER('Měsíční rekapitulace'!$L$1:$L$997),'Měsíční rekapitulace'!$L$1:$L$997)=I$4)*('Měsíční rekapitulace'!$A$3:$A$999=$A11)*TEXT('Měsíční rekapitulace'!$Q$3:$Q$999,\"0,0;0;0;\\0\")))","v":0},{"$f":"IF($A11=\"\",,SUMPRODUCT((LOOKUP(ROW(J$1:J$997),ROW(J$1:J$997)/ISNUMBER('Měsíční rekapitulace'!$L$1:$L$997),'Měsíční rekapitulace'!$L$1:$L$997)=J$4)*('Měsíční rekapitulace'!$A$3:$A$999=$A11)*TEXT('Měsíční rekapitulace'!$Q$3:$Q$999,\"0,0;0;0;\\0\")))","v":0},{"$f":"IF($A11=\"\",,SUMPRODUCT((LOOKUP(ROW(K$1:K$997),ROW(K$1:K$997)/ISNUMBER('Měsíční rekapitulace'!$L$1:$L$997),'Měsíční rekapitulace'!$L$1:$L$997)=K$4)*('Měsíční rekapitulace'!$A$3:$A$999=$A11)*TEXT('Měsíční rekapitulace'!$Q$3:$Q$999,\"0,0;0;0;\\0\")))","v":0},{"$f":"IF($A11=\"\",,SUMPRODUCT((LOOKUP(ROW(L$1:L$997),ROW(L$1:L$997)/ISNUMBER('Měsíční rekapitulace'!$L$1:$L$997),'Měsíční rekapitulace'!$L$1:$L$997)=L$4)*('Měsíční rekapitulace'!$A$3:$A$999=$A11)*TEXT('Měsíční rekapitulace'!$Q$3:$Q$999,\"0,0;0;0;\\0\")))","v":0},{"$f":"IF($A11=\"\",,SUMPRODUCT((LOOKUP(ROW(M$1:M$997),ROW(M$1:M$997)/ISNUMBER('Měsíční rekapitulace'!$L$1:$L$997),'Měsíční rekapitulace'!$L$1:$L$997)=M$4)*('Měsíční rekapitulace'!$A$3:$A$999=$A11)*TEXT('Měsíční rekapitulace'!$Q$3:$Q$999,\"0,0;0;0;\\0\")))","v":0},{"$f":"IF($A11=\"\",,SUMPRODUCT((LOOKUP(ROW(N$1:N$997),ROW(N$1:N$997)/ISNUMBER('Měsíční rekapitulace'!$L$1:$L$997),'Měsíční rekapitulace'!$L$1:$L$997)=N$4)*('Měsíční rekapitulace'!$A$3:$A$999=$A11)*TEXT('Měsíční rekapitulace'!$Q$3:$Q$999,\"0,0;0;0;\\0\")))","v":0},{"$f":"IF($A11=\"\",,SUMPRODUCT((LOOKUP(ROW(O$1:O$997),ROW(O$1:O$997)/ISNUMBER('Měsíční rekapitulace'!$L$1:$L$997),'Měsíční rekapitulace'!$L$1:$L$997)=O$4)*('Měsíční rekapitulace'!$A$3:$A$999=$A11)*TEXT('Měsíční rekapitulace'!$Q$3:$Q$999,\"0,0;0;0;\\0\")))","v":0},2]
[{"$f":"IFERROR(INDEX('Měsíční rekapitulace'!A$3:A$999,SMALL(IF(('Měsíční rekapitulace'!A$3:A$999<>\"\")*('Měsíční rekapitulace'!A$3:A$999<>'Měsíční rekapitulace'!$A$2)*(COUNTIF(A$5:A11,'Měsíční rekapitulace'!A$3:A$999)=0),ROW('Měsíční rekapitulace'!A$3:A$999)-2),1)),\"\")","v":"S-2546"},{"$f":"IFERROR(INDEX('Měsíční rekapitulace'!E$3:E$999,MATCH(A12,'Měsíční rekapitulace'!A$3:A$999,)),\"\")","v":"Přechod na elektronický spis"},null,{"$f":"IF($A12=\"\",,SUMPRODUCT((LOOKUP(ROW(D$1:D$997),ROW(D$1:D$997)/ISNUMBER('Měsíční rekapitulace'!$L$1:$L$997),'Měsíční rekapitulace'!$L$1:$L$997)=D$4)*('Měsíční rekapitulace'!$A$3:$A$999=$A12)*TEXT('Měsíční rekapitulace'!$Q$3:$Q$999,\"0,0;0;0;\\0\")))","v":2.5},{"$f":"IF($A12=\"\",,SUMPRODUCT((LOOKUP(ROW(E$1:E$997),ROW(E$1:E$997)/ISNUMBER('Měsíční rekapitulace'!$L$1:$L$997),'Měsíční rekapitulace'!$L$1:$L$997)=E$4)*('Měsíční rekapitulace'!$A$3:$A$999=$A12)*TEXT('Měsíční rekapitulace'!$Q$3:$Q$999,\"0,0;0;0;\\0\")))","v":21},{"$f":"IF($A12=\"\",,SUMPRODUCT((LOOKUP(ROW(F$1:F$997),ROW(F$1:F$997)/ISNUMBER('Měsíční rekapitulace'!$L$1:$L$997),'Měsíční rekapitulace'!$L$1:$L$997)=F$4)*('Měsíční rekapitulace'!$A$3:$A$999=$A12)*TEXT('Měsíční rekapitulace'!$Q$3:$Q$999,\"0,0;0;0;\\0\")))","v":0},{"$f":"IF($A12=\"\",,SUMPRODUCT((LOOKUP(ROW(G$1:G$997),ROW(G$1:G$997)/ISNUMBER('Měsíční rekapitulace'!$L$1:$L$997),'Měsíční rekapitulace'!$L$1:$L$997)=G$4)*('Měsíční rekapitulace'!$A$3:$A$999=$A12)*TEXT('Měsíční rekapitulace'!$Q$3:$Q$999,\"0,0;0;0;\\0\")))","v":0},{"$f":"IF($A12=\"\",,SUMPRODUCT((LOOKUP(ROW(H$1:H$997),ROW(H$1:H$997)/ISNUMBER('Měsíční rekapitulace'!$L$1:$L$997),'Měsíční rekapitulace'!$L$1:$L$997)=H$4)*('Měsíční rekapitulace'!$A$3:$A$999=$A12)*TEXT('Měsíční rekapitulace'!$Q$3:$Q$999,\"0,0;0;0;\\0\")))","v":0},{"$f":"IF($A12=\"\",,SUMPRODUCT((LOOKUP(ROW(I$1:I$997),ROW(I$1:I$997)/ISNUMBER('Měsíční rekapitulace'!$L$1:$L$997),'Měsíční rekapitulace'!$L$1:$L$997)=I$4)*('Měsíční rekapitulace'!$A$3:$A$999=$A12)*TEXT('Měsíční rekapitulace'!$Q$3:$Q$999,\"0,0;0;0;\\0\")))","v":0},{"$f":"IF($A12=\"\",,SUMPRODUCT((LOOKUP(ROW(J$1:J$997),ROW(J$1:J$997)/ISNUMBER('Měsíční rekapitulace'!$L$1:$L$997),'Měsíční rekapitulace'!$L$1:$L$997)=J$4)*('Měsíční rekapitulace'!$A$3:$A$999=$A12)*TEXT('Měsíční rekapitulace'!$Q$3:$Q$999,\"0,0;0;0;\\0\")))","v":0},{"$f":"IF($A12=\"\",,SUMPRODUCT((LOOKUP(ROW(K$1:K$997),ROW(K$1:K$997)/ISNUMBER('Měsíční rekapitulace'!$L$1:$L$997),'Měsíční rekapitulace'!$L$1:$L$997)=K$4)*('Měsíční rekapitulace'!$A$3:$A$999=$A12)*TEXT('Měsíční rekapitulace'!$Q$3:$Q$999,\"0,0;0;0;\\0\")))","v":0},{"$f":"IF($A12=\"\",,SUMPRODUCT((LOOKUP(ROW(L$1:L$997),ROW(L$1:L$997)/ISNUMBER('Měsíční rekapitulace'!$L$1:$L$997),'Měsíční rekapitulace'!$L$1:$L$997)=L$4)*('Měsíční rekapitulace'!$A$3:$A$999=$A12)*TEXT('Měsíční rekapitulace'!$Q$3:$Q$999,\"0,0;0;0;\\0\")))","v":0},{"$f":"IF($A12=\"\",,SUMPRODUCT((LOOKUP(ROW(M$1:M$997),ROW(M$1:M$997)/ISNUMBER('Měsíční rekapitulace'!$L$1:$L$997),'Měsíční rekapitulace'!$L$1:$L$997)=M$4)*('Měsíční rekapitulace'!$A$3:$A$999=$A12)*TEXT('Měsíční rekapitulace'!$Q$3:$Q$999,\"0,0;0;0;\\0\")))","v":0},{"$f":"IF($A12=\"\",,SUMPRODUCT((LOOKUP(ROW(N$1:N$997),ROW(N$1:N$997)/ISNUMBER('Měsíční rekapitulace'!$L$1:$L$997),'Měsíční rekapitulace'!$L$1:$L$997)=N$4)*('Měsíční rekapitulace'!$A$3:$A$999=$A12)*TEXT('Měsíční rekapitulace'!$Q$3:$Q$999,\"0,0;0;0;\\0\")))","v":0},{"$f":"IF($A12=\"\",,SUMPRODUCT((LOOKUP(ROW(O$1:O$997),ROW(O$1:O$997)/ISNUMBER('Měsíční rekapitulace'!$L$1:$L$997),'Měsíční rekapitulace'!$L$1:$L$997)=O$4)*('Měsíční rekapitulace'!$A$3:$A$999=$A12)*TEXT('Měsíční rekapitulace'!$Q$3:$Q$999,\"0,0;0;0;\\0\")))","v":0},23.5]
[{"$f":"IFERROR(INDEX('Měsíční rekapitulace'!A$3:A$999,SMALL(IF(('Měsíční rekapitulace'!A$3:A$999<>\"\")*('Měsíční rekapitulace'!A$3:A$999<>'Měsíční rekapitulace'!$A$2)*(COUNTIF(A$5:A12,'Měsíční rekapitulace'!A$3:A$999)=0),ROW('Měsíční rekapitulace'!A$3:A$999)-2),1)),\"\")","v":"S-2589"},{"$f":"IFERROR(INDEX('Měsíční rekapitulace'!E$3:E$999,MATCH(A13,'Měsíční rekapitulace'!A$3:A$999,)),\"\")","v":"P3WS - Přepočítání hodnot IC - program SPSg"},null,{"$f":"IF($A13=\"\",,SUMPRODUCT((LOOKUP(ROW(D$1:D$997),ROW(D$1:D$997)/ISNUMBER('Měsíční rekapitulace'!$L$1:$L$997),'Měsíční rekapitulace'!$L$1:$L$997)=D$4)*('Měsíční rekapitulace'!$A$3:$A$999=$A13)*TEXT('Měsíční rekapitulace'!$Q$3:$Q$999,\"0,0;0;0;\\0\")))","v":30},{"$f":"IF($A13=\"\",,SUMPRODUCT((LOOKUP(ROW(E$1:E$997),ROW(E$1:E$997)/ISNUMBER('Měsíční rekapitulace'!$L$1:$L$997),'Měsíční rekapitulace'!$L$1:$L$997)=E$4)*('Měsíční rekapitulace'!$A$3:$A$999=$A13)*TEXT('Měsíční rekapitulace'!$Q$3:$Q$999,\"0,0;0;0;\\0\")))","v":0},{"$f":"IF($A13=\"\",,SUMPRODUCT((LOOKUP(ROW(F$1:F$997),ROW(F$1:F$997)/ISNUMBER('Měsíční rekapitulace'!$L$1:$L$997),'Měsíční rekapitulace'!$L$1:$L$997)=F$4)*('Měsíční rekapitulace'!$A$3:$A$999=$A13)*TEXT('Měsíční rekapitulace'!$Q$3:$Q$999,\"0,0;0;0;\\0\")))","v":0},{"$f":"IF($A13=\"\",,SUMPRODUCT((LOOKUP(ROW(G$1:G$997),ROW(G$1:G$997)/ISNUMBER('Měsíční rekapitulace'!$L$1:$L$997),'Měsíční rekapitulace'!$L$1:$L$997)=G$4)*('Měsíční rekapitulace'!$A$3:$A$999=$A13)*TEXT('Měsíční rekapitulace'!$Q$3:$Q$999,\"0,0;0;0;\\0\")))","v":0},{"$f":"IF($A13=\"\",,SUMPRODUCT((LOOKUP(ROW(H$1:H$997),ROW(H$1:H$997)/ISNUMBER('Měsíční rekapitulace'!$L$1:$L$997),'Měsíční rekapitulace'!$L$1:$L$997)=H$4)*('Měsíční rekapitulace'!$A$3:$A$999=$A13)*TEXT('Měsíční rekapitulace'!$Q$3:$Q$999,\"0,0;0;0;\\0\")))","v":0},{"$f":"IF($A13=\"\",,SUMPRODUCT((LOOKUP(ROW(I$1:I$997),ROW(I$1:I$997)/ISNUMBER('Měsíční rekapitulace'!$L$1:$L$997),'Měsíční rekapitulace'!$L$1:$L$997)=I$4)*('Měsíční rekapitulace'!$A$3:$A$999=$A13)*TEXT('Měsíční rekapitulace'!$Q$3:$Q$999,\"0,0;0;0;\\0\")))","v":0},{"$f":"IF($A13=\"\",,SUMPRODUCT((LOOKUP(ROW(J$1:J$997),ROW(J$1:J$997)/ISNUMBER('Měsíční rekapitulace'!$L$1:$L$997),'Měsíční rekapitulace'!$L$1:$L$997)=J$4)*('Měsíční rekapitulace'!$A$3:$A$999=$A13)*TEXT('Měsíční rekapitulace'!$Q$3:$Q$999,\"0,0;0;0;\\0\")))","v":0},{"$f":"IF($A13=\"\",,SUMPRODUCT((LOOKUP(ROW(K$1:K$997),ROW(K$1:K$997)/ISNUMBER('Měsíční rekapitulace'!$L$1:$L$997),'Měsíční rekapitulace'!$L$1:$L$997)=K$4)*('Měsíční rekapitulace'!$A$3:$A$999=$A13)*TEXT('Měsíční rekapitulace'!$Q$3:$Q$999,\"0,0;0;0;\\0\")))","v":0},{"$f":"IF($A13=\"\",,SUMPRODUCT((LOOKUP(ROW(L$1:L$997),ROW(L$1:L$997)/ISNUMBER('Měsíční rekapitulace'!$L$1:$L$997),'Měsíční rekapitulace'!$L$1:$L$997)=L$4)*('Měsíční rekapitulace'!$A$3:$A$999=$A13)*TEXT('Měsíční rekapitulace'!$Q$3:$Q$999,\"0,0;0;0;\\0\")))","v":0},{"$f":"IF($A13=\"\",,SUMPRODUCT((LOOKUP(ROW(M$1:M$997),ROW(M$1:M$997)/ISNUMBER('Měsíční rekapitulace'!$L$1:$L$997),'Měsíční rekapitulace'!$L$1:$L$997)=M$4)*('Měsíční rekapitulace'!$A$3:$A$999=$A13)*TEXT('Měsíční rekapitulace'!$Q$3:$Q$999,\"0,0;0;0;\\0\")))","v":0},{"$f":"IF($A13=\"\",,SUMPRODUCT((LOOKUP(ROW(N$1:N$997),ROW(N$1:N$997)/ISNUMBER('Měsíční rekapitulace'!$L$1:$L$997),'Měsíční rekapitulace'!$L$1:$L$997)=N$4)*('Měsíční rekapitulace'!$A$3:$A$999=$A13)*TEXT('Měsíční rekapitulace'!$Q$3:$Q$999,\"0,0;0;0;\\0\")))","v":0},{"$f":"IF($A13=\"\",,SUMPRODUCT((LOOKUP(ROW(O$1:O$997),ROW(O$1:O$997)/ISNUMBER('Měsíční rekapitulace'!$L$1:$L$997),'Měsíční rekapitulace'!$L$1:$L$997)=O$4)*('Měsíční rekapitulace'!$A$3:$A$999=$A13)*TEXT('Měsíční rekapitulace'!$Q$3:$Q$999,\"0,0;0;0;\\0\")))","v":0},30]
[{"$f":"IFERROR(INDEX('Měsíční rekapitulace'!A$3:A$999,SMALL(IF(('Měsíční rekapitulace'!A$3:A$999<>\"\")*('Měsíční rekapitulace'!A$3:A$999<>'Měsíční rekapitulace'!$A$2)*(COUNTIF(A$5:A13,'Měsíční rekapitulace'!A$3:A$999)=0),ROW('Měsíční rekapitulace'!A$3:A$999)-2),1)),\"\")","v":"S-1787"},{"$f":"IFERROR(INDEX('Měsíční rekapitulace'!E$3:E$999,MATCH(A14,'Měsíční rekapitulace'!A$3:A$999,)),\"\")","v":"Automatické zasílání mailu"},null,{"$f":"IF($A14=\"\",,SUMPRODUCT((LOOKUP(ROW(D$1:D$997),ROW(D$1:D$997)/ISNUMBER('Měsíční rekapitulace'!$L$1:$L$997),'Měsíční rekapitulace'!$L$1:$L$997)=D$4)*('Měsíční rekapitulace'!$A$3:$A$999=$A14)*TEXT('Měsíční rekapitulace'!$Q$3:$Q$999,\"0,0;0;0;\\0\")))","v":0},{"$f":"IF($A14=\"\",,SUMPRODUCT((LOOKUP(ROW(E$1:E$997),ROW(E$1:E$997)/ISNUMBER('Měsíční rekapitulace'!$L$1:$L$997),'Měsíční rekapitulace'!$L$1:$L$997)=E$4)*('Měsíční rekapitulace'!$A$3:$A$999=$A14)*TEXT('Měsíční rekapitulace'!$Q$3:$Q$999,\"0,0;0;0;\\0\")))","v":2},{"$f":"IF($A14=\"\",,SUMPRODUCT((LOOKUP(ROW(F$1:F$997),ROW(F$1:F$997)/ISNUMBER('Měsíční rekapitulace'!$L$1:$L$997),'Měsíční rekapitulace'!$L$1:$L$997)=F$4)*('Měsíční rekapitulace'!$A$3:$A$999=$A14)*TEXT('Měsíční rekapitulace'!$Q$3:$Q$999,\"0,0;0;0;\\0\")))","v":0},{"$f":"IF($A14=\"\",,SUMPRODUCT((LOOKUP(ROW(G$1:G$997),ROW(G$1:G$997)/ISNUMBER('Měsíční rekapitulace'!$L$1:$L$997),'Měsíční rekapitulace'!$L$1:$L$997)=G$4)*('Měsíční rekapitulace'!$A$3:$A$999=$A14)*TEXT('Měsíční rekapitulace'!$Q$3:$Q$999,\"0,0;0;0;\\0\")))","v":3},{"$f":"IF($A14=\"\",,SUMPRODUCT((LOOKUP(ROW(H$1:H$997),ROW(H$1:H$997)/ISNUMBER('Měsíční rekapitulace'!$L$1:$L$997),'Měsíční rekapitulace'!$L$1:$L$997)=H$4)*('Měsíční rekapitulace'!$A$3:$A$999=$A14)*TEXT('Měsíční rekapitulace'!$Q$3:$Q$999,\"0,0;0;0;\\0\")))","v":0},{"$f":"IF($A14=\"\",,SUMPRODUCT((LOOKUP(ROW(I$1:I$997),ROW(I$1:I$997)/ISNUMBER('Měsíční rekapitulace'!$L$1:$L$997),'Měsíční rekapitulace'!$L$1:$L$997)=I$4)*('Měsíční rekapitulace'!$A$3:$A$999=$A14)*TEXT('Měsíční rekapitulace'!$Q$3:$Q$999,\"0,0;0;0;\\0\")))","v":0},{"$f":"IF($A14=\"\",,SUMPRODUCT((LOOKUP(ROW(J$1:J$997),ROW(J$1:J$997)/ISNUMBER('Měsíční rekapitulace'!$L$1:$L$997),'Měsíční rekapitulace'!$L$1:$L$997)=J$4)*('Měsíční rekapitulace'!$A$3:$A$999=$A14)*TEXT('Měsíční rekapitulace'!$Q$3:$Q$999,\"0,0;0;0;\\0\")))","v":0},{"$f":"IF($A14=\"\",,SUMPRODUCT((LOOKUP(ROW(K$1:K$997),ROW(K$1:K$997)/ISNUMBER('Měsíční rekapitulace'!$L$1:$L$997),'Měsíční rekapitulace'!$L$1:$L$997)=K$4)*('Měsíční rekapitulace'!$A$3:$A$999=$A14)*TEXT('Měsíční rekapitulace'!$Q$3:$Q$999,\"0,0;0;0;\\0\")))","v":0},{"$f":"IF($A14=\"\",,SUMPRODUCT((LOOKUP(ROW(L$1:L$997),ROW(L$1:L$997)/ISNUMBER('Měsíční rekapitulace'!$L$1:$L$997),'Měsíční rekapitulace'!$L$1:$L$997)=L$4)*('Měsíční rekapitulace'!$A$3:$A$999=$A14)*TEXT('Měsíční rekapitulace'!$Q$3:$Q$999,\"0,0;0;0;\\0\")))","v":0},{"$f":"IF($A14=\"\",,SUMPRODUCT((LOOKUP(ROW(M$1:M$997),ROW(M$1:M$997)/ISNUMBER('Měsíční rekapitulace'!$L$1:$L$997),'Měsíční rekapitulace'!$L$1:$L$997)=M$4)*('Měsíční rekapitulace'!$A$3:$A$999=$A14)*TEXT('Měsíční rekapitulace'!$Q$3:$Q$999,\"0,0;0;0;\\0\")))","v":0},{"$f":"IF($A14=\"\",,SUMPRODUCT((LOOKUP(ROW(N$1:N$997),ROW(N$1:N$997)/ISNUMBER('Měsíční rekapitulace'!$L$1:$L$997),'Měsíční rekapitulace'!$L$1:$L$997)=N$4)*('Měsíční rekapitulace'!$A$3:$A$999=$A14)*TEXT('Měsíční rekapitulace'!$Q$3:$Q$999,\"0,0;0;0;\\0\")))","v":0},{"$f":"IF($A14=\"\",,SUMPRODUCT((LOOKUP(ROW(O$1:O$997),ROW(O$1:O$997)/ISNUMBER('Měsíční rekapitulace'!$L$1:$L$997),'Měsíční rekapitulace'!$L$1:$L$997)=O$4)*('Měsíční rekapitulace'!$A$3:$A$999=$A14)*TEXT('Měsíční rekapitulace'!$Q$3:$Q$999,\"0,0;0;0;\\0\")))","v":0},5]
[{"$f":"IFERROR(INDEX('Měsíční rekapitulace'!A$3:A$999,SMALL(IF(('Měsíční rekapitulace'!A$3:A$999<>\"\")*('Měsíční rekapitulace'!A$3:A$999<>'Měsíční rekapitulace'!$A$2)*(COUNTIF(A$5:A14,'Měsíční rekapitulace'!A$3:A$999)=0),ROW('Měsíční rekapitulace'!A$3:A$999)-2),1)),\"\")","v":"S-2414"},{"$f":"IFERROR(INDEX('Měsíční rekapitulace'!E$3:E$999,MATCH(A15,'Měsíční rekapitulace'!A$3:A$999,)),\"\")","v":"Změna logování a uvolňování paměti webových aplikací"},null,{"$f":"IF($A15=\"\",,SUMPRODUCT((LOOKUP(ROW(D$1:D$997),ROW(D$1:D$997)/ISNUMBER('Měsíční rekapitulace'!$L$1:$L$997),'Měsíční rekapitulace'!$L$1:$L$997)=D$4)*('Měsíční rekapitulace'!$A$3:$A$999=$A15)*TEXT('Měsíční rekapitulace'!$Q$3:$Q$999,\"0,0;0;0;\\0\")))","v":0},{"$f":"IF($A15=\"\",,SUMPRODUCT((LOOKUP(ROW(E$1:E$997),ROW(E$1:E$997)/ISNUMBER('Měsíční rekapitulace'!$L$1:$L$997),'Měsíční rekapitulace'!$L$1:$L$997)=E$4)*('Měsíční rekapitulace'!$A$3:$A$999=$A15)*TEXT('Měsíční rekapitulace'!$Q$3:$Q$999,\"0,0;0;0;\\0\")))","v":16},{"$f":"IF($A15=\"\",,SUMPRODUCT((LOOKUP(ROW(F$1:F$997),ROW(F$1:F$997)/ISNUMBER('Měsíční rekapitulace'!$L$1:$L$997),'Měsíční rekapitulace'!$L$1:$L$997)=F$4)*('Měsíční rekapitulace'!$A$3:$A$999=$A15)*TEXT('Měsíční rekapitulace'!$Q$3:$Q$999,\"0,0;0;0;\\0\")))","v":22.5},{"$f":"IF($A15=\"\",,SUMPRODUCT((LOOKUP(ROW(G$1:G$997),ROW(G$1:G$997)/ISNUMBER('Měsíční rekapitulace'!$L$1:$L$997),'Měsíční rekapitulace'!$L$1:$L$997)=G$4)*('Měsíční rekapitulace'!$A$3:$A$999=$A15)*TEXT('Měsíční rekapitulace'!$Q$3:$Q$999,\"0,0;0;0;\\0\")))","v":0},{"$f":"IF($A15=\"\",,SUMPRODUCT((LOOKUP(ROW(H$1:H$997),ROW(H$1:H$997)/ISNUMBER('Měsíční rekapitulace'!$L$1:$L$997),'Měsíční rekapitulace'!$L$1:$L$997)=H$4)*('Měsíční rekapitulace'!$A$3:$A$999=$A15)*TEXT('Měsíční rekapitulace'!$Q$3:$Q$999,\"0,0;0;0;\\0\")))","v":0},{"$f":"IF($A15=\"\",,SUMPRODUCT((LOOKUP(ROW(I$1:I$997),ROW(I$1:I$997)/ISNUMBER('Měsíční rekapitulace'!$L$1:$L$997),'Měsíční rekapitulace'!$L$1:$L$997)=I$4)*('Měsíční rekapitulace'!$A$3:$A$999=$A15)*TEXT('Měsíční rekapitulace'!$Q$3:$Q$999,\"0,0;0;0;\\0\")))","v":0},{"$f":"IF($A15=\"\",,SUMPRODUCT((LOOKUP(ROW(J$1:J$997),ROW(J$1:J$997)/ISNUMBER('Měsíční rekapitulace'!$L$1:$L$997),'Měsíční rekapitulace'!$L$1:$L$997)=J$4)*('Měsíční rekapitulace'!$A$3:$A$999=$A15)*TEXT('Měsíční rekapitulace'!$Q$3:$Q$999,\"0,0;0;0;\\0\")))","v":0},{"$f":"IF($A15=\"\",,SUMPRODUCT((LOOKUP(ROW(K$1:K$997),ROW(K$1:K$997)/ISNUMBER('Měsíční rekapitulace'!$L$1:$L$997),'Měsíční rekapitulace'!$L$1:$L$997)=K$4)*('Měsíční rekapitulace'!$A$3:$A$999=$A15)*TEXT('Měsíční rekapitulace'!$Q$3:$Q$999,\"0,0;0;0;\\0\")))","v":0},{"$f":"IF($A15=\"\",,SUMPRODUCT((LOOKUP(ROW(L$1:L$997),ROW(L$1:L$997)/ISNUMBER('Měsíční rekapitulace'!$L$1:$L$997),'Měsíční rekapitulace'!$L$1:$L$997)=L$4)*('Měsíční rekapitulace'!$A$3:$A$999=$A15)*TEXT('Měsíční rekapitulace'!$Q$3:$Q$999,\"0,0;0;0;\\0\")))","v":0},{"$f":"IF($A15=\"\",,SUMPRODUCT((LOOKUP(ROW(M$1:M$997),ROW(M$1:M$997)/ISNUMBER('Měsíční rekapitulace'!$L$1:$L$997),'Měsíční rekapitulace'!$L$1:$L$997)=M$4)*('Měsíční rekapitulace'!$A$3:$A$999=$A15)*TEXT('Měsíční rekapitulace'!$Q$3:$Q$999,\"0,0;0;0;\\0\")))","v":0},{"$f":"IF($A15=\"\",,SUMPRODUCT((LOOKUP(ROW(N$1:N$997),ROW(N$1:N$997)/ISNUMBER('Měsíční rekapitulace'!$L$1:$L$997),'Měsíční rekapitulace'!$L$1:$L$997)=N$4)*('Měsíční rekapitulace'!$A$3:$A$999=$A15)*TEXT('Měsíční rekapitulace'!$Q$3:$Q$999,\"0,0;0;0;\\0\")))","v":0},{"$f":"IF($A15=\"\",,SUMPRODUCT((LOOKUP(ROW(O$1:O$997),ROW(O$1:O$997)/ISNUMBER('Měsíční rekapitulace'!$L$1:$L$997),'Měsíční rekapitulace'!$L$1:$L$997)=O$4)*('Měsíční rekapitulace'!$A$3:$A$999=$A15)*TEXT('Měsíční rekapitulace'!$Q$3:$Q$999,\"0,0;0;0;\\0\")))","v":0},38.5]
[{"$f":"IFERROR(INDEX('Měsíční rekapitulace'!A$3:A$999,SMALL(IF(('Měsíční rekapitulace'!A$3:A$999<>\"\")*('Měsíční rekapitulace'!A$3:A$999<>'Měsíční rekapitulace'!$A$2)*(COUNTIF(A$5:A15,'Měsíční rekapitulace'!A$3:A$999)=0),ROW('Měsíční rekapitulace'!A$3:A$999)-2),1)),\"\")","v":"S-2561"},{"$f":"IFERROR(INDEX('Měsíční rekapitulace'!E$3:E$999,MATCH(A16,'Měsíční rekapitulace'!A$3:A$999,)),\"\")","v":"SALIPU nárok, který je v uzavřeném delegačním procesu"},null,{"$f":"IF($A16=\"\",,SUMPRODUCT((LOOKUP(ROW(D$1:D$997),ROW(D$1:D$997)/ISNUMBER('Měsíční rekapitulace'!$L$1:$L$997),'Měsíční rekapitulace'!$L$1:$L$997)=D$4)*('Měsíční rekapitulace'!$A$3:$A$999=$A16)*TEXT('Měsíční rekapitulace'!$Q$3:$Q$999,\"0,0;0;0;\\0\")))","v":0},{"$f":"IF($A16=\"\",,SUMPRODUCT((LOOKUP(ROW(E$1:E$997),ROW(E$1:E$997)/ISNUMBER('Měsíční rekapitulace'!$L$1:$L$997),'Měsíční rekapitulace'!$L$1:$L$997)=E$4)*('Měsíční rekapitulace'!$A$3:$A$999=$A16)*TEXT('Měsíční rekapitulace'!$Q$3:$Q$999,\"0,0;0;0;\\0\")))","v":1},{"$f":"IF($A16=\"\",,SUMPRODUCT((LOOKUP(ROW(F$1:F$997),ROW(F$1:F$997)/ISNUMBER('Měsíční rekapitulace'!$L$1:$L$997),'Měsíční rekapitulace'!$L$1:$L$997)=F$4)*('Měsíční rekapitulace'!$A$3:$A$999=$A16)*TEXT('Měsíční rekapitulace'!$Q$3:$Q$999,\"0,0;0;0;\\0\")))","v":11.5},{"$f":"IF($A16=\"\",,SUMPRODUCT((LOOKUP(ROW(G$1:G$997),ROW(G$1:G$997)/ISNUMBER('Měsíční rekapitulace'!$L$1:$L$997),'Měsíční rekapitulace'!$L$1:$L$997)=G$4)*('Měsíční rekapitulace'!$A$3:$A$999=$A16)*TEXT('Měsíční rekapitulace'!$Q$3:$Q$999,\"0,0;0;0;\\0\")))","v":0},{"$f":"IF($A16=\"\",,SUMPRODUCT((LOOKUP(ROW(H$1:H$997),ROW(H$1:H$997)/ISNUMBER('Měsíční rekapitulace'!$L$1:$L$997),'Měsíční rekapitulace'!$L$1:$L$997)=H$4)*('Měsíční rekapitulace'!$A$3:$A$999=$A16)*TEXT('Měsíční rekapitulace'!$Q$3:$Q$999,\"0,0;0;0;\\0\")))","v":0},{"$f":"IF($A16=\"\",,SUMPRODUCT((LOOKUP(ROW(I$1:I$997),ROW(I$1:I$997)/ISNUMBER('Měsíční rekapitulace'!$L$1:$L$997),'Měsíční rekapitulace'!$L$1:$L$997)=I$4)*('Měsíční rekapitulace'!$A$3:$A$999=$A16)*TEXT('Měsíční rekapitulace'!$Q$3:$Q$999,\"0,0;0;0;\\0\")))","v":0},{"$f":"IF($A16=\"\",,SUMPRODUCT((LOOKUP(ROW(J$1:J$997),ROW(J$1:J$997)/ISNUMBER('Měsíční rekapitulace'!$L$1:$L$997),'Měsíční rekapitulace'!$L$1:$L$997)=J$4)*('Měsíční rekapitulace'!$A$3:$A$999=$A16)*TEXT('Měsíční rekapitulace'!$Q$3:$Q$999,\"0,0;0;0;\\0\")))","v":0},{"$f":"IF($A16=\"\",,SUMPRODUCT((LOOKUP(ROW(K$1:K$997),ROW(K$1:K$997)/ISNUMBER('Měsíční rekapitulace'!$L$1:$L$997),'Měsíční rekapitulace'!$L$1:$L$997)=K$4)*('Měsíční rekapitulace'!$A$3:$A$999=$A16)*TEXT('Měsíční rekapitulace'!$Q$3:$Q$999,\"0,0;0;0;\\0\")))","v":0},{"$f":"IF($A16=\"\",,SUMPRODUCT((LOOKUP(ROW(L$1:L$997),ROW(L$1:L$997)/ISNUMBER('Měsíční rekapitulace'!$L$1:$L$997),'Měsíční rekapitulace'!$L$1:$L$997)=L$4)*('Měsíční rekapitulace'!$A$3:$A$999=$A16)*TEXT('Měsíční rekapitulace'!$Q$3:$Q$999,\"0,0;0;0;\\0\")))","v":0},{"$f":"IF($A16=\"\",,SUMPRODUCT((LOOKUP(ROW(M$1:M$997),ROW(M$1:M$997)/ISNUMBER('Měsíční rekapitulace'!$L$1:$L$997),'Měsíční rekapitulace'!$L$1:$L$997)=M$4)*('Měsíční rekapitulace'!$A$3:$A$999=$A16)*TEXT('Měsíční rekapitulace'!$Q$3:$Q$999,\"0,0;0;0;\\0\")))","v":0},{"$f":"IF($A16=\"\",,SUMPRODUCT((LOOKUP(ROW(N$1:N$997),ROW(N$1:N$997)/ISNUMBER('Měsíční rekapitulace'!$L$1:$L$997),'Měsíční rekapitulace'!$L$1:$L$997)=N$4)*('Měsíční rekapitulace'!$A$3:$A$999=$A16)*TEXT('Měsíční rekapitulace'!$Q$3:$Q$999,\"0,0;0;0;\\0\")))","v":0},{"$f":"IF($A16=\"\",,SUMPRODUCT((LOOKUP(ROW(O$1:O$997),ROW(O$1:O$997)/ISNUMBER('Měsíční rekapitulace'!$L$1:$L$997),'Měsíční rekapitulace'!$L$1:$L$997)=O$4)*('Měsíční rekapitulace'!$A$3:$A$999=$A16)*TEXT('Měsíční rekapitulace'!$Q$3:$Q$999,\"0,0;0;0;\\0\")))","v":0},12.5]
[{"$f":"IFERROR(INDEX('Měsíční rekapitulace'!A$3:A$999,SMALL(IF(('Měsíční rekapitulace'!A$3:A$999<>\"\")*('Měsíční rekapitulace'!A$3:A$999<>'Měsíční rekapitulace'!$A$2)*(COUNTIF(A$5:A16,'Měsíční rekapitulace'!A$3:A$999)=0),ROW('Měsíční rekapitulace'!A$3:A$999)-2),1)),\"\")","v":"S-2682"},{"$f":"IFERROR(INDEX('Měsíční rekapitulace'!E$3:E$999,MATCH(A17,'Měsíční rekapitulace'!A$3:A$999,)),\"\")","v":"P3WS - školení nastavování parametrů"},null,{"$f":"IF($A17=\"\",,SUMPRODUCT((LOOKUP(ROW(D$1:D$997),ROW(D$1:D$997)/ISNUMBER('Měsíční rekapitulace'!$L$1:$L$997),'Měsíční rekapitulace'!$L$1:$L$997)=D$4)*('Měsíční rekapitulace'!$A$3:$A$999=$A17)*TEXT('Měsíční rekapitulace'!$Q$3:$Q$999,\"0,0;0;0;\\0\")))","v":0},{"$f":"IF($A17=\"\",,SUMPRODUCT((LOOKUP(ROW(E$1:E$997),ROW(E$1:E$997)/ISNUMBER('Měsíční rekapitulace'!$L$1:$L$997),'Měsíční rekapitulace'!$L$1:$L$997)=E$4)*('Měsíční rekapitulace'!$A$3:$A$999=$A17)*TEXT('Měsíční rekapitulace'!$Q$3:$Q$999,\"0,0;0;0;\\0\")))","v":16.5},{"$f":"IF($A17=\"\",,SUMPRODUCT((LOOKUP(ROW(F$1:F$997),ROW(F$1:F$997)/ISNUMBER('Měsíční rekapitulace'!$L$1:$L$997),'Měsíční rekapitulace'!$L$1:$L$997)=F$4)*('Měsíční rekapitulace'!$A$3:$A$999=$A17)*TEXT('Měsíční rekapitulace'!$Q$3:$Q$999,\"0,0;0;0;\\0\")))","v":0},{"$f":"IF($A17=\"\",,SUMPRODUCT((LOOKUP(ROW(G$1:G$997),ROW(G$1:G$997)/ISNUMBER('Měsíční rekapitulace'!$L$1:$L$997),'Měsíční rekapitulace'!$L$1:$L$997)=G$4)*('Měsíční rekapitulace'!$A$3:$A$999=$A17)*TEXT('Měsíční rekapitulace'!$Q$3:$Q$999,\"0,0;0;0;\\0\")))","v":0},{"$f":"IF($A17=\"\",,SUMPRODUCT((LOOKUP(ROW(H$1:H$997),ROW(H$1:H$997)/ISNUMBER('Měsíční rekapitulace'!$L$1:$L$997),'Měsíční rekapitulace'!$L$1:$L$997)=H$4)*('Měsíční rekapitulace'!$A$3:$A$999=$A17)*TEXT('Měsíční rekapitulace'!$Q$3:$Q$999,\"0,0;0;0;\\0\")))","v":0},{"$f":"IF($A17=\"\",,SUMPRODUCT((LOOKUP(ROW(I$1:I$997),ROW(I$1:I$997)/ISNUMBER('Měsíční rekapitulace'!$L$1:$L$997),'Měsíční rekapitulace'!$L$1:$L$997)=I$4)*('Měsíční rekapitulace'!$A$3:$A$999=$A17)*TEXT('Měsíční rekapitulace'!$Q$3:$Q$999,\"0,0;0;0;\\0\")))","v":0},{"$f":"IF($A17=\"\",,SUMPRODUCT((LOOKUP(ROW(J$1:J$997),ROW(J$1:J$997)/ISNUMBER('Měsíční rekapitulace'!$L$1:$L$997),'Měsíční rekapitulace'!$L$1:$L$997)=J$4)*('Měsíční rekapitulace'!$A$3:$A$999=$A17)*TEXT('Měsíční rekapitulace'!$Q$3:$Q$999,\"0,0;0;0;\\0\")))","v":0},{"$f":"IF($A17=\"\",,SUMPRODUCT((LOOKUP(ROW(K$1:K$997),ROW(K$1:K$997)/ISNUMBER('Měsíční rekapitulace'!$L$1:$L$997),'Měsíční rekapitulace'!$L$1:$L$997)=K$4)*('Měsíční rekapitulace'!$A$3:$A$999=$A17)*TEXT('Měsíční rekapitulace'!$Q$3:$Q$999,\"0,0;0;0;\\0\")))","v":0},{"$f":"IF($A17=\"\",,SUMPRODUCT((LOOKUP(ROW(L$1:L$997),ROW(L$1:L$997)/ISNUMBER('Měsíční rekapitulace'!$L$1:$L$997),'Měsíční rekapitulace'!$L$1:$L$997)=L$4)*('Měsíční rekapitulace'!$A$3:$A$999=$A17)*TEXT('Měsíční rekapitulace'!$Q$3:$Q$999,\"0,0;0;0;\\0\")))","v":0},{"$f":"IF($A17=\"\",,SUMPRODUCT((LOOKUP(ROW(M$1:M$997),ROW(M$1:M$997)/ISNUMBER('Měsíční rekapitulace'!$L$1:$L$997),'Měsíční rekapitulace'!$L$1:$L$997)=M$4)*('Měsíční rekapitulace'!$A$3:$A$999=$A17)*TEXT('Měsíční rekapitulace'!$Q$3:$Q$999,\"0,0;0;0;\\0\")))","v":0},{"$f":"IF($A17=\"\",,SUMPRODUCT((LOOKUP(ROW(N$1:N$997),ROW(N$1:N$997)/ISNUMBER('Měsíční rekapitulace'!$L$1:$L$997),'Měsíční rekapitulace'!$L$1:$L$997)=N$4)*('Měsíční rekapitulace'!$A$3:$A$999=$A17)*TEXT('Měsíční rekapitulace'!$Q$3:$Q$999,\"0,0;0;0;\\0\")))","v":0},{"$f":"IF($A17=\"\",,SUMPRODUCT((LOOKUP(ROW(O$1:O$997),ROW(O$1:O$997)/ISNUMBER('Měsíční rekapitulace'!$L$1:$L$997),'Měsíční rekapitulace'!$L$1:$L$997)=O$4)*('Měsíční rekapitulace'!$A$3:$A$999=$A17)*TEXT('Měsíční rekapitulace'!$Q$3:$Q$999,\"0,0;0;0;\\0\")))","v":0},16.5]
[{"$f":"IFERROR(INDEX('Měsíční rekapitulace'!A$3:A$999,SMALL(IF(('Měsíční rekapitulace'!A$3:A$999<>\"\")*('Měsíční rekapitulace'!A$3:A$999<>'Měsíční rekapitulace'!$A$2)*(COUNTIF(A$5:A17,'Měsíční rekapitulace'!A$3:A$999)=0),ROW('Měsíční rekapitulace'!A$3:A$999)-2),1)),\"\")","v":"S-2683"},{"$f":"IFERROR(INDEX('Měsíční rekapitulace'!E$3:E$999,MATCH(A18,'Měsíční rekapitulace'!A$3:A$999,)),\"\")","v":"Změna algoritmu ACM pro interní aplikace"},null,{"$f":"IF($A18=\"\",,SUMPRODUCT((LOOKUP(ROW(D$1:D$997),ROW(D$1:D$997)/ISNUMBER('Měsíční rekapitulace'!$L$1:$L$997),'Měsíční rekapitulace'!$L$1:$L$997)=D$4)*('Měsíční rekapitulace'!$A$3:$A$999=$A18)*TEXT('Měsíční rekapitulace'!$Q$3:$Q$999,\"0,0;0;0;\\0\")))","v":0},{"$f":"IF($A18=\"\",,SUMPRODUCT((LOOKUP(ROW(E$1:E$997),ROW(E$1:E$997)/ISNUMBER('Měsíční rekapitulace'!$L$1:$L$997),'Měsíční rekapitulace'!$L$1:$L$997)=E$4)*('Měsíční rekapitulace'!$A$3:$A$999=$A18)*TEXT('Měsíční rekapitulace'!$Q$3:$Q$999,\"0,0;0;0;\\0\")))","v":6},{"$f":"IF($A18=\"\",,SUMPRODUCT((LOOKUP(ROW(F$1:F$997),ROW(F$1:F$997)/ISNUMBER('Měsíční rekapitulace'!$L$1:$L$997),'Měsíční rekapitulace'!$L$1:$L$997)=F$4)*('Měsíční rekapitulace'!$A$3:$A$999=$A18)*TEXT('Měsíční rekapitulace'!$Q$3:$Q$999,\"0,0;0;0;\\0\")))","v":12},{"$f":"IF($A18=\"\",,SUMPRODUCT((LOOKUP(ROW(G$1:G$997),ROW(G$1:G$997)/ISNUMBER('Měsíční rekapitulace'!$L$1:$L$997),'Měsíční rekapitulace'!$L$1:$L$997)=G$4)*('Měsíční rekapitulace'!$A$3:$A$999=$A18)*TEXT('Měsíční rekapitulace'!$Q$3:$Q$999,\"0,0;0;0;\\0\")))","v":0},{"$f":"IF($A18=\"\",,SUMPRODUCT((LOOKUP(ROW(H$1:H$997),ROW(H$1:H$997)/ISNUMBER('Měsíční rekapitulace'!$L$1:$L$997),'Měsíční rekapitulace'!$L$1:$L$997)=H$4)*('Měsíční rekapitulace'!$A$3:$A$999=$A18)*TEXT('Měsíční rekapitulace'!$Q$3:$Q$999,\"0,0;0;0;\\0\")))","v":0},{"$f":"IF($A18=\"\",,SUMPRODUCT((LOOKUP(ROW(I$1:I$997),ROW(I$1:I$997)/ISNUMBER('Měsíční rekapitulace'!$L$1:$L$997),'Měsíční rekapitulace'!$L$1:$L$997)=I$4)*('Měsíční rekapitulace'!$A$3:$A$999=$A18)*TEXT('Měsíční rekapitulace'!$Q$3:$Q$999,\"0,0;0;0;\\0\")))","v":0},{"$f":"IF($A18=\"\",,SUMPRODUCT((LOOKUP(ROW(J$1:J$997),ROW(J$1:J$997)/ISNUMBER('Měsíční rekapitulace'!$L$1:$L$997),'Měsíční rekapitulace'!$L$1:$L$997)=J$4)*('Měsíční rekapitulace'!$A$3:$A$999=$A18)*TEXT('Měsíční rekapitulace'!$Q$3:$Q$999,\"0,0;0;0;\\0\")))","v":0},{"$f":"IF($A18=\"\",,SUMPRODUCT((LOOKUP(ROW(K$1:K$997),ROW(K$1:K$997)/ISNUMBER('Měsíční rekapitulace'!$L$1:$L$997),'Měsíční rekapitulace'!$L$1:$L$997)=K$4)*('Měsíční rekapitulace'!$A$3:$A$999=$A18)*TEXT('Měsíční rekapitulace'!$Q$3:$Q$999,\"0,0;0;0;\\0\")))","v":0},{"$f":"IF($A18=\"\",,SUMPRODUCT((LOOKUP(ROW(L$1:L$997),ROW(L$1:L$997)/ISNUMBER('Měsíční rekapitulace'!$L$1:$L$997),'Měsíční rekapitulace'!$L$1:$L$997)=L$4)*('Měsíční rekapitulace'!$A$3:$A$999=$A18)*TEXT('Měsíční rekapitulace'!$Q$3:$Q$999,\"0,0;0;0;\\0\")))","v":0},{"$f":"IF($A18=\"\",,SUMPRODUCT((LOOKUP(ROW(M$1:M$997),ROW(M$1:M$997)/ISNUMBER('Měsíční rekapitulace'!$L$1:$L$997),'Měsíční rekapitulace'!$L$1:$L$997)=M$4)*('Měsíční rekapitulace'!$A$3:$A$999=$A18)*TEXT('Měsíční rekapitulace'!$Q$3:$Q$999,\"0,0;0;0;\\0\")))","v":0},{"$f":"IF($A18=\"\",,SUMPRODUCT((LOOKUP(ROW(N$1:N$997),ROW(N$1:N$997)/ISNUMBER('Měsíční rekapitulace'!$L$1:$L$997),'Měsíční rekapitulace'!$L$1:$L$997)=N$4)*('Měsíční rekapitulace'!$A$3:$A$999=$A18)*TEXT('Měsíční rekapitulace'!$Q$3:$Q$999,\"0,0;0;0;\\0\")))","v":0},{"$f":"IF($A18=\"\",,SUMPRODUCT((LOOKUP(ROW(O$1:O$997),ROW(O$1:O$997)/ISNUMBER('Měsíční rekapitulace'!$L$1:$L$997),'Měsíční rekapitulace'!$L$1:$L$997)=O$4)*('Měsíční rekapitulace'!$A$3:$A$999=$A18)*TEXT('Měsíční rekapitulace'!$Q$3:$Q$999,\"0,0;0;0;\\0\")))","v":0},18]
[{"$f":"IFERROR(INDEX('Měsíční rekapitulace'!A$3:A$999,SMALL(IF(('Měsíční rekapitulace'!A$3:A$999<>\"\")*('Měsíční rekapitulace'!A$3:A$999<>'Měsíční rekapitulace'!$A$2)*(COUNTIF(A$5:A18,'Měsíční rekapitulace'!A$3:A$999)=0),ROW('Měsíční rekapitulace'!A$3:A$999)-2),1)),\"\")","v":"S-2437"},{"$f":"IFERROR(INDEX('Měsíční rekapitulace'!E$3:E$999,MATCH(A19,'Měsíční rekapitulace'!A$3:A$999,)),\"\")","v":"Úprava automatického uzavírání ŠU po revizi posledního závazku"},null,{"$f":"IF($A19=\"\",,SUMPRODUCT((LOOKUP(ROW(D$1:D$997),ROW(D$1:D$997)/ISNUMBER('Měsíční rekapitulace'!$L$1:$L$997),'Měsíční rekapitulace'!$L$1:$L$997)=D$4)*('Měsíční rekapitulace'!$A$3:$A$999=$A19)*TEXT('Měsíční rekapitulace'!$Q$3:$Q$999,\"0,0;0;0;\\0\")))","v":0},{"$f":"IF($A19=\"\",,SUMPRODUCT((LOOKUP(ROW(E$1:E$997),ROW(E$1:E$997)/ISNUMBER('Měsíční rekapitulace'!$L$1:$L$997),'Měsíční rekapitulace'!$L$1:$L$997)=E$4)*('Měsíční rekapitulace'!$A$3:$A$999=$A19)*TEXT('Měsíční rekapitulace'!$Q$3:$Q$999,\"0,0;0;0;\\0\")))","v":0},{"$f":"IF($A19=\"\",,SUMPRODUCT((LOOKUP(ROW(F$1:F$997),ROW(F$1:F$997)/ISNUMBER('Měsíční rekapitulace'!$L$1:$L$997),'Měsíční rekapitulace'!$L$1:$L$997)=F$4)*('Měsíční rekapitulace'!$A$3:$A$999=$A19)*TEXT('Měsíční rekapitulace'!$Q$3:$Q$999,\"0,0;0;0;\\0\")))","v":19},{"$f":"IF($A19=\"\",,SUMPRODUCT((LOOKUP(ROW(G$1:G$997),ROW(G$1:G$997)/ISNUMBER('Měsíční rekapitulace'!$L$1:$L$997),'Měsíční rekapitulace'!$L$1:$L$997)=G$4)*('Měsíční rekapitulace'!$A$3:$A$999=$A19)*TEXT('Měsíční rekapitulace'!$Q$3:$Q$999,\"0,0;0;0;\\0\")))","v":7},{"$f":"IF($A19=\"\",,SUMPRODUCT((LOOKUP(ROW(H$1:H$997),ROW(H$1:H$997)/ISNUMBER('Měsíční rekapitulace'!$L$1:$L$997),'Měsíční rekapitulace'!$L$1:$L$997)=H$4)*('Měsíční rekapitulace'!$A$3:$A$999=$A19)*TEXT('Měsíční rekapitulace'!$Q$3:$Q$999,\"0,0;0;0;\\0\")))","v":0},{"$f":"IF($A19=\"\",,SUMPRODUCT((LOOKUP(ROW(I$1:I$997),ROW(I$1:I$997)/ISNUMBER('Měsíční rekapitulace'!$L$1:$L$997),'Měsíční rekapitulace'!$L$1:$L$997)=I$4)*('Měsíční rekapitulace'!$A$3:$A$999=$A19)*TEXT('Měsíční rekapitulace'!$Q$3:$Q$999,\"0,0;0;0;\\0\")))","v":0},{"$f":"IF($A19=\"\",,SUMPRODUCT((LOOKUP(ROW(J$1:J$997),ROW(J$1:J$997)/ISNUMBER('Měsíční rekapitulace'!$L$1:$L$997),'Měsíční rekapitulace'!$L$1:$L$997)=J$4)*('Měsíční rekapitulace'!$A$3:$A$999=$A19)*TEXT('Měsíční rekapitulace'!$Q$3:$Q$999,\"0,0;0;0;\\0\")))","v":0},{"$f":"IF($A19=\"\",,SUMPRODUCT((LOOKUP(ROW(K$1:K$997),ROW(K$1:K$997)/ISNUMBER('Měsíční rekapitulace'!$L$1:$L$997),'Měsíční rekapitulace'!$L$1:$L$997)=K$4)*('Měsíční rekapitulace'!$A$3:$A$999=$A19)*TEXT('Měsíční rekapitulace'!$Q$3:$Q$999,\"0,0;0;0;\\0\")))","v":0},{"$f":"IF($A19=\"\",,SUMPRODUCT((LOOKUP(ROW(L$1:L$997),ROW(L$1:L$997)/ISNUMBER('Měsíční rekapitulace'!$L$1:$L$997),'Měsíční rekapitulace'!$L$1:$L$997)=L$4)*('Měsíční rekapitulace'!$A$3:$A$999=$A19)*TEXT('Měsíční rekapitulace'!$Q$3:$Q$999,\"0,0;0;0;\\0\")))","v":0},{"$f":"IF($A19=\"\",,SUMPRODUCT((LOOKUP(ROW(M$1:M$997),ROW(M$1:M$997)/ISNUMBER('Měsíční rekapitulace'!$L$1:$L$997),'Měsíční rekapitulace'!$L$1:$L$997)=M$4)*('Měsíční rekapitulace'!$A$3:$A$999=$A19)*TEXT('Měsíční rekapitulace'!$Q$3:$Q$999,\"0,0;0;0;\\0\")))","v":0},{"$f":"IF($A19=\"\",,SUMPRODUCT((LOOKUP(ROW(N$1:N$997),ROW(N$1:N$997)/ISNUMBER('Měsíční rekapitulace'!$L$1:$L$997),'Měsíční rekapitulace'!$L$1:$L$997)=N$4)*('Měsíční rekapitulace'!$A$3:$A$999=$A19)*TEXT('Měsíční rekapitulace'!$Q$3:$Q$999,\"0,0;0;0;\\0\")))","v":0},{"$f":"IF($A19=\"\",,SUMPRODUCT((LOOKUP(ROW(O$1:O$997),ROW(O$1:O$997)/ISNUMBER('Měsíční rekapitulace'!$L$1:$L$997),'Měsíční rekapitulace'!$L$1:$L$997)=O$4)*('Měsíční rekapitulace'!$A$3:$A$999=$A19)*TEXT('Měsíční rekapitulace'!$Q$3:$Q$999,\"0,0;0;0;\\0\")))","v":0},26]
[{"$f":"IFERROR(INDEX('Měsíční rekapitulace'!A$3:A$999,SMALL(IF(('Měsíční rekapitulace'!A$3:A$999<>\"\")*('Měsíční rekapitulace'!A$3:A$999<>'Měsíční rekapitulace'!$A$2)*(COUNTIF(A$5:A19,'Měsíční rekapitulace'!A$3:A$999)=0),ROW('Měsíční rekapitulace'!A$3:A$999)-2),1)),\"\")","v":"S-2628"},{"$f":"IFERROR(INDEX('Měsíční rekapitulace'!E$3:E$999,MATCH(A20,'Měsíční rekapitulace'!A$3:A$999,)),\"\")","v":"Vyjmutí číselníku partnerů z metadat"},null,{"$f":"IF($A20=\"\",,SUMPRODUCT((LOOKUP(ROW(D$1:D$997),ROW(D$1:D$997)/ISNUMBER('Měsíční rekapitulace'!$L$1:$L$997),'Měsíční rekapitulace'!$L$1:$L$997)=D$4)*('Měsíční rekapitulace'!$A$3:$A$999=$A20)*TEXT('Měsíční rekapitulace'!$Q$3:$Q$999,\"0,0;0;0;\\0\")))","v":0},{"$f":"IF($A20=\"\",,SUMPRODUCT((LOOKUP(ROW(E$1:E$997),ROW(E$1:E$997)/ISNUMBER('Měsíční rekapitulace'!$L$1:$L$997),'Měsíční rekapitulace'!$L$1:$L$997)=E$4)*('Měsíční rekapitulace'!$A$3:$A$999=$A20)*TEXT('Měsíční rekapitulace'!$Q$3:$Q$999,\"0,0;0;0;\\0\")))","v":0},{"$f":"IF($A20=\"\",,SUMPRODUCT((LOOKUP(ROW(F$1:F$997),ROW(F$1:F$997)/ISNUMBER('Měsíční rekapitulace'!$L$1:$L$997),'Měsíční rekapitulace'!$L$1:$L$997)=F$4)*('Měsíční rekapitulace'!$A$3:$A$999=$A20)*TEXT('Měsíční rekapitulace'!$Q$3:$Q$999,\"0,0;0;0;\\0\")))","v":6},{"$f":"IF($A20=\"\",,SUMPRODUCT((LOOKUP(ROW(G$1:G$997),ROW(G$1:G$997)/ISNUMBER('Měsíční rekapitulace'!$L$1:$L$997),'Měsíční rekapitulace'!$L$1:$L$997)=G$4)*('Měsíční rekapitulace'!$A$3:$A$999=$A20)*TEXT('Měsíční rekapitulace'!$Q$3:$Q$999,\"0,0;0;0;\\0\")))","v":85.5},{"$f":"IF($A20=\"\",,SUMPRODUCT((LOOKUP(ROW(H$1:H$997),ROW(H$1:H$997)/ISNUMBER('Měsíční rekapitulace'!$L$1:$L$997),'Měsíční rekapitulace'!$L$1:$L$997)=H$4)*('Měsíční rekapitulace'!$A$3:$A$999=$A20)*TEXT('Měsíční rekapitulace'!$Q$3:$Q$999,\"0,0;0;0;\\0\")))","v":0},{"$f":"IF($A20=\"\",,SUMPRODUCT((LOOKUP(ROW(I$1:I$997),ROW(I$1:I$997)/ISNUMBER('Měsíční rekapitulace'!$L$1:$L$997),'Měsíční rekapitulace'!$L$1:$L$997)=I$4)*('Měsíční rekapitulace'!$A$3:$A$999=$A20)*TEXT('Měsíční rekapitulace'!$Q$3:$Q$999,\"0,0;0;0;\\0\")))","v":0},{"$f":"IF($A20=\"\",,SUMPRODUCT((LOOKUP(ROW(J$1:J$997),ROW(J$1:J$997)/ISNUMBER('Měsíční rekapitulace'!$L$1:$L$997),'Měsíční rekapitulace'!$L$1:$L$997)=J$4)*('Měsíční rekapitulace'!$A$3:$A$999=$A20)*TEXT('Měsíční rekapitulace'!$Q$3:$Q$999,\"0,0;0;0;\\0\")))","v":0},{"$f":"IF($A20=\"\",,SUMPRODUCT((LOOKUP(ROW(K$1:K$997),ROW(K$1:K$997)/ISNUMBER('Měsíční rekapitulace'!$L$1:$L$997),'Měsíční rekapitulace'!$L$1:$L$997)=K$4)*('Měsíční rekapitulace'!$A$3:$A$999=$A20)*TEXT('Měsíční rekapitulace'!$Q$3:$Q$999,\"0,0;0;0;\\0\")))","v":0},{"$f":"IF($A20=\"\",,SUMPRODUCT((LOOKUP(ROW(L$1:L$997),ROW(L$1:L$997)/ISNUMBER('Měsíční rekapitulace'!$L$1:$L$997),'Měsíční rekapitulace'!$L$1:$L$997)=L$4)*('Měsíční rekapitulace'!$A$3:$A$999=$A20)*TEXT('Měsíční rekapitulace'!$Q$3:$Q$999,\"0,0;0;0;\\0\")))","v":0},{"$f":"IF($A20=\"\",,SUMPRODUCT((LOOKUP(ROW(M$1:M$997),ROW(M$1:M$997)/ISNUMBER('Měsíční rekapitulace'!$L$1:$L$997),'Měsíční rekapitulace'!$L$1:$L$997)=M$4)*('Měsíční rekapitulace'!$A$3:$A$999=$A20)*TEXT('Měsíční rekapitulace'!$Q$3:$Q$999,\"0,0;0;0;\\0\")))","v":0},{"$f":"IF($A20=\"\",,SUMPRODUCT((LOOKUP(ROW(N$1:N$997),ROW(N$1:N$997)/ISNUMBER('Měsíční rekapitulace'!$L$1:$L$997),'Měsíční rekapitulace'!$L$1:$L$997)=N$4)*('Měsíční rekapitulace'!$A$3:$A$999=$A20)*TEXT('Měsíční rekapitulace'!$Q$3:$Q$999,\"0,0;0;0;\\0\")))","v":0},{"$f":"IF($A20=\"\",,SUMPRODUCT((LOOKUP(ROW(O$1:O$997),ROW(O$1:O$997)/ISNUMBER('Měsíční rekapitulace'!$L$1:$L$997),'Měsíční rekapitulace'!$L$1:$L$997)=O$4)*('Měsíční rekapitulace'!$A$3:$A$999=$A20)*TEXT('Měsíční rekapitulace'!$Q$3:$Q$999,\"0,0;0;0;\\0\")))","v":0},91.5]
[{"$f":"IFERROR(INDEX('Měsíční rekapitulace'!A$3:A$999,SMALL(IF(('Měsíční rekapitulace'!A$3:A$999<>\"\")*('Měsíční rekapitulace'!A$3:A$999<>'Měsíční rekapitulace'!$A$2)*(COUNTIF(A$5:A20,'Měsíční rekapitulace'!A$3:A$999)=0),ROW('Měsíční rekapitulace'!A$3:A$999)-2),1)),\"\")","v":"S-1868"},{"$f":"IFERROR(INDEX('Měsíční rekapitulace'!E$3:E$999,MATCH(A21,'Měsíční rekapitulace'!A$3:A$999,)),\"\")","v":"Doplnění údajů předávaných Policií ČR do ČKP v rámci Relace DN"},null,{"$f":"IF($A21=\"\",,SUMPRODUCT((LOOKUP(ROW(D$1:D$997),ROW(D$1:D$997)/ISNUMBER('Měsíční rekapitulace'!$L$1:$L$997),'Měsíční rekapitulace'!$L$1:$L$997)=D$4)*('Měsíční rekapitulace'!$A$3:$A$999=$A21)*TEXT('Měsíční rekapitulace'!$Q$3:$Q$999,\"0,0;0;0;\\0\")))","v":0},{"$f":"IF($A21=\"\",,SUMPRODUCT((LOOKUP(ROW(E$1:E$997),ROW(E$1:E$997)/ISNUMBER('Měsíční rekapitulace'!$L$1:$L$997),'Měsíční rekapitulace'!$L$1:$L$997)=E$4)*('Měsíční rekapitulace'!$A$3:$A$999=$A21)*TEXT('Měsíční rekapitulace'!$Q$3:$Q$999,\"0,0;0;0;\\0\")))","v":0},{"$f":"IF($A21=\"\",,SUMPRODUCT((LOOKUP(ROW(F$1:F$997),ROW(F$1:F$997)/ISNUMBER('Měsíční rekapitulace'!$L$1:$L$997),'Měsíční rekapitulace'!$L$1:$L$997)=F$4)*('Měsíční rekapitulace'!$A$3:$A$999=$A21)*TEXT('Měsíční rekapitulace'!$Q$3:$Q$999,\"0,0;0;0;\\0\")))","v":0},{"$f":"IF($A21=\"\",,SUMPRODUCT((LOOKUP(ROW(G$1:G$997),ROW(G$1:G$997)/ISNUMBER('Měsíční rekapitulace'!$L$1:$L$997),'Měsíční rekapitulace'!$L$1:$L$997)=G$4)*('Měsíční rekapitulace'!$A$3:$A$999=$A21)*TEXT('Měsíční rekapitulace'!$Q$3:$Q$999,\"0,0;0;0;\\0\")))","v":92},{"$f":"IF($A21=\"\",,SUMPRODUCT((LOOKUP(ROW(H$1:H$997),ROW(H$1:H$997)/ISNUMBER('Měsíční rekapitulace'!$L$1:$L$997),'Měsíční rekapitulace'!$L$1:$L$997)=H$4)*('Měsíční rekapitulace'!$A$3:$A$999=$A21)*TEXT('Měsíční rekapitulace'!$Q$3:$Q$999,\"0,0;0;0;\\0\")))","v":0},{"$f":"IF($A21=\"\",,SUMPRODUCT((LOOKUP(ROW(I$1:I$997),ROW(I$1:I$997)/ISNUMBER('Měsíční rekapitulace'!$L$1:$L$997),'Měsíční rekapitulace'!$L$1:$L$997)=I$4)*('Měsíční rekapitulace'!$A$3:$A$999=$A21)*TEXT('Měsíční rekapitulace'!$Q$3:$Q$999,\"0,0;0;0;\\0\")))","v":0},{"$f":"IF($A21=\"\",,SUMPRODUCT((LOOKUP(ROW(J$1:J$997),ROW(J$1:J$997)/ISNUMBER('Měsíční rekapitulace'!$L$1:$L$997),'Měsíční rekapitulace'!$L$1:$L$997)=J$4)*('Měsíční rekapitulace'!$A$3:$A$999=$A21)*TEXT('Měsíční rekapitulace'!$Q$3:$Q$999,\"0,0;0;0;\\0\")))","v":0},{"$f":"IF($A21=\"\",,SUMPRODUCT((LOOKUP(ROW(K$1:K$997),ROW(K$1:K$997)/ISNUMBER('Měsíční rekapitulace'!$L$1:$L$997),'Měsíční rekapitulace'!$L$1:$L$997)=K$4)*('Měsíční rekapitulace'!$A$3:$A$999=$A21)*TEXT('Měsíční rekapitulace'!$Q$3:$Q$999,\"0,0;0;0;\\0\")))","v":0},{"$f":"IF($A21=\"\",,SUMPRODUCT((LOOKUP(ROW(L$1:L$997),ROW(L$1:L$997)/ISNUMBER('Měsíční rekapitulace'!$L$1:$L$997),'Měsíční rekapitulace'!$L$1:$L$997)=L$4)*('Měsíční rekapitulace'!$A$3:$A$999=$A21)*TEXT('Měsíční rekapitulace'!$Q$3:$Q$999,\"0,0;0;0;\\0\")))","v":0},{"$f":"IF($A21=\"\",,SUMPRODUCT((LOOKUP(ROW(M$1:M$997),ROW(M$1:M$997)/ISNUMBER('Měsíční rekapitulace'!$L$1:$L$997),'Měsíční rekapitulace'!$L$1:$L$997)=M$4)*('Měsíční rekapitulace'!$A$3:$A$999=$A21)*TEXT('Měsíční rekapitulace'!$Q$3:$Q$999,\"0,0;0;0;\\0\")))","v":0},{"$f":"IF($A21=\"\",,SUMPRODUCT((LOOKUP(ROW(N$1:N$997),ROW(N$1:N$997)/ISNUMBER('Měsíční rekapitulace'!$L$1:$L$997),'Měsíční rekapitulace'!$L$1:$L$997)=N$4)*('Měsíční rekapitulace'!$A$3:$A$999=$A21)*TEXT('Měsíční rekapitulace'!$Q$3:$Q$999,\"0,0;0;0;\\0\")))","v":0},{"$f":"IF($A21=\"\",,SUMPRODUCT((LOOKUP(ROW(O$1:O$997),ROW(O$1:O$997)/ISNUMBER('Měsíční rekapitulace'!$L$1:$L$997),'Měsíční rekapitulace'!$L$1:$L$997)=O$4)*('Měsíční rekapitulace'!$A$3:$A$999=$A21)*TEXT('Měsíční rekapitulace'!$Q$3:$Q$999,\"0,0;0;0;\\0\")))","v":0},92]
[{"$f":"IFERROR(INDEX('Měsíční rekapitulace'!A$3:A$999,SMALL(IF(('Měsíční rekapitulace'!A$3:A$999<>\"\")*('Měsíční rekapitulace'!A$3:A$999<>'Měsíční rekapitulace'!$A$2)*(COUNTIF(A$5:A21,'Měsíční rekapitulace'!A$3:A$999)=0),ROW('Měsíční rekapitulace'!A$3:A$999)-2),1)),\"\")","v":"S-2685"},{"$f":"IFERROR(INDEX('Měsíční rekapitulace'!E$3:E$999,MATCH(A22,'Měsíční rekapitulace'!A$3:A$999,)),\"\")","v":"Rozšíření definice podtypů škody „ Totální škoda vozidla“"},null,{"$f":"IF($A22=\"\",,SUMPRODUCT((LOOKUP(ROW(D$1:D$997),ROW(D$1:D$997)/ISNUMBER('Měsíční rekapitulace'!$L$1:$L$997),'Měsíční rekapitulace'!$L$1:$L$997)=D$4)*('Měsíční rekapitulace'!$A$3:$A$999=$A22)*TEXT('Měsíční rekapitulace'!$Q$3:$Q$999,\"0,0;0;0;\\0\")))","v":0},{"$f":"IF($A22=\"\",,SUMPRODUCT((LOOKUP(ROW(E$1:E$997),ROW(E$1:E$997)/ISNUMBER('Měsíční rekapitulace'!$L$1:$L$997),'Měsíční rekapitulace'!$L$1:$L$997)=E$4)*('Měsíční rekapitulace'!$A$3:$A$999=$A22)*TEXT('Měsíční rekapitulace'!$Q$3:$Q$999,\"0,0;0;0;\\0\")))","v":0},{"$f":"IF($A22=\"\",,SUMPRODUCT((LOOKUP(ROW(F$1:F$997),ROW(F$1:F$997)/ISNUMBER('Měsíční rekapitulace'!$L$1:$L$997),'Měsíční rekapitulace'!$L$1:$L$997)=F$4)*('Měsíční rekapitulace'!$A$3:$A$999=$A22)*TEXT('Měsíční rekapitulace'!$Q$3:$Q$999,\"0,0;0;0;\\0\")))","v":0},{"$f":"IF($A22=\"\",,SUMPRODUCT((LOOKUP(ROW(G$1:G$997),ROW(G$1:G$997)/ISNUMBER('Měsíční rekapitulace'!$L$1:$L$997),'Měsíční rekapitulace'!$L$1:$L$997)=G$4)*('Měsíční rekapitulace'!$A$3:$A$999=$A22)*TEXT('Měsíční rekapitulace'!$Q$3:$Q$999,\"0,0;0;0;\\0\")))","v":6},{"$f":"IF($A22=\"\",,SUMPRODUCT((LOOKUP(ROW(H$1:H$997),ROW(H$1:H$997)/ISNUMBER('Měsíční rekapitulace'!$L$1:$L$997),'Měsíční rekapitulace'!$L$1:$L$997)=H$4)*('Měsíční rekapitulace'!$A$3:$A$999=$A22)*TEXT('Měsíční rekapitulace'!$Q$3:$Q$999,\"0,0;0;0;\\0\")))","v":0},{"$f":"IF($A22=\"\",,SUMPRODUCT((LOOKUP(ROW(I$1:I$997),ROW(I$1:I$997)/ISNUMBER('Měsíční rekapitulace'!$L$1:$L$997),'Měsíční rekapitulace'!$L$1:$L$997)=I$4)*('Měsíční rekapitulace'!$A$3:$A$999=$A22)*TEXT('Měsíční rekapitulace'!$Q$3:$Q$999,\"0,0;0;0;\\0\")))","v":0},{"$f":"IF($A22=\"\",,SUMPRODUCT((LOOKUP(ROW(J$1:J$997),ROW(J$1:J$997)/ISNUMBER('Měsíční rekapitulace'!$L$1:$L$997),'Měsíční rekapitulace'!$L$1:$L$997)=J$4)*('Měsíční rekapitulace'!$A$3:$A$999=$A22)*TEXT('Měsíční rekapitulace'!$Q$3:$Q$999,\"0,0;0;0;\\0\")))","v":0},{"$f":"IF($A22=\"\",,SUMPRODUCT((LOOKUP(ROW(K$1:K$997),ROW(K$1:K$997)/ISNUMBER('Měsíční rekapitulace'!$L$1:$L$997),'Měsíční rekapitulace'!$L$1:$L$997)=K$4)*('Měsíční rekapitulace'!$A$3:$A$999=$A22)*TEXT('Měsíční rekapitulace'!$Q$3:$Q$999,\"0,0;0;0;\\0\")))","v":0},{"$f":"IF($A22=\"\",,SUMPRODUCT((LOOKUP(ROW(L$1:L$997),ROW(L$1:L$997)/ISNUMBER('Měsíční rekapitulace'!$L$1:$L$997),'Měsíční rekapitulace'!$L$1:$L$997)=L$4)*('Měsíční rekapitulace'!$A$3:$A$999=$A22)*TEXT('Měsíční rekapitulace'!$Q$3:$Q$999,\"0,0;0;0;\\0\")))","v":0},{"$f":"IF($A22=\"\",,SUMPRODUCT((LOOKUP(ROW(M$1:M$997),ROW(M$1:M$997)/ISNUMBER('Měsíční rekapitulace'!$L$1:$L$997),'Měsíční rekapitulace'!$L$1:$L$997)=M$4)*('Měsíční rekapitulace'!$A$3:$A$999=$A22)*TEXT('Měsíční rekapitulace'!$Q$3:$Q$999,\"0,0;0;0;\\0\")))","v":0},{"$f":"IF($A22=\"\",,SUMPRODUCT((LOOKUP(ROW(N$1:N$997),ROW(N$1:N$997)/ISNUMBER('Měsíční rekapitulace'!$L$1:$L$997),'Měsíční rekapitulace'!$L$1:$L$997)=N$4)*('Měsíční rekapitulace'!$A$3:$A$999=$A22)*TEXT('Měsíční rekapitulace'!$Q$3:$Q$999,\"0,0;0;0;\\0\")))","v":0},{"$f":"IF($A22=\"\",,SUMPRODUCT((LOOKUP(ROW(O$1:O$997),ROW(O$1:O$997)/ISNUMBER('Měsíční rekapitulace'!$L$1:$L$997),'Měsíční rekapitulace'!$L$1:$L$997)=O$4)*('Měsíční rekapitulace'!$A$3:$A$999=$A22)*TEXT('Měsíční rekapitulace'!$Q$3:$Q$999,\"0,0;0;0;\\0\")))","v":0},6]
[{"$f":"IFERROR(INDEX('Měsíční rekapitulace'!A$3:A$999,SMALL(IF(('Měsíční rekapitulace'!A$3:A$999<>\"\")*('Měsíční rekapitulace'!A$3:A$999<>'Měsíční rekapitulace'!$A$2)*(COUNTIF(A$5:A22,'Měsíční rekapitulace'!A$3:A$999)=0),ROW('Měsíční rekapitulace'!A$3:A$999)-2),1)),\"\")","v":"S-2695"},{"$f":"IFERROR(INDEX('Měsíční rekapitulace'!E$3:E$999,MATCH(A23,'Měsíční rekapitulace'!A$3:A$999,)),\"\")","v":"Úprava chování metody B1 -  Get_NositelAgr"},null,{"$f":"IF($A23=\"\",,SUMPRODUCT((LOOKUP(ROW(D$1:D$997),ROW(D$1:D$997)/ISNUMBER('Měsíční rekapitulace'!$L$1:$L$997),'Měsíční rekapitulace'!$L$1:$L$997)=D$4)*('Měsíční rekapitulace'!$A$3:$A$999=$A23)*TEXT('Měsíční rekapitulace'!$Q$3:$Q$999,\"0,0;0;0;\\0\")))","v":0},{"$f":"IF($A23=\"\",,SUMPRODUCT((LOOKUP(ROW(E$1:E$997),ROW(E$1:E$997)/ISNUMBER('Měsíční rekapitulace'!$L$1:$L$997),'Měsíční rekapitulace'!$L$1:$L$997)=E$4)*('Měsíční rekapitulace'!$A$3:$A$999=$A23)*TEXT('Měsíční rekapitulace'!$Q$3:$Q$999,\"0,0;0;0;\\0\")))","v":0},{"$f":"IF($A23=\"\",,SUMPRODUCT((LOOKUP(ROW(F$1:F$997),ROW(F$1:F$997)/ISNUMBER('Měsíční rekapitulace'!$L$1:$L$997),'Měsíční rekapitulace'!$L$1:$L$997)=F$4)*('Měsíční rekapitulace'!$A$3:$A$999=$A23)*TEXT('Měsíční rekapitulace'!$Q$3:$Q$999,\"0,0;0;0;\\0\")))","v":0},{"$f":"IF($A23=\"\",,SUMPRODUCT((LOOKUP(ROW(G$1:G$997),ROW(G$1:G$997)/ISNUMBER('Měsíční rekapitulace'!$L$1:$L$997),'Měsíční rekapitulace'!$L$1:$L$997)=G$4)*('Měsíční rekapitulace'!$A$3:$A$999=$A23)*TEXT('Měsíční rekapitulace'!$Q$3:$Q$999,\"0,0;0;0;\\0\")))","v":49.5},{"$f":"IF($A23=\"\",,SUMPRODUCT((LOOKUP(ROW(H$1:H$997),ROW(H$1:H$997)/ISNUMBER('Měsíční rekapitulace'!$L$1:$L$997),'Měsíční rekapitulace'!$L$1:$L$997)=H$4)*('Měsíční rekapitulace'!$A$3:$A$999=$A23)*TEXT('Měsíční rekapitulace'!$Q$3:$Q$999,\"0,0;0;0;\\0\")))","v":0},{"$f":"IF($A23=\"\",,SUMPRODUCT((LOOKUP(ROW(I$1:I$997),ROW(I$1:I$997)/ISNUMBER('Měsíční rekapitulace'!$L$1:$L$997),'Měsíční rekapitulace'!$L$1:$L$997)=I$4)*('Měsíční rekapitulace'!$A$3:$A$999=$A23)*TEXT('Měsíční rekapitulace'!$Q$3:$Q$999,\"0,0;0;0;\\0\")))","v":0},{"$f":"IF($A23=\"\",,SUMPRODUCT((LOOKUP(ROW(J$1:J$997),ROW(J$1:J$997)/ISNUMBER('Měsíční rekapitulace'!$L$1:$L$997),'Měsíční rekapitulace'!$L$1:$L$997)=J$4)*('Měsíční rekapitulace'!$A$3:$A$999=$A23)*TEXT('Měsíční rekapitulace'!$Q$3:$Q$999,\"0,0;0;0;\\0\")))","v":0},{"$f":"IF($A23=\"\",,SUMPRODUCT((LOOKUP(ROW(K$1:K$997),ROW(K$1:K$997)/ISNUMBER('Měsíční rekapitulace'!$L$1:$L$997),'Měsíční rekapitulace'!$L$1:$L$997)=K$4)*('Měsíční rekapitulace'!$A$3:$A$999=$A23)*TEXT('Měsíční rekapitulace'!$Q$3:$Q$999,\"0,0;0;0;\\0\")))","v":0},{"$f":"IF($A23=\"\",,SUMPRODUCT((LOOKUP(ROW(L$1:L$997),ROW(L$1:L$997)/ISNUMBER('Měsíční rekapitulace'!$L$1:$L$997),'Měsíční rekapitulace'!$L$1:$L$997)=L$4)*('Měsíční rekapitulace'!$A$3:$A$999=$A23)*TEXT('Měsíční rekapitulace'!$Q$3:$Q$999,\"0,0;0;0;\\0\")))","v":0},{"$f":"IF($A23=\"\",,SUMPRODUCT((LOOKUP(ROW(M$1:M$997),ROW(M$1:M$997)/ISNUMBER('Měsíční rekapitulace'!$L$1:$L$997),'Měsíční rekapitulace'!$L$1:$L$997)=M$4)*('Měsíční rekapitulace'!$A$3:$A$999=$A23)*TEXT('Měsíční rekapitulace'!$Q$3:$Q$999,\"0,0;0;0;\\0\")))","v":0},{"$f":"IF($A23=\"\",,SUMPRODUCT((LOOKUP(ROW(N$1:N$997),ROW(N$1:N$997)/ISNUMBER('Měsíční rekapitulace'!$L$1:$L$997),'Měsíční rekapitulace'!$L$1:$L$997)=N$4)*('Měsíční rekapitulace'!$A$3:$A$999=$A23)*TEXT('Měsíční rekapitulace'!$Q$3:$Q$999,\"0,0;0;0;\\0\")))","v":0},{"$f":"IF($A23=\"\",,SUMPRODUCT((LOOKUP(ROW(O$1:O$997),ROW(O$1:O$997)/ISNUMBER('Měsíční rekapitulace'!$L$1:$L$997),'Měsíční rekapitulace'!$L$1:$L$997)=O$4)*('Měsíční rekapitulace'!$A$3:$A$999=$A23)*TEXT('Měsíční rekapitulace'!$Q$3:$Q$999,\"0,0;0;0;\\0\")))","v":0},49.5]
[{"$f":"IFERROR(INDEX('Měsíční rekapitulace'!A$3:A$999,SMALL(IF(('Měsíční rekapitulace'!A$3:A$999<>\"\")*('Měsíční rekapitulace'!A$3:A$999<>'Měsíční rekapitulace'!$A$2)*(COUNTIF(A$5:A23,'Měsíční rekapitulace'!A$3:A$999)=0),ROW('Měsíční rekapitulace'!A$3:A$999)-2),1)),\"\")","v":"S-1403"},{"$f":"IFERROR(INDEX('Měsíční rekapitulace'!E$3:E$999,MATCH(A24,'Měsíční rekapitulace'!A$3:A$999,)),\"\")","v":"Připomínky z bezpečnostních testů WS B3 a L5"},null,{"$f":"IF($A24=\"\",,SUMPRODUCT((LOOKUP(ROW(D$1:D$997),ROW(D$1:D$997)/ISNUMBER('Měsíční rekapitulace'!$L$1:$L$997),'Měsíční rekapitulace'!$L$1:$L$997)=D$4)*('Měsíční rekapitulace'!$A$3:$A$999=$A24)*TEXT('Měsíční rekapitulace'!$Q$3:$Q$999,\"0,0;0;0;\\0\")))","v":0},{"$f":"IF($A24=\"\",,SUMPRODUCT((LOOKUP(ROW(E$1:E$997),ROW(E$1:E$997)/ISNUMBER('Měsíční rekapitulace'!$L$1:$L$997),'Měsíční rekapitulace'!$L$1:$L$997)=E$4)*('Měsíční rekapitulace'!$A$3:$A$999=$A24)*TEXT('Měsíční rekapitulace'!$Q$3:$Q$999,\"0,0;0;0;\\0\")))","v":0},{"$f":"IF($A24=\"\",,SUMPRODUCT((LOOKUP(ROW(F$1:F$997),ROW(F$1:F$997)/ISNUMBER('Měsíční rekapitulace'!$L$1:$L$997),'Měsíční rekapitulace'!$L$1:$L$997)=F$4)*('Měsíční rekapitulace'!$A$3:$A$999=$A24)*TEXT('Měsíční rekapitulace'!$Q$3:$Q$999,\"0,0;0;0;\\0\")))","v":0},{"$f":"IF($A24=\"\",,SUMPRODUCT((LOOKUP(ROW(G$1:G$997),ROW(G$1:G$997)/ISNUMBER('Měsíční rekapitulace'!$L$1:$L$997),'Měsíční rekapitulace'!$L$1:$L$997)=G$4)*('Měsíční rekapitulace'!$A$3:$A$999=$A24)*TEXT('Měsíční rekapitulace'!$Q$3:$Q$999,\"0,0;0;0;\\0\")))","v":0},{"$f":"IF($A24=\"\",,SUMPRODUCT((LOOKUP(ROW(H$1:H$997),ROW(H$1:H$997)/ISNUMBER('Měsíční rekapitulace'!$L$1:$L$997),'Měsíční rekapitulace'!$L$1:$L$997)=H$4)*('Měsíční rekapitulace'!$A$3:$A$999=$A24)*TEXT('Měsíční rekapitulace'!$Q$3:$Q$999,\"0,0;0;0;\\0\")))","v":0},{"$f":"IF($A24=\"\",,SUMPRODUCT((LOOKUP(ROW(I$1:I$997),ROW(I$1:I$997)/ISNUMBER('Měsíční rekapitulace'!$L$1:$L$997),'Měsíční rekapitulace'!$L$1:$L$997)=I$4)*('Měsíční rekapitulace'!$A$3:$A$999=$A24)*TEXT('Měsíční rekapitulace'!$Q$3:$Q$999,\"0,0;0;0;\\0\")))","v":0},{"$f":"IF($A24=\"\",,SUMPRODUCT((LOOKUP(ROW(J$1:J$997),ROW(J$1:J$997)/ISNUMBER('Měsíční rekapitulace'!$L$1:$L$997),'Měsíční rekapitulace'!$L$1:$L$997)=J$4)*('Měsíční rekapitulace'!$A$3:$A$999=$A24)*TEXT('Měsíční rekapitulace'!$Q$3:$Q$999,\"0,0;0;0;\\0\")))","v":0},{"$f":"IF($A24=\"\",,SUMPRODUCT((LOOKUP(ROW(K$1:K$997),ROW(K$1:K$997)/ISNUMBER('Měsíční rekapitulace'!$L$1:$L$997),'Měsíční rekapitulace'!$L$1:$L$997)=K$4)*('Měsíční rekapitulace'!$A$3:$A$999=$A24)*TEXT('Měsíční rekapitulace'!$Q$3:$Q$999,\"0,0;0;0;\\0\")))","v":0},{"$f":"IF($A24=\"\",,SUMPRODUCT((LOOKUP(ROW(L$1:L$997),ROW(L$1:L$997)/ISNUMBER('Měsíční rekapitulace'!$L$1:$L$997),'Měsíční rekapitulace'!$L$1:$L$997)=L$4)*('Měsíční rekapitulace'!$A$3:$A$999=$A24)*TEXT('Měsíční rekapitulace'!$Q$3:$Q$999,\"0,0;0;0;\\0\")))","v":0},{"$f":"IF($A24=\"\",,SUMPRODUCT((LOOKUP(ROW(M$1:M$997),ROW(M$1:M$997)/ISNUMBER('Měsíční rekapitulace'!$L$1:$L$997),'Měsíční rekapitulace'!$L$1:$L$997)=M$4)*('Měsíční rekapitulace'!$A$3:$A$999=$A24)*TEXT('Měsíční rekapitulace'!$Q$3:$Q$999,\"0,0;0;0;\\0\")))","v":0},{"$f":"IF($A24=\"\",,SUMPRODUCT((LOOKUP(ROW(N$1:N$997),ROW(N$1:N$997)/ISNUMBER('Měsíční rekapitulace'!$L$1:$L$997),'Měsíční rekapitulace'!$L$1:$L$997)=N$4)*('Měsíční rekapitulace'!$A$3:$A$999=$A24)*TEXT('Měsíční rekapitulace'!$Q$3:$Q$999,\"0,0;0;0;\\0\")))","v":0},{"$f":"IF($A24=\"\",,SUMPRODUCT((LOOKUP(ROW(O$1:O$997),ROW(O$1:O$997)/ISNUMBER('Měsíční rekapitulace'!$L$1:$L$997),'Měsíční rekapitulace'!$L$1:$L$997)=O$4)*('Měsíční rekapitulace'!$A$3:$A$999=$A24)*TEXT('Měsíční rekapitulace'!$Q$3:$Q$999,\"0,0;0;0;\\0\")))","v":0},0]
[{"$f":"IFERROR(INDEX('Měsíční rekapitulace'!A$3:A$999,SMALL(IF(('Měsíční rekapitulace'!A$3:A$999<>\"\")*('Měsíční rekapitulace'!A$3:A$999<>'Měsíční rekapitulace'!$A$2)*(COUNTIF(A$5:A24,'Měsíční rekapitulace'!A$3:A$999)=0),ROW('Měsíční rekapitulace'!A$3:A$999)-2),1)),\"\")","v":"S-1537"},{"$f":"IFERROR(INDEX('Měsíční rekapitulace'!E$3:E$999,MATCH(A25,'Měsíční rekapitulace'!A$3:A$999,)),\"\")","v":"Rozšíření P1 o flotily"},null,{"$f":"IF($A25=\"\",,SUMPRODUCT((LOOKUP(ROW(D$1:D$997),ROW(D$1:D$997)/ISNUMBER('Měsíční rekapitulace'!$L$1:$L$997),'Měsíční rekapitulace'!$L$1:$L$997)=D$4)*('Měsíční rekapitulace'!$A$3:$A$999=$A25)*TEXT('Měsíční rekapitulace'!$Q$3:$Q$999,\"0,0;0;0;\\0\")))","v":0},{"$f":"IF($A25=\"\",,SUMPRODUCT((LOOKUP(ROW(E$1:E$997),ROW(E$1:E$997)/ISNUMBER('Měsíční rekapitulace'!$L$1:$L$997),'Měsíční rekapitulace'!$L$1:$L$997)=E$4)*('Měsíční rekapitulace'!$A$3:$A$999=$A25)*TEXT('Měsíční rekapitulace'!$Q$3:$Q$999,\"0,0;0;0;\\0\")))","v":0},{"$f":"IF($A25=\"\",,SUMPRODUCT((LOOKUP(ROW(F$1:F$997),ROW(F$1:F$997)/ISNUMBER('Měsíční rekapitulace'!$L$1:$L$997),'Měsíční rekapitulace'!$L$1:$L$997)=F$4)*('Měsíční rekapitulace'!$A$3:$A$999=$A25)*TEXT('Měsíční rekapitulace'!$Q$3:$Q$999,\"0,0;0;0;\\0\")))","v":0},{"$f":"IF($A25=\"\",,SUMPRODUCT((LOOKUP(ROW(G$1:G$997),ROW(G$1:G$997)/ISNUMBER('Měsíční rekapitulace'!$L$1:$L$997),'Měsíční rekapitulace'!$L$1:$L$997)=G$4)*('Měsíční rekapitulace'!$A$3:$A$999=$A25)*TEXT('Měsíční rekapitulace'!$Q$3:$Q$999,\"0,0;0;0;\\0\")))","v":0},{"$f":"IF($A25=\"\",,SUMPRODUCT((LOOKUP(ROW(H$1:H$997),ROW(H$1:H$997)/ISNUMBER('Měsíční rekapitulace'!$L$1:$L$997),'Měsíční rekapitulace'!$L$1:$L$997)=H$4)*('Měsíční rekapitulace'!$A$3:$A$999=$A25)*TEXT('Měsíční rekapitulace'!$Q$3:$Q$999,\"0,0;0;0;\\0\")))","v":0},{"$f":"IF($A25=\"\",,SUMPRODUCT((LOOKUP(ROW(I$1:I$997),ROW(I$1:I$997)/ISNUMBER('Měsíční rekapitulace'!$L$1:$L$997),'Měsíční rekapitulace'!$L$1:$L$997)=I$4)*('Měsíční rekapitulace'!$A$3:$A$999=$A25)*TEXT('Měsíční rekapitulace'!$Q$3:$Q$999,\"0,0;0;0;\\0\")))","v":0},{"$f":"IF($A25=\"\",,SUMPRODUCT((LOOKUP(ROW(J$1:J$997),ROW(J$1:J$997)/ISNUMBER('Měsíční rekapitulace'!$L$1:$L$997),'Měsíční rekapitulace'!$L$1:$L$997)=J$4)*('Měsíční rekapitulace'!$A$3:$A$999=$A25)*TEXT('Měsíční rekapitulace'!$Q$3:$Q$999,\"0,0;0;0;\\0\")))","v":0},{"$f":"IF($A25=\"\",,SUMPRODUCT((LOOKUP(ROW(K$1:K$997),ROW(K$1:K$997)/ISNUMBER('Měsíční rekapitulace'!$L$1:$L$997),'Měsíční rekapitulace'!$L$1:$L$997)=K$4)*('Měsíční rekapitulace'!$A$3:$A$999=$A25)*TEXT('Měsíční rekapitulace'!$Q$3:$Q$999,\"0,0;0;0;\\0\")))","v":0},{"$f":"IF($A25=\"\",,SUMPRODUCT((LOOKUP(ROW(L$1:L$997),ROW(L$1:L$997)/ISNUMBER('Měsíční rekapitulace'!$L$1:$L$997),'Měsíční rekapitulace'!$L$1:$L$997)=L$4)*('Měsíční rekapitulace'!$A$3:$A$999=$A25)*TEXT('Měsíční rekapitulace'!$Q$3:$Q$999,\"0,0;0;0;\\0\")))","v":0},{"$f":"IF($A25=\"\",,SUMPRODUCT((LOOKUP(ROW(M$1:M$997),ROW(M$1:M$997)/ISNUMBER('Měsíční rekapitulace'!$L$1:$L$997),'Měsíční rekapitulace'!$L$1:$L$997)=M$4)*('Měsíční rekapitulace'!$A$3:$A$999=$A25)*TEXT('Měsíční rekapitulace'!$Q$3:$Q$999,\"0,0;0;0;\\0\")))","v":0},{"$f":"IF($A25=\"\",,SUMPRODUCT((LOOKUP(ROW(N$1:N$997),ROW(N$1:N$997)/ISNUMBER('Měsíční rekapitulace'!$L$1:$L$997),'Měsíční rekapitulace'!$L$1:$L$997)=N$4)*('Měsíční rekapitulace'!$A$3:$A$999=$A25)*TEXT('Měsíční rekapitulace'!$Q$3:$Q$999,\"0,0;0;0;\\0\")))","v":0},{"$f":"IF($A25=\"\",,SUMPRODUCT((LOOKUP(ROW(O$1:O$997),ROW(O$1:O$997)/ISNUMBER('Měsíční rekapitulace'!$L$1:$L$997),'Měsíční rekapitulace'!$L$1:$L$997)=O$4)*('Měsíční rekapitulace'!$A$3:$A$999=$A25)*TEXT('Měsíční rekapitulace'!$Q$3:$Q$999,\"0,0;0;0;\\0\")))","v":0},0]
[{"$f":"IFERROR(INDEX('Měsíční rekapitulace'!A$3:A$999,SMALL(IF(('Měsíční rekapitulace'!A$3:A$999<>\"\")*('Měsíční rekapitulace'!A$3:A$999<>'Měsíční rekapitulace'!$A$2)*(COUNTIF(A$5:A25,'Měsíční rekapitulace'!A$3:A$999)=0),ROW('Měsíční rekapitulace'!A$3:A$999)-2),1)),\"\")","v":"S-1936"},{"$f":"IFERROR(INDEX('Měsíční rekapitulace'!E$3:E$999,MATCH(A26,'Měsíční rekapitulace'!A$3:A$999,)),\"\")","v":"Úprava business inteligence SLP"},null,{"$f":"IF($A26=\"\",,SUMPRODUCT((LOOKUP(ROW(D$1:D$997),ROW(D$1:D$997)/ISNUMBER('Měsíční rekapitulace'!$L$1:$L$997),'Měsíční rekapitulace'!$L$1:$L$997)=D$4)*('Měsíční rekapitulace'!$A$3:$A$999=$A26)*TEXT('Měsíční rekapitulace'!$Q$3:$Q$999,\"0,0;0;0;\\0\")))","v":0},{"$f":"IF($A26=\"\",,SUMPRODUCT((LOOKUP(ROW(E$1:E$997),ROW(E$1:E$997)/ISNUMBER('Měsíční rekapitulace'!$L$1:$L$997),'Měsíční rekapitulace'!$L$1:$L$997)=E$4)*('Měsíční rekapitulace'!$A$3:$A$999=$A26)*TEXT('Měsíční rekapitulace'!$Q$3:$Q$999,\"0,0;0;0;\\0\")))","v":0},{"$f":"IF($A26=\"\",,SUMPRODUCT((LOOKUP(ROW(F$1:F$997),ROW(F$1:F$997)/ISNUMBER('Měsíční rekapitulace'!$L$1:$L$997),'Měsíční rekapitulace'!$L$1:$L$997)=F$4)*('Měsíční rekapitulace'!$A$3:$A$999=$A26)*TEXT('Měsíční rekapitulace'!$Q$3:$Q$999,\"0,0;0;0;\\0\")))","v":0},{"$f":"IF($A26=\"\",,SUMPRODUCT((LOOKUP(ROW(G$1:G$997),ROW(G$1:G$997)/ISNUMBER('Měsíční rekapitulace'!$L$1:$L$997),'Měsíční rekapitulace'!$L$1:$L$997)=G$4)*('Měsíční rekapitulace'!$A$3:$A$999=$A26)*TEXT('Měsíční rekapitulace'!$Q$3:$Q$999,\"0,0;0;0;\\0\")))","v":0},{"$f":"IF($A26=\"\",,SUMPRODUCT((LOOKUP(ROW(H$1:H$997),ROW(H$1:H$997)/ISNUMBER('Měsíční rekapitulace'!$L$1:$L$997),'Měsíční rekapitulace'!$L$1:$L$997)=H$4)*('Měsíční rekapitulace'!$A$3:$A$999=$A26)*TEXT('Měsíční rekapitulace'!$Q$3:$Q$999,\"0,0;0;0;\\0\")))","v":0},{"$f":"IF($A26=\"\",,SUMPRODUCT((LOOKUP(ROW(I$1:I$997),ROW(I$1:I$997)/ISNUMBER('Měsíční rekapitulace'!$L$1:$L$997),'Měsíční rekapitulace'!$L$1:$L$997)=I$4)*('Měsíční rekapitulace'!$A$3:$A$999=$A26)*TEXT('Měsíční rekapitulace'!$Q$3:$Q$999,\"0,0;0;0;\\0\")))","v":0},{"$f":"IF($A26=\"\",,SUMPRODUCT((LOOKUP(ROW(J$1:J$997),ROW(J$1:J$997)/ISNUMBER('Měsíční rekapitulace'!$L$1:$L$997),'Měsíční rekapitulace'!$L$1:$L$997)=J$4)*('Měsíční rekapitulace'!$A$3:$A$999=$A26)*TEXT('Měsíční rekapitulace'!$Q$3:$Q$999,\"0,0;0;0;\\0\")))","v":0},{"$f":"IF($A26=\"\",,SUMPRODUCT((LOOKUP(ROW(K$1:K$997),ROW(K$1:K$997)/ISNUMBER('Měsíční rekapitulace'!$L$1:$L$997),'Měsíční rekapitulace'!$L$1:$L$997)=K$4)*('Měsíční rekapitulace'!$A$3:$A$999=$A26)*TEXT('Měsíční rekapitulace'!$Q$3:$Q$999,\"0,0;0;0;\\0\")))","v":0},{"$f":"IF($A26=\"\",,SUMPRODUCT((LOOKUP(ROW(L$1:L$997),ROW(L$1:L$997)/ISNUMBER('Měsíční rekapitulace'!$L$1:$L$997),'Měsíční rekapitulace'!$L$1:$L$997)=L$4)*('Měsíční rekapitulace'!$A$3:$A$999=$A26)*TEXT('Měsíční rekapitulace'!$Q$3:$Q$999,\"0,0;0;0;\\0\")))","v":0},{"$f":"IF($A26=\"\",,SUMPRODUCT((LOOKUP(ROW(M$1:M$997),ROW(M$1:M$997)/ISNUMBER('Měsíční rekapitulace'!$L$1:$L$997),'Měsíční rekapitulace'!$L$1:$L$997)=M$4)*('Měsíční rekapitulace'!$A$3:$A$999=$A26)*TEXT('Měsíční rekapitulace'!$Q$3:$Q$999,\"0,0;0;0;\\0\")))","v":0},{"$f":"IF($A26=\"\",,SUMPRODUCT((LOOKUP(ROW(N$1:N$997),ROW(N$1:N$997)/ISNUMBER('Měsíční rekapitulace'!$L$1:$L$997),'Měsíční rekapitulace'!$L$1:$L$997)=N$4)*('Měsíční rekapitulace'!$A$3:$A$999=$A26)*TEXT('Měsíční rekapitulace'!$Q$3:$Q$999,\"0,0;0;0;\\0\")))","v":0},{"$f":"IF($A26=\"\",,SUMPRODUCT((LOOKUP(ROW(O$1:O$997),ROW(O$1:O$997)/ISNUMBER('Měsíční rekapitulace'!$L$1:$L$997),'Měsíční rekapitulace'!$L$1:$L$997)=O$4)*('Měsíční rekapitulace'!$A$3:$A$999=$A26)*TEXT('Měsíční rekapitulace'!$Q$3:$Q$999,\"0,0;0;0;\\0\")))","v":0},0]
[{"$f":"IFERROR(INDEX('Měsíční rekapitulace'!A$3:A$999,SMALL(IF(('Měsíční rekapitulace'!A$3:A$999<>\"\")*('Měsíční rekapitulace'!A$3:A$999<>'Měsíční rekapitulace'!$A$2)*(COUNTIF(A$5:A26,'Měsíční rekapitulace'!A$3:A$999)=0),ROW('Měsíční rekapitulace'!A$3:A$999)-2),1)),\"\")","v":"S-2024"},{"$f":"IFERROR(INDEX('Měsíční rekapitulace'!E$3:E$999,MATCH(A27,'Měsíční rekapitulace'!A$3:A$999,)),\"\")","v":"Doplnění SSY do seznamu závazků"},null,{"$f":"IF($A27=\"\",,SUMPRODUCT((LOOKUP(ROW(D$1:D$997),ROW(D$1:D$997)/ISNUMBER('Měsíční rekapitulace'!$L$1:$L$997),'Měsíční rekapitulace'!$L$1:$L$997)=D$4)*('Měsíční rekapitulace'!$A$3:$A$999=$A27)*TEXT('Měsíční rekapitulace'!$Q$3:$Q$999,\"0,0;0;0;\\0\")))","v":0},{"$f":"IF($A27=\"\",,SUMPRODUCT((LOOKUP(ROW(E$1:E$997),ROW(E$1:E$997)/ISNUMBER('Měsíční rekapitulace'!$L$1:$L$997),'Měsíční rekapitulace'!$L$1:$L$997)=E$4)*('Měsíční rekapitulace'!$A$3:$A$999=$A27)*TEXT('Měsíční rekapitulace'!$Q$3:$Q$999,\"0,0;0;0;\\0\")))","v":0},{"$f":"IF($A27=\"\",,SUMPRODUCT((LOOKUP(ROW(F$1:F$997),ROW(F$1:F$997)/ISNUMBER('Měsíční rekapitulace'!$L$1:$L$997),'Měsíční rekapitulace'!$L$1:$L$997)=F$4)*('Měsíční rekapitulace'!$A$3:$A$999=$A27)*TEXT('Měsíční rekapitulace'!$Q$3:$Q$999,\"0,0;0;0;\\0\")))","v":0},{"$f":"IF($A27=\"\",,SUMPRODUCT((LOOKUP(ROW(G$1:G$997),ROW(G$1:G$997)/ISNUMBER('Měsíční rekapitulace'!$L$1:$L$997),'Měsíční rekapitulace'!$L$1:$L$997)=G$4)*('Měsíční rekapitulace'!$A$3:$A$999=$A27)*TEXT('Měsíční rekapitulace'!$Q$3:$Q$999,\"0,0;0;0;\\0\")))","v":0},{"$f":"IF($A27=\"\",,SUMPRODUCT((LOOKUP(ROW(H$1:H$997),ROW(H$1:H$997)/ISNUMBER('Měsíční rekapitulace'!$L$1:$L$997),'Měsíční rekapitulace'!$L$1:$L$997)=H$4)*('Měsíční rekapitulace'!$A$3:$A$999=$A27)*TEXT('Měsíční rekapitulace'!$Q$3:$Q$999,\"0,0;0;0;\\0\")))","v":0},{"$f":"IF($A27=\"\",,SUMPRODUCT((LOOKUP(ROW(I$1:I$997),ROW(I$1:I$997)/ISNUMBER('Měsíční rekapitulace'!$L$1:$L$997),'Měsíční rekapitulace'!$L$1:$L$997)=I$4)*('Měsíční rekapitulace'!$A$3:$A$999=$A27)*TEXT('Měsíční rekapitulace'!$Q$3:$Q$999,\"0,0;0;0;\\0\")))","v":0},{"$f":"IF($A27=\"\",,SUMPRODUCT((LOOKUP(ROW(J$1:J$997),ROW(J$1:J$997)/ISNUMBER('Měsíční rekapitulace'!$L$1:$L$997),'Měsíční rekapitulace'!$L$1:$L$997)=J$4)*('Měsíční rekapitulace'!$A$3:$A$999=$A27)*TEXT('Měsíční rekapitulace'!$Q$3:$Q$999,\"0,0;0;0;\\0\")))","v":0},{"$f":"IF($A27=\"\",,SUMPRODUCT((LOOKUP(ROW(K$1:K$997),ROW(K$1:K$997)/ISNUMBER('Měsíční rekapitulace'!$L$1:$L$997),'Měsíční rekapitulace'!$L$1:$L$997)=K$4)*('Měsíční rekapitulace'!$A$3:$A$999=$A27)*TEXT('Měsíční rekapitulace'!$Q$3:$Q$999,\"0,0;0;0;\\0\")))","v":0},{"$f":"IF($A27=\"\",,SUMPRODUCT((LOOKUP(ROW(L$1:L$997),ROW(L$1:L$997)/ISNUMBER('Měsíční rekapitulace'!$L$1:$L$997),'Měsíční rekapitulace'!$L$1:$L$997)=L$4)*('Měsíční rekapitulace'!$A$3:$A$999=$A27)*TEXT('Měsíční rekapitulace'!$Q$3:$Q$999,\"0,0;0;0;\\0\")))","v":0},{"$f":"IF($A27=\"\",,SUMPRODUCT((LOOKUP(ROW(M$1:M$997),ROW(M$1:M$997)/ISNUMBER('Měsíční rekapitulace'!$L$1:$L$997),'Měsíční rekapitulace'!$L$1:$L$997)=M$4)*('Měsíční rekapitulace'!$A$3:$A$999=$A27)*TEXT('Měsíční rekapitulace'!$Q$3:$Q$999,\"0,0;0;0;\\0\")))","v":0},{"$f":"IF($A27=\"\",,SUMPRODUCT((LOOKUP(ROW(N$1:N$997),ROW(N$1:N$997)/ISNUMBER('Měsíční rekapitulace'!$L$1:$L$997),'Měsíční rekapitulace'!$L$1:$L$997)=N$4)*('Měsíční rekapitulace'!$A$3:$A$999=$A27)*TEXT('Měsíční rekapitulace'!$Q$3:$Q$999,\"0,0;0;0;\\0\")))","v":0},{"$f":"IF($A27=\"\",,SUMPRODUCT((LOOKUP(ROW(O$1:O$997),ROW(O$1:O$997)/ISNUMBER('Měsíční rekapitulace'!$L$1:$L$997),'Měsíční rekapitulace'!$L$1:$L$997)=O$4)*('Měsíční rekapitulace'!$A$3:$A$999=$A27)*TEXT('Měsíční rekapitulace'!$Q$3:$Q$999,\"0,0;0;0;\\0\")))","v":0},0]
[{"$f":"IFERROR(INDEX('Měsíční rekapitulace'!A$3:A$999,SMALL(IF(('Měsíční rekapitulace'!A$3:A$999<>\"\")*('Měsíční rekapitulace'!A$3:A$999<>'Měsíční rekapitulace'!$A$2)*(COUNTIF(A$5:A27,'Měsíční rekapitulace'!A$3:A$999)=0),ROW('Měsíční rekapitulace'!A$3:A$999)-2),1)),\"\")","v":"Servis2014"},{"$f":"IFERROR(INDEX('Měsíční rekapitulace'!E$3:E$999,MATCH(A28,'Měsíční rekapitulace'!A$3:A$999,)),\"\")","v":"Práce podle servisní smlouvy na rok 2014"},null,{"$f":"IF($A28=\"\",,SUMPRODUCT((LOOKUP(ROW(D$1:D$997),ROW(D$1:D$997)/ISNUMBER('Měsíční rekapitulace'!$L$1:$L$997),'Měsíční rekapitulace'!$L$1:$L$997)=D$4)*('Měsíční rekapitulace'!$A$3:$A$999=$A28)*TEXT('Měsíční rekapitulace'!$Q$3:$Q$999,\"0,0;0;0;\\0\")))","v":0},{"$f":"IF($A28=\"\",,SUMPRODUCT((LOOKUP(ROW(E$1:E$997),ROW(E$1:E$997)/ISNUMBER('Měsíční rekapitulace'!$L$1:$L$997),'Měsíční rekapitulace'!$L$1:$L$997)=E$4)*('Měsíční rekapitulace'!$A$3:$A$999=$A28)*TEXT('Měsíční rekapitulace'!$Q$3:$Q$999,\"0,0;0;0;\\0\")))","v":0},{"$f":"IF($A28=\"\",,SUMPRODUCT((LOOKUP(ROW(F$1:F$997),ROW(F$1:F$997)/ISNUMBER('Měsíční rekapitulace'!$L$1:$L$997),'Měsíční rekapitulace'!$L$1:$L$997)=F$4)*('Měsíční rekapitulace'!$A$3:$A$999=$A28)*TEXT('Měsíční rekapitulace'!$Q$3:$Q$999,\"0,0;0;0;\\0\")))","v":0},{"$f":"IF($A28=\"\",,SUMPRODUCT((LOOKUP(ROW(G$1:G$997),ROW(G$1:G$997)/ISNUMBER('Měsíční rekapitulace'!$L$1:$L$997),'Měsíční rekapitulace'!$L$1:$L$997)=G$4)*('Měsíční rekapitulace'!$A$3:$A$999=$A28)*TEXT('Měsíční rekapitulace'!$Q$3:$Q$999,\"0,0;0;0;\\0\")))","v":0},{"$f":"IF($A28=\"\",,SUMPRODUCT((LOOKUP(ROW(H$1:H$997),ROW(H$1:H$997)/ISNUMBER('Měsíční rekapitulace'!$L$1:$L$997),'Měsíční rekapitulace'!$L$1:$L$997)=H$4)*('Měsíční rekapitulace'!$A$3:$A$999=$A28)*TEXT('Měsíční rekapitulace'!$Q$3:$Q$999,\"0,0;0;0;\\0\")))","v":0},{"$f":"IF($A28=\"\",,SUMPRODUCT((LOOKUP(ROW(I$1:I$997),ROW(I$1:I$997)/ISNUMBER('Měsíční rekapitulace'!$L$1:$L$997),'Měsíční rekapitulace'!$L$1:$L$997)=I$4)*('Měsíční rekapitulace'!$A$3:$A$999=$A28)*TEXT('Měsíční rekapitulace'!$Q$3:$Q$999,\"0,0;0;0;\\0\")))","v":0},{"$f":"IF($A28=\"\",,SUMPRODUCT((LOOKUP(ROW(J$1:J$997),ROW(J$1:J$997)/ISNUMBER('Měsíční rekapitulace'!$L$1:$L$997),'Měsíční rekapitulace'!$L$1:$L$997)=J$4)*('Měsíční rekapitulace'!$A$3:$A$999=$A28)*TEXT('Měsíční rekapitulace'!$Q$3:$Q$999,\"0,0;0;0;\\0\")))","v":0},{"$f":"IF($A28=\"\",,SUMPRODUCT((LOOKUP(ROW(K$1:K$997),ROW(K$1:K$997)/ISNUMBER('Měsíční rekapitulace'!$L$1:$L$997),'Měsíční rekapitulace'!$L$1:$L$997)=K$4)*('Měsíční rekapitulace'!$A$3:$A$999=$A28)*TEXT('Měsíční rekapitulace'!$Q$3:$Q$999,\"0,0;0;0;\\0\")))","v":0},{"$f":"IF($A28=\"\",,SUMPRODUCT((LOOKUP(ROW(L$1:L$997),ROW(L$1:L$997)/ISNUMBER('Měsíční rekapitulace'!$L$1:$L$997),'Měsíční rekapitulace'!$L$1:$L$997)=L$4)*('Měsíční rekapitulace'!$A$3:$A$999=$A28)*TEXT('Měsíční rekapitulace'!$Q$3:$Q$999,\"0,0;0;0;\\0\")))","v":0},{"$f":"IF($A28=\"\",,SUMPRODUCT((LOOKUP(ROW(M$1:M$997),ROW(M$1:M$997)/ISNUMBER('Měsíční rekapitulace'!$L$1:$L$997),'Měsíční rekapitulace'!$L$1:$L$997)=M$4)*('Měsíční rekapitulace'!$A$3:$A$999=$A28)*TEXT('Měsíční rekapitulace'!$Q$3:$Q$999,\"0,0;0;0;\\0\")))","v":0},{"$f":"IF($A28=\"\",,SUMPRODUCT((LOOKUP(ROW(N$1:N$997),ROW(N$1:N$997)/ISNUMBER('Měsíční rekapitulace'!$L$1:$L$997),'Měsíční rekapitulace'!$L$1:$L$997)=N$4)*('Měsíční rekapitulace'!$A$3:$A$999=$A28)*TEXT('Měsíční rekapitulace'!$Q$3:$Q$999,\"0,0;0;0;\\0\")))","v":27},{"$f":"IF($A28=\"\",,SUMPRODUCT((LOOKUP(ROW(O$1:O$997),ROW(O$1:O$997)/ISNUMBER('Měsíční rekapitulace'!$L$1:$L$997),'Měsíční rekapitulace'!$L$1:$L$997)=O$4)*('Měsíční rekapitulace'!$A$3:$A$999=$A28)*TEXT('Měsíční rekapitulace'!$Q$3:$Q$999,\"0,0;0;0;\\0\")))","v":144},171]
[{"$f":"IFERROR(INDEX('Měsíční rekapitulace'!A$3:A$999,SMALL(IF(('Měsíční rekapitulace'!A$3:A$999<>\"\")*('Měsíční rekapitulace'!A$3:A$999<>'Měsíční rekapitulace'!$A$2)*(COUNTIF(A$5:A28,'Měsíční rekapitulace'!A$3:A$999)=0),ROW('Měsíční rekapitulace'!A$3:A$999)-2),1)),\"\")","v":"S-1394"},{"$f":"IFERROR(INDEX('Měsíční rekapitulace'!E$3:E$999,MATCH(A29,'Měsíční rekapitulace'!A$3:A$999,)),\"\")","v":"Změna chování WS B1 ve vztahu k velkým objemům dat"},null,{"$f":"IF($A29=\"\",,SUMPRODUCT((LOOKUP(ROW(D$1:D$997),ROW(D$1:D$997)/ISNUMBER('Měsíční rekapitulace'!$L$1:$L$997),'Měsíční rekapitulace'!$L$1:$L$997)=D$4)*('Měsíční rekapitulace'!$A$3:$A$999=$A29)*TEXT('Měsíční rekapitulace'!$Q$3:$Q$999,\"0,0;0;0;\\0\")))","v":0},{"$f":"IF($A29=\"\",,SUMPRODUCT((LOOKUP(ROW(E$1:E$997),ROW(E$1:E$997)/ISNUMBER('Měsíční rekapitulace'!$L$1:$L$997),'Měsíční rekapitulace'!$L$1:$L$997)=E$4)*('Měsíční rekapitulace'!$A$3:$A$999=$A29)*TEXT('Měsíční rekapitulace'!$Q$3:$Q$999,\"0,0;0;0;\\0\")))","v":0},{"$f":"IF($A29=\"\",,SUMPRODUCT((LOOKUP(ROW(F$1:F$997),ROW(F$1:F$997)/ISNUMBER('Měsíční rekapitulace'!$L$1:$L$997),'Měsíční rekapitulace'!$L$1:$L$997)=F$4)*('Měsíční rekapitulace'!$A$3:$A$999=$A29)*TEXT('Měsíční rekapitulace'!$Q$3:$Q$999,\"0,0;0;0;\\0\")))","v":0},{"$f":"IF($A29=\"\",,SUMPRODUCT((LOOKUP(ROW(G$1:G$997),ROW(G$1:G$997)/ISNUMBER('Měsíční rekapitulace'!$L$1:$L$997),'Měsíční rekapitulace'!$L$1:$L$997)=G$4)*('Měsíční rekapitulace'!$A$3:$A$999=$A29)*TEXT('Měsíční rekapitulace'!$Q$3:$Q$999,\"0,0;0;0;\\0\")))","v":0},{"$f":"IF($A29=\"\",,SUMPRODUCT((LOOKUP(ROW(H$1:H$997),ROW(H$1:H$997)/ISNUMBER('Měsíční rekapitulace'!$L$1:$L$997),'Měsíční rekapitulace'!$L$1:$L$997)=H$4)*('Měsíční rekapitulace'!$A$3:$A$999=$A29)*TEXT('Měsíční rekapitulace'!$Q$3:$Q$999,\"0,0;0;0;\\0\")))","v":0},{"$f":"IF($A29=\"\",,SUMPRODUCT((LOOKUP(ROW(I$1:I$997),ROW(I$1:I$997)/ISNUMBER('Měsíční rekapitulace'!$L$1:$L$997),'Měsíční rekapitulace'!$L$1:$L$997)=I$4)*('Měsíční rekapitulace'!$A$3:$A$999=$A29)*TEXT('Měsíční rekapitulace'!$Q$3:$Q$999,\"0,0;0;0;\\0\")))","v":0},{"$f":"IF($A29=\"\",,SUMPRODUCT((LOOKUP(ROW(J$1:J$997),ROW(J$1:J$997)/ISNUMBER('Měsíční rekapitulace'!$L$1:$L$997),'Měsíční rekapitulace'!$L$1:$L$997)=J$4)*('Měsíční rekapitulace'!$A$3:$A$999=$A29)*TEXT('Měsíční rekapitulace'!$Q$3:$Q$999,\"0,0;0;0;\\0\")))","v":0},{"$f":"IF($A29=\"\",,SUMPRODUCT((LOOKUP(ROW(K$1:K$997),ROW(K$1:K$997)/ISNUMBER('Měsíční rekapitulace'!$L$1:$L$997),'Měsíční rekapitulace'!$L$1:$L$997)=K$4)*('Měsíční rekapitulace'!$A$3:$A$999=$A29)*TEXT('Měsíční rekapitulace'!$Q$3:$Q$999,\"0,0;0;0;\\0\")))","v":0},{"$f":"IF($A29=\"\",,SUMPRODUCT((LOOKUP(ROW(L$1:L$997),ROW(L$1:L$997)/ISNUMBER('Měsíční rekapitulace'!$L$1:$L$997),'Měsíční rekapitulace'!$L$1:$L$997)=L$4)*('Měsíční rekapitulace'!$A$3:$A$999=$A29)*TEXT('Měsíční rekapitulace'!$Q$3:$Q$999,\"0,0;0;0;\\0\")))","v":0},{"$f":"IF($A29=\"\",,SUMPRODUCT((LOOKUP(ROW(M$1:M$997),ROW(M$1:M$997)/ISNUMBER('Měsíční rekapitulace'!$L$1:$L$997),'Měsíční rekapitulace'!$L$1:$L$997)=M$4)*('Měsíční rekapitulace'!$A$3:$A$999=$A29)*TEXT('Měsíční rekapitulace'!$Q$3:$Q$999,\"0,0;0;0;\\0\")))","v":0},{"$f":"IF($A29=\"\",,SUMPRODUCT((LOOKUP(ROW(N$1:N$997),ROW(N$1:N$997)/ISNUMBER('Měsíční rekapitulace'!$L$1:$L$997),'Měsíční rekapitulace'!$L$1:$L$997)=N$4)*('Měsíční rekapitulace'!$A$3:$A$999=$A29)*TEXT('Měsíční rekapitulace'!$Q$3:$Q$999,\"0,0;0;0;\\0\")))","v":0},{"$f":"IF($A29=\"\",,SUMPRODUCT((LOOKUP(ROW(O$1:O$997),ROW(O$1:O$997)/ISNUMBER('Měsíční rekapitulace'!$L$1:$L$997),'Měsíční rekapitulace'!$L$1:$L$997)=O$4)*('Měsíční rekapitulace'!$A$3:$A$999=$A29)*TEXT('Měsíční rekapitulace'!$Q$3:$Q$999,\"0,0;0;0;\\0\")))","v":0},0]
[{"$f":"IFERROR(INDEX('Měsíční rekapitulace'!A$3:A$999,SMALL(IF(('Měsíční rekapitulace'!A$3:A$999<>\"\")*('Měsíční rekapitulace'!A$3:A$999<>'Měsíční rekapitulace'!$A$2)*(COUNTIF(A$5:A29,'Měsíční rekapitulace'!A$3:A$999)=0),ROW('Měsíční rekapitulace'!A$3:A$999)-2),1)),\"\")","v":"S-1549"},{"$f":"IFERROR(INDEX('Měsíční rekapitulace'!E$3:E$999,MATCH(A30,'Měsíční rekapitulace'!A$3:A$999,)),\"\")","v":"Kontrola tarifní skupiny „Tahač“"},null,{"$f":"IF($A30=\"\",,SUMPRODUCT((LOOKUP(ROW(D$1:D$997),ROW(D$1:D$997)/ISNUMBER('Měsíční rekapitulace'!$L$1:$L$997),'Měsíční rekapitulace'!$L$1:$L$997)=D$4)*('Měsíční rekapitulace'!$A$3:$A$999=$A30)*TEXT('Měsíční rekapitulace'!$Q$3:$Q$999,\"0,0;0;0;\\0\")))","v":0},{"$f":"IF($A30=\"\",,SUMPRODUCT((LOOKUP(ROW(E$1:E$997),ROW(E$1:E$997)/ISNUMBER('Měsíční rekapitulace'!$L$1:$L$997),'Měsíční rekapitulace'!$L$1:$L$997)=E$4)*('Měsíční rekapitulace'!$A$3:$A$999=$A30)*TEXT('Měsíční rekapitulace'!$Q$3:$Q$999,\"0,0;0;0;\\0\")))","v":0},{"$f":"IF($A30=\"\",,SUMPRODUCT((LOOKUP(ROW(F$1:F$997),ROW(F$1:F$997)/ISNUMBER('Měsíční rekapitulace'!$L$1:$L$997),'Měsíční rekapitulace'!$L$1:$L$997)=F$4)*('Měsíční rekapitulace'!$A$3:$A$999=$A30)*TEXT('Měsíční rekapitulace'!$Q$3:$Q$999,\"0,0;0;0;\\0\")))","v":0},{"$f":"IF($A30=\"\",,SUMPRODUCT((LOOKUP(ROW(G$1:G$997),ROW(G$1:G$997)/ISNUMBER('Měsíční rekapitulace'!$L$1:$L$997),'Měsíční rekapitulace'!$L$1:$L$997)=G$4)*('Měsíční rekapitulace'!$A$3:$A$999=$A30)*TEXT('Měsíční rekapitulace'!$Q$3:$Q$999,\"0,0;0;0;\\0\")))","v":0},{"$f":"IF($A30=\"\",,SUMPRODUCT((LOOKUP(ROW(H$1:H$997),ROW(H$1:H$997)/ISNUMBER('Měsíční rekapitulace'!$L$1:$L$997),'Měsíční rekapitulace'!$L$1:$L$997)=H$4)*('Měsíční rekapitulace'!$A$3:$A$999=$A30)*TEXT('Měsíční rekapitulace'!$Q$3:$Q$999,\"0,0;0;0;\\0\")))","v":0},{"$f":"IF($A30=\"\",,SUMPRODUCT((LOOKUP(ROW(I$1:I$997),ROW(I$1:I$997)/ISNUMBER('Měsíční rekapitulace'!$L$1:$L$997),'Měsíční rekapitulace'!$L$1:$L$997)=I$4)*('Měsíční rekapitulace'!$A$3:$A$999=$A30)*TEXT('Měsíční rekapitulace'!$Q$3:$Q$999,\"0,0;0;0;\\0\")))","v":0},{"$f":"IF($A30=\"\",,SUMPRODUCT((LOOKUP(ROW(J$1:J$997),ROW(J$1:J$997)/ISNUMBER('Měsíční rekapitulace'!$L$1:$L$997),'Měsíční rekapitulace'!$L$1:$L$997)=J$4)*('Měsíční rekapitulace'!$A$3:$A$999=$A30)*TEXT('Měsíční rekapitulace'!$Q$3:$Q$999,\"0,0;0;0;\\0\")))","v":0},{"$f":"IF($A30=\"\",,SUMPRODUCT((LOOKUP(ROW(K$1:K$997),ROW(K$1:K$997)/ISNUMBER('Měsíční rekapitulace'!$L$1:$L$997),'Měsíční rekapitulace'!$L$1:$L$997)=K$4)*('Měsíční rekapitulace'!$A$3:$A$999=$A30)*TEXT('Měsíční rekapitulace'!$Q$3:$Q$999,\"0,0;0;0;\\0\")))","v":0},{"$f":"IF($A30=\"\",,SUMPRODUCT((LOOKUP(ROW(L$1:L$997),ROW(L$1:L$997)/ISNUMBER('Měsíční rekapitulace'!$L$1:$L$997),'Měsíční rekapitulace'!$L$1:$L$997)=L$4)*('Měsíční rekapitulace'!$A$3:$A$999=$A30)*TEXT('Měsíční rekapitulace'!$Q$3:$Q$999,\"0,0;0;0;\\0\")))","v":0},{"$f":"IF($A30=\"\",,SUMPRODUCT((LOOKUP(ROW(M$1:M$997),ROW(M$1:M$997)/ISNUMBER('Měsíční rekapitulace'!$L$1:$L$997),'Měsíční rekapitulace'!$L$1:$L$997)=M$4)*('Měsíční rekapitulace'!$A$3:$A$999=$A30)*TEXT('Měsíční rekapitulace'!$Q$3:$Q$999,\"0,0;0;0;\\0\")))","v":0},{"$f":"IF($A30=\"\",,SUMPRODUCT((LOOKUP(ROW(N$1:N$997),ROW(N$1:N$997)/ISNUMBER('Měsíční rekapitulace'!$L$1:$L$997),'Měsíční rekapitulace'!$L$1:$L$997)=N$4)*('Měsíční rekapitulace'!$A$3:$A$999=$A30)*TEXT('Měsíční rekapitulace'!$Q$3:$Q$999,\"0,0;0;0;\\0\")))","v":0},{"$f":"IF($A30=\"\",,SUMPRODUCT((LOOKUP(ROW(O$1:O$997),ROW(O$1:O$997)/ISNUMBER('Měsíční rekapitulace'!$L$1:$L$997),'Měsíční rekapitulace'!$L$1:$L$997)=O$4)*('Měsíční rekapitulace'!$A$3:$A$999=$A30)*TEXT('Měsíční rekapitulace'!$Q$3:$Q$999,\"0,0;0;0;\\0\")))","v":0},0]
[{"$f":"IFERROR(INDEX('Měsíční rekapitulace'!A$3:A$999,SMALL(IF(('Měsíční rekapitulace'!A$3:A$999<>\"\")*('Měsíční rekapitulace'!A$3:A$999<>'Měsíční rekapitulace'!$A$2)*(COUNTIF(A$5:A30,'Měsíční rekapitulace'!A$3:A$999)=0),ROW('Měsíční rekapitulace'!A$3:A$999)-2),1)),\"\")","v":"S-2058"},{"$f":"IFERROR(INDEX('Měsíční rekapitulace'!E$3:E$999,MATCH(A31,'Měsíční rekapitulace'!A$3:A$999,)),\"\")","v":"Úprava systému VR pro externí subsystém"},null,{"$f":"IF($A31=\"\",,SUMPRODUCT((LOOKUP(ROW(D$1:D$997),ROW(D$1:D$997)/ISNUMBER('Měsíční rekapitulace'!$L$1:$L$997),'Měsíční rekapitulace'!$L$1:$L$997)=D$4)*('Měsíční rekapitulace'!$A$3:$A$999=$A31)*TEXT('Měsíční rekapitulace'!$Q$3:$Q$999,\"0,0;0;0;\\0\")))","v":0},{"$f":"IF($A31=\"\",,SUMPRODUCT((LOOKUP(ROW(E$1:E$997),ROW(E$1:E$997)/ISNUMBER('Měsíční rekapitulace'!$L$1:$L$997),'Měsíční rekapitulace'!$L$1:$L$997)=E$4)*('Měsíční rekapitulace'!$A$3:$A$999=$A31)*TEXT('Měsíční rekapitulace'!$Q$3:$Q$999,\"0,0;0;0;\\0\")))","v":0},{"$f":"IF($A31=\"\",,SUMPRODUCT((LOOKUP(ROW(F$1:F$997),ROW(F$1:F$997)/ISNUMBER('Měsíční rekapitulace'!$L$1:$L$997),'Měsíční rekapitulace'!$L$1:$L$997)=F$4)*('Měsíční rekapitulace'!$A$3:$A$999=$A31)*TEXT('Měsíční rekapitulace'!$Q$3:$Q$999,\"0,0;0;0;\\0\")))","v":0},{"$f":"IF($A31=\"\",,SUMPRODUCT((LOOKUP(ROW(G$1:G$997),ROW(G$1:G$997)/ISNUMBER('Měsíční rekapitulace'!$L$1:$L$997),'Měsíční rekapitulace'!$L$1:$L$997)=G$4)*('Měsíční rekapitulace'!$A$3:$A$999=$A31)*TEXT('Měsíční rekapitulace'!$Q$3:$Q$999,\"0,0;0;0;\\0\")))","v":0},{"$f":"IF($A31=\"\",,SUMPRODUCT((LOOKUP(ROW(H$1:H$997),ROW(H$1:H$997)/ISNUMBER('Měsíční rekapitulace'!$L$1:$L$997),'Měsíční rekapitulace'!$L$1:$L$997)=H$4)*('Měsíční rekapitulace'!$A$3:$A$999=$A31)*TEXT('Měsíční rekapitulace'!$Q$3:$Q$999,\"0,0;0;0;\\0\")))","v":0},{"$f":"IF($A31=\"\",,SUMPRODUCT((LOOKUP(ROW(I$1:I$997),ROW(I$1:I$997)/ISNUMBER('Měsíční rekapitulace'!$L$1:$L$997),'Měsíční rekapitulace'!$L$1:$L$997)=I$4)*('Měsíční rekapitulace'!$A$3:$A$999=$A31)*TEXT('Měsíční rekapitulace'!$Q$3:$Q$999,\"0,0;0;0;\\0\")))","v":0},{"$f":"IF($A31=\"\",,SUMPRODUCT((LOOKUP(ROW(J$1:J$997),ROW(J$1:J$997)/ISNUMBER('Měsíční rekapitulace'!$L$1:$L$997),'Měsíční rekapitulace'!$L$1:$L$997)=J$4)*('Měsíční rekapitulace'!$A$3:$A$999=$A31)*TEXT('Měsíční rekapitulace'!$Q$3:$Q$999,\"0,0;0;0;\\0\")))","v":0},{"$f":"IF($A31=\"\",,SUMPRODUCT((LOOKUP(ROW(K$1:K$997),ROW(K$1:K$997)/ISNUMBER('Měsíční rekapitulace'!$L$1:$L$997),'Měsíční rekapitulace'!$L$1:$L$997)=K$4)*('Měsíční rekapitulace'!$A$3:$A$999=$A31)*TEXT('Měsíční rekapitulace'!$Q$3:$Q$999,\"0,0;0;0;\\0\")))","v":0},{"$f":"IF($A31=\"\",,SUMPRODUCT((LOOKUP(ROW(L$1:L$997),ROW(L$1:L$997)/ISNUMBER('Měsíční rekapitulace'!$L$1:$L$997),'Měsíční rekapitulace'!$L$1:$L$997)=L$4)*('Měsíční rekapitulace'!$A$3:$A$999=$A31)*TEXT('Měsíční rekapitulace'!$Q$3:$Q$999,\"0,0;0;0;\\0\")))","v":0},{"$f":"IF($A31=\"\",,SUMPRODUCT((LOOKUP(ROW(M$1:M$997),ROW(M$1:M$997)/ISNUMBER('Měsíční rekapitulace'!$L$1:$L$997),'Měsíční rekapitulace'!$L$1:$L$997)=M$4)*('Měsíční rekapitulace'!$A$3:$A$999=$A31)*TEXT('Měsíční rekapitulace'!$Q$3:$Q$999,\"0,0;0;0;\\0\")))","v":0},{"$f":"IF($A31=\"\",,SUMPRODUCT((LOOKUP(ROW(N$1:N$997),ROW(N$1:N$997)/ISNUMBER('Měsíční rekapitulace'!$L$1:$L$997),'Měsíční rekapitulace'!$L$1:$L$997)=N$4)*('Měsíční rekapitulace'!$A$3:$A$999=$A31)*TEXT('Měsíční rekapitulace'!$Q$3:$Q$999,\"0,0;0;0;\\0\")))","v":0},{"$f":"IF($A31=\"\",,SUMPRODUCT((LOOKUP(ROW(O$1:O$997),ROW(O$1:O$997)/ISNUMBER('Měsíční rekapitulace'!$L$1:$L$997),'Měsíční rekapitulace'!$L$1:$L$997)=O$4)*('Měsíční rekapitulace'!$A$3:$A$999=$A31)*TEXT('Měsíční rekapitulace'!$Q$3:$Q$999,\"0,0;0;0;\\0\")))","v":0},0]
[{"$f":"IFERROR(INDEX('Měsíční rekapitulace'!A$3:A$999,SMALL(IF(('Měsíční rekapitulace'!A$3:A$999<>\"\")*('Měsíční rekapitulace'!A$3:A$999<>'Měsíční rekapitulace'!$A$2)*(COUNTIF(A$5:A31,'Měsíční rekapitulace'!A$3:A$999)=0),ROW('Měsíční rekapitulace'!A$3:A$999)-2),1)),\"\")","v":"S-559"},{"$f":"IFERROR(INDEX('Měsíční rekapitulace'!E$3:E$999,MATCH(A32,'Měsíční rekapitulace'!A$3:A$999,)),\"\")","v":"Revize restriktivních pravidel u záznamu SetPrenosPSP (B1/L1)"},null,{"$f":"IF($A32=\"\",,SUMPRODUCT((LOOKUP(ROW(D$1:D$997),ROW(D$1:D$997)/ISNUMBER('Měsíční rekapitulace'!$L$1:$L$997),'Měsíční rekapitulace'!$L$1:$L$997)=D$4)*('Měsíční rekapitulace'!$A$3:$A$999=$A32)*TEXT('Měsíční rekapitulace'!$Q$3:$Q$999,\"0,0;0;0;\\0\")))","v":0},{"$f":"IF($A32=\"\",,SUMPRODUCT((LOOKUP(ROW(E$1:E$997),ROW(E$1:E$997)/ISNUMBER('Měsíční rekapitulace'!$L$1:$L$997),'Měsíční rekapitulace'!$L$1:$L$997)=E$4)*('Měsíční rekapitulace'!$A$3:$A$999=$A32)*TEXT('Měsíční rekapitulace'!$Q$3:$Q$999,\"0,0;0;0;\\0\")))","v":0},{"$f":"IF($A32=\"\",,SUMPRODUCT((LOOKUP(ROW(F$1:F$997),ROW(F$1:F$997)/ISNUMBER('Měsíční rekapitulace'!$L$1:$L$997),'Měsíční rekapitulace'!$L$1:$L$997)=F$4)*('Měsíční rekapitulace'!$A$3:$A$999=$A32)*TEXT('Měsíční rekapitulace'!$Q$3:$Q$999,\"0,0;0;0;\\0\")))","v":0},{"$f":"IF($A32=\"\",,SUMPRODUCT((LOOKUP(ROW(G$1:G$997),ROW(G$1:G$997)/ISNUMBER('Měsíční rekapitulace'!$L$1:$L$997),'Měsíční rekapitulace'!$L$1:$L$997)=G$4)*('Měsíční rekapitulace'!$A$3:$A$999=$A32)*TEXT('Měsíční rekapitulace'!$Q$3:$Q$999,\"0,0;0;0;\\0\")))","v":0},{"$f":"IF($A32=\"\",,SUMPRODUCT((LOOKUP(ROW(H$1:H$997),ROW(H$1:H$997)/ISNUMBER('Měsíční rekapitulace'!$L$1:$L$997),'Měsíční rekapitulace'!$L$1:$L$997)=H$4)*('Měsíční rekapitulace'!$A$3:$A$999=$A32)*TEXT('Měsíční rekapitulace'!$Q$3:$Q$999,\"0,0;0;0;\\0\")))","v":0},{"$f":"IF($A32=\"\",,SUMPRODUCT((LOOKUP(ROW(I$1:I$997),ROW(I$1:I$997)/ISNUMBER('Měsíční rekapitulace'!$L$1:$L$997),'Měsíční rekapitulace'!$L$1:$L$997)=I$4)*('Měsíční rekapitulace'!$A$3:$A$999=$A32)*TEXT('Měsíční rekapitulace'!$Q$3:$Q$999,\"0,0;0;0;\\0\")))","v":0},{"$f":"IF($A32=\"\",,SUMPRODUCT((LOOKUP(ROW(J$1:J$997),ROW(J$1:J$997)/ISNUMBER('Měsíční rekapitulace'!$L$1:$L$997),'Měsíční rekapitulace'!$L$1:$L$997)=J$4)*('Měsíční rekapitulace'!$A$3:$A$999=$A32)*TEXT('Měsíční rekapitulace'!$Q$3:$Q$999,\"0,0;0;0;\\0\")))","v":0},{"$f":"IF($A32=\"\",,SUMPRODUCT((LOOKUP(ROW(K$1:K$997),ROW(K$1:K$997)/ISNUMBER('Měsíční rekapitulace'!$L$1:$L$997),'Měsíční rekapitulace'!$L$1:$L$997)=K$4)*('Měsíční rekapitulace'!$A$3:$A$999=$A32)*TEXT('Měsíční rekapitulace'!$Q$3:$Q$999,\"0,0;0;0;\\0\")))","v":0},{"$f":"IF($A32=\"\",,SUMPRODUCT((LOOKUP(ROW(L$1:L$997),ROW(L$1:L$997)/ISNUMBER('Měsíční rekapitulace'!$L$1:$L$997),'Měsíční rekapitulace'!$L$1:$L$997)=L$4)*('Měsíční rekapitulace'!$A$3:$A$999=$A32)*TEXT('Měsíční rekapitulace'!$Q$3:$Q$999,\"0,0;0;0;\\0\")))","v":0},{"$f":"IF($A32=\"\",,SUMPRODUCT((LOOKUP(ROW(M$1:M$997),ROW(M$1:M$997)/ISNUMBER('Měsíční rekapitulace'!$L$1:$L$997),'Měsíční rekapitulace'!$L$1:$L$997)=M$4)*('Měsíční rekapitulace'!$A$3:$A$999=$A32)*TEXT('Měsíční rekapitulace'!$Q$3:$Q$999,\"0,0;0;0;\\0\")))","v":0},{"$f":"IF($A32=\"\",,SUMPRODUCT((LOOKUP(ROW(N$1:N$997),ROW(N$1:N$997)/ISNUMBER('Měsíční rekapitulace'!$L$1:$L$997),'Měsíční rekapitulace'!$L$1:$L$997)=N$4)*('Měsíční rekapitulace'!$A$3:$A$999=$A32)*TEXT('Měsíční rekapitulace'!$Q$3:$Q$999,\"0,0;0;0;\\0\")))","v":0},{"$f":"IF($A32=\"\",,SUMPRODUCT((LOOKUP(ROW(O$1:O$997),ROW(O$1:O$997)/ISNUMBER('Měsíční rekapitulace'!$L$1:$L$997),'Měsíční rekapitulace'!$L$1:$L$997)=O$4)*('Měsíční rekapitulace'!$A$3:$A$999=$A32)*TEXT('Měsíční rekapitulace'!$Q$3:$Q$999,\"0,0;0;0;\\0\")))","v":0},0]
[{"$f":"IFERROR(INDEX('Měsíční rekapitulace'!A$3:A$999,SMALL(IF(('Měsíční rekapitulace'!A$3:A$999<>\"\")*('Měsíční rekapitulace'!A$3:A$999<>'Měsíční rekapitulace'!$A$2)*(COUNTIF(A$5:A32,'Měsíční rekapitulace'!A$3:A$999)=0),ROW('Měsíční rekapitulace'!A$3:A$999)-2),1)),\"\")","v":"S-633"},{"$f":"IFERROR(INDEX('Měsíční rekapitulace'!E$3:E$999,MATCH(A33,'Měsíční rekapitulace'!A$3:A$999,)),\"\")","v":"(SLP) Předání svědka Salipu"},null,{"$f":"IF($A33=\"\",,SUMPRODUCT((LOOKUP(ROW(D$1:D$997),ROW(D$1:D$997)/ISNUMBER('Měsíční rekapitulace'!$L$1:$L$997),'Měsíční rekapitulace'!$L$1:$L$997)=D$4)*('Měsíční rekapitulace'!$A$3:$A$999=$A33)*TEXT('Měsíční rekapitulace'!$Q$3:$Q$999,\"0,0;0;0;\\0\")))","v":0},{"$f":"IF($A33=\"\",,SUMPRODUCT((LOOKUP(ROW(E$1:E$997),ROW(E$1:E$997)/ISNUMBER('Měsíční rekapitulace'!$L$1:$L$997),'Měsíční rekapitulace'!$L$1:$L$997)=E$4)*('Měsíční rekapitulace'!$A$3:$A$999=$A33)*TEXT('Měsíční rekapitulace'!$Q$3:$Q$999,\"0,0;0;0;\\0\")))","v":0},{"$f":"IF($A33=\"\",,SUMPRODUCT((LOOKUP(ROW(F$1:F$997),ROW(F$1:F$997)/ISNUMBER('Měsíční rekapitulace'!$L$1:$L$997),'Měsíční rekapitulace'!$L$1:$L$997)=F$4)*('Měsíční rekapitulace'!$A$3:$A$999=$A33)*TEXT('Měsíční rekapitulace'!$Q$3:$Q$999,\"0,0;0;0;\\0\")))","v":0},{"$f":"IF($A33=\"\",,SUMPRODUCT((LOOKUP(ROW(G$1:G$997),ROW(G$1:G$997)/ISNUMBER('Měsíční rekapitulace'!$L$1:$L$997),'Měsíční rekapitulace'!$L$1:$L$997)=G$4)*('Měsíční rekapitulace'!$A$3:$A$999=$A33)*TEXT('Měsíční rekapitulace'!$Q$3:$Q$999,\"0,0;0;0;\\0\")))","v":0},{"$f":"IF($A33=\"\",,SUMPRODUCT((LOOKUP(ROW(H$1:H$997),ROW(H$1:H$997)/ISNUMBER('Měsíční rekapitulace'!$L$1:$L$997),'Měsíční rekapitulace'!$L$1:$L$997)=H$4)*('Měsíční rekapitulace'!$A$3:$A$999=$A33)*TEXT('Měsíční rekapitulace'!$Q$3:$Q$999,\"0,0;0;0;\\0\")))","v":0},{"$f":"IF($A33=\"\",,SUMPRODUCT((LOOKUP(ROW(I$1:I$997),ROW(I$1:I$997)/ISNUMBER('Měsíční rekapitulace'!$L$1:$L$997),'Měsíční rekapitulace'!$L$1:$L$997)=I$4)*('Měsíční rekapitulace'!$A$3:$A$999=$A33)*TEXT('Měsíční rekapitulace'!$Q$3:$Q$999,\"0,0;0;0;\\0\")))","v":0},{"$f":"IF($A33=\"\",,SUMPRODUCT((LOOKUP(ROW(J$1:J$997),ROW(J$1:J$997)/ISNUMBER('Měsíční rekapitulace'!$L$1:$L$997),'Měsíční rekapitulace'!$L$1:$L$997)=J$4)*('Měsíční rekapitulace'!$A$3:$A$999=$A33)*TEXT('Měsíční rekapitulace'!$Q$3:$Q$999,\"0,0;0;0;\\0\")))","v":0},{"$f":"IF($A33=\"\",,SUMPRODUCT((LOOKUP(ROW(K$1:K$997),ROW(K$1:K$997)/ISNUMBER('Měsíční rekapitulace'!$L$1:$L$997),'Měsíční rekapitulace'!$L$1:$L$997)=K$4)*('Měsíční rekapitulace'!$A$3:$A$999=$A33)*TEXT('Měsíční rekapitulace'!$Q$3:$Q$999,\"0,0;0;0;\\0\")))","v":0},{"$f":"IF($A33=\"\",,SUMPRODUCT((LOOKUP(ROW(L$1:L$997),ROW(L$1:L$997)/ISNUMBER('Měsíční rekapitulace'!$L$1:$L$997),'Měsíční rekapitulace'!$L$1:$L$997)=L$4)*('Měsíční rekapitulace'!$A$3:$A$999=$A33)*TEXT('Měsíční rekapitulace'!$Q$3:$Q$999,\"0,0;0;0;\\0\")))","v":0},{"$f":"IF($A33=\"\",,SUMPRODUCT((LOOKUP(ROW(M$1:M$997),ROW(M$1:M$997)/ISNUMBER('Měsíční rekapitulace'!$L$1:$L$997),'Měsíční rekapitulace'!$L$1:$L$997)=M$4)*('Měsíční rekapitulace'!$A$3:$A$999=$A33)*TEXT('Měsíční rekapitulace'!$Q$3:$Q$999,\"0,0;0;0;\\0\")))","v":0},{"$f":"IF($A33=\"\",,SUMPRODUCT((LOOKUP(ROW(N$1:N$997),ROW(N$1:N$997)/ISNUMBER('Měsíční rekapitulace'!$L$1:$L$997),'Měsíční rekapitulace'!$L$1:$L$997)=N$4)*('Měsíční rekapitulace'!$A$3:$A$999=$A33)*TEXT('Měsíční rekapitulace'!$Q$3:$Q$999,\"0,0;0;0;\\0\")))","v":0},{"$f":"IF($A33=\"\",,SUMPRODUCT((LOOKUP(ROW(O$1:O$997),ROW(O$1:O$997)/ISNUMBER('Měsíční rekapitulace'!$L$1:$L$997),'Měsíční rekapitulace'!$L$1:$L$997)=O$4)*('Měsíční rekapitulace'!$A$3:$A$999=$A33)*TEXT('Měsíční rekapitulace'!$Q$3:$Q$999,\"0,0;0;0;\\0\")))","v":0},0]
[{"$f":"IFERROR(INDEX('Měsíční rekapitulace'!A$3:A$999,SMALL(IF(('Měsíční rekapitulace'!A$3:A$999<>\"\")*('Měsíční rekapitulace'!A$3:A$999<>'Měsíční rekapitulace'!$A$2)*(COUNTIF(A$5:A33,'Měsíční rekapitulace'!A$3:A$999)=0),ROW('Měsíční rekapitulace'!A$3:A$999)-2),1)),\"\")","v":"S-1322"},{"$f":"IFERROR(INDEX('Měsíční rekapitulace'!E$3:E$999,MATCH(A34,'Měsíční rekapitulace'!A$3:A$999,)),\"\")","v":"Úprava zpracování nároků pro L6"},null,{"$f":"IF($A34=\"\",,SUMPRODUCT((LOOKUP(ROW(D$1:D$997),ROW(D$1:D$997)/ISNUMBER('Měsíční rekapitulace'!$L$1:$L$997),'Měsíční rekapitulace'!$L$1:$L$997)=D$4)*('Měsíční rekapitulace'!$A$3:$A$999=$A34)*TEXT('Měsíční rekapitulace'!$Q$3:$Q$999,\"0,0;0;0;\\0\")))","v":0},{"$f":"IF($A34=\"\",,SUMPRODUCT((LOOKUP(ROW(E$1:E$997),ROW(E$1:E$997)/ISNUMBER('Měsíční rekapitulace'!$L$1:$L$997),'Měsíční rekapitulace'!$L$1:$L$997)=E$4)*('Měsíční rekapitulace'!$A$3:$A$999=$A34)*TEXT('Měsíční rekapitulace'!$Q$3:$Q$999,\"0,0;0;0;\\0\")))","v":0},{"$f":"IF($A34=\"\",,SUMPRODUCT((LOOKUP(ROW(F$1:F$997),ROW(F$1:F$997)/ISNUMBER('Měsíční rekapitulace'!$L$1:$L$997),'Měsíční rekapitulace'!$L$1:$L$997)=F$4)*('Měsíční rekapitulace'!$A$3:$A$999=$A34)*TEXT('Měsíční rekapitulace'!$Q$3:$Q$999,\"0,0;0;0;\\0\")))","v":0},{"$f":"IF($A34=\"\",,SUMPRODUCT((LOOKUP(ROW(G$1:G$997),ROW(G$1:G$997)/ISNUMBER('Měsíční rekapitulace'!$L$1:$L$997),'Měsíční rekapitulace'!$L$1:$L$997)=G$4)*('Měsíční rekapitulace'!$A$3:$A$999=$A34)*TEXT('Měsíční rekapitulace'!$Q$3:$Q$999,\"0,0;0;0;\\0\")))","v":0},{"$f":"IF($A34=\"\",,SUMPRODUCT((LOOKUP(ROW(H$1:H$997),ROW(H$1:H$997)/ISNUMBER('Měsíční rekapitulace'!$L$1:$L$997),'Měsíční rekapitulace'!$L$1:$L$997)=H$4)*('Měsíční rekapitulace'!$A$3:$A$999=$A34)*TEXT('Měsíční rekapitulace'!$Q$3:$Q$999,\"0,0;0;0;\\0\")))","v":0},{"$f":"IF($A34=\"\",,SUMPRODUCT((LOOKUP(ROW(I$1:I$997),ROW(I$1:I$997)/ISNUMBER('Měsíční rekapitulace'!$L$1:$L$997),'Měsíční rekapitulace'!$L$1:$L$997)=I$4)*('Měsíční rekapitulace'!$A$3:$A$999=$A34)*TEXT('Měsíční rekapitulace'!$Q$3:$Q$999,\"0,0;0;0;\\0\")))","v":0},{"$f":"IF($A34=\"\",,SUMPRODUCT((LOOKUP(ROW(J$1:J$997),ROW(J$1:J$997)/ISNUMBER('Měsíční rekapitulace'!$L$1:$L$997),'Měsíční rekapitulace'!$L$1:$L$997)=J$4)*('Měsíční rekapitulace'!$A$3:$A$999=$A34)*TEXT('Měsíční rekapitulace'!$Q$3:$Q$999,\"0,0;0;0;\\0\")))","v":0},{"$f":"IF($A34=\"\",,SUMPRODUCT((LOOKUP(ROW(K$1:K$997),ROW(K$1:K$997)/ISNUMBER('Měsíční rekapitulace'!$L$1:$L$997),'Měsíční rekapitulace'!$L$1:$L$997)=K$4)*('Měsíční rekapitulace'!$A$3:$A$999=$A34)*TEXT('Měsíční rekapitulace'!$Q$3:$Q$999,\"0,0;0;0;\\0\")))","v":0},{"$f":"IF($A34=\"\",,SUMPRODUCT((LOOKUP(ROW(L$1:L$997),ROW(L$1:L$997)/ISNUMBER('Měsíční rekapitulace'!$L$1:$L$997),'Měsíční rekapitulace'!$L$1:$L$997)=L$4)*('Měsíční rekapitulace'!$A$3:$A$999=$A34)*TEXT('Měsíční rekapitulace'!$Q$3:$Q$999,\"0,0;0;0;\\0\")))","v":0},{"$f":"IF($A34=\"\",,SUMPRODUCT((LOOKUP(ROW(M$1:M$997),ROW(M$1:M$997)/ISNUMBER('Měsíční rekapitulace'!$L$1:$L$997),'Měsíční rekapitulace'!$L$1:$L$997)=M$4)*('Měsíční rekapitulace'!$A$3:$A$999=$A34)*TEXT('Měsíční rekapitulace'!$Q$3:$Q$999,\"0,0;0;0;\\0\")))","v":0},{"$f":"IF($A34=\"\",,SUMPRODUCT((LOOKUP(ROW(N$1:N$997),ROW(N$1:N$997)/ISNUMBER('Měsíční rekapitulace'!$L$1:$L$997),'Měsíční rekapitulace'!$L$1:$L$997)=N$4)*('Měsíční rekapitulace'!$A$3:$A$999=$A34)*TEXT('Měsíční rekapitulace'!$Q$3:$Q$999,\"0,0;0;0;\\0\")))","v":0},{"$f":"IF($A34=\"\",,SUMPRODUCT((LOOKUP(ROW(O$1:O$997),ROW(O$1:O$997)/ISNUMBER('Měsíční rekapitulace'!$L$1:$L$997),'Měsíční rekapitulace'!$L$1:$L$997)=O$4)*('Měsíční rekapitulace'!$A$3:$A$999=$A34)*TEXT('Měsíční rekapitulace'!$Q$3:$Q$999,\"0,0;0;0;\\0\")))","v":0},0]
[{"$f":"IFERROR(INDEX('Měsíční rekapitulace'!A$3:A$999,SMALL(IF(('Měsíční rekapitulace'!A$3:A$999<>\"\")*('Měsíční rekapitulace'!A$3:A$999<>'Měsíční rekapitulace'!$A$2)*(COUNTIF(A$5:A34,'Měsíční rekapitulace'!A$3:A$999)=0),ROW('Měsíční rekapitulace'!A$3:A$999)-2),1)),\"\")","v":"S-1954"},{"$f":"IFERROR(INDEX('Měsíční rekapitulace'!E$3:E$999,MATCH(A35,'Měsíční rekapitulace'!A$3:A$999,)),\"\")","v":"Původní záznamy adres"},null,{"$f":"IF($A35=\"\",,SUMPRODUCT((LOOKUP(ROW(D$1:D$997),ROW(D$1:D$997)/ISNUMBER('Měsíční rekapitulace'!$L$1:$L$997),'Měsíční rekapitulace'!$L$1:$L$997)=D$4)*('Měsíční rekapitulace'!$A$3:$A$999=$A35)*TEXT('Měsíční rekapitulace'!$Q$3:$Q$999,\"0,0;0;0;\\0\")))","v":0},{"$f":"IF($A35=\"\",,SUMPRODUCT((LOOKUP(ROW(E$1:E$997),ROW(E$1:E$997)/ISNUMBER('Měsíční rekapitulace'!$L$1:$L$997),'Měsíční rekapitulace'!$L$1:$L$997)=E$4)*('Měsíční rekapitulace'!$A$3:$A$999=$A35)*TEXT('Měsíční rekapitulace'!$Q$3:$Q$999,\"0,0;0;0;\\0\")))","v":0},{"$f":"IF($A35=\"\",,SUMPRODUCT((LOOKUP(ROW(F$1:F$997),ROW(F$1:F$997)/ISNUMBER('Měsíční rekapitulace'!$L$1:$L$997),'Měsíční rekapitulace'!$L$1:$L$997)=F$4)*('Měsíční rekapitulace'!$A$3:$A$999=$A35)*TEXT('Měsíční rekapitulace'!$Q$3:$Q$999,\"0,0;0;0;\\0\")))","v":0},{"$f":"IF($A35=\"\",,SUMPRODUCT((LOOKUP(ROW(G$1:G$997),ROW(G$1:G$997)/ISNUMBER('Měsíční rekapitulace'!$L$1:$L$997),'Měsíční rekapitulace'!$L$1:$L$997)=G$4)*('Měsíční rekapitulace'!$A$3:$A$999=$A35)*TEXT('Měsíční rekapitulace'!$Q$3:$Q$999,\"0,0;0;0;\\0\")))","v":0},{"$f":"IF($A35=\"\",,SUMPRODUCT((LOOKUP(ROW(H$1:H$997),ROW(H$1:H$997)/ISNUMBER('Měsíční rekapitulace'!$L$1:$L$997),'Měsíční rekapitulace'!$L$1:$L$997)=H$4)*('Měsíční rekapitulace'!$A$3:$A$999=$A35)*TEXT('Měsíční rekapitulace'!$Q$3:$Q$999,\"0,0;0;0;\\0\")))","v":0},{"$f":"IF($A35=\"\",,SUMPRODUCT((LOOKUP(ROW(I$1:I$997),ROW(I$1:I$997)/ISNUMBER('Měsíční rekapitulace'!$L$1:$L$997),'Měsíční rekapitulace'!$L$1:$L$997)=I$4)*('Měsíční rekapitulace'!$A$3:$A$999=$A35)*TEXT('Měsíční rekapitulace'!$Q$3:$Q$999,\"0,0;0;0;\\0\")))","v":0},{"$f":"IF($A35=\"\",,SUMPRODUCT((LOOKUP(ROW(J$1:J$997),ROW(J$1:J$997)/ISNUMBER('Měsíční rekapitulace'!$L$1:$L$997),'Měsíční rekapitulace'!$L$1:$L$997)=J$4)*('Měsíční rekapitulace'!$A$3:$A$999=$A35)*TEXT('Měsíční rekapitulace'!$Q$3:$Q$999,\"0,0;0;0;\\0\")))","v":0},{"$f":"IF($A35=\"\",,SUMPRODUCT((LOOKUP(ROW(K$1:K$997),ROW(K$1:K$997)/ISNUMBER('Měsíční rekapitulace'!$L$1:$L$997),'Měsíční rekapitulace'!$L$1:$L$997)=K$4)*('Měsíční rekapitulace'!$A$3:$A$999=$A35)*TEXT('Měsíční rekapitulace'!$Q$3:$Q$999,\"0,0;0;0;\\0\")))","v":0},{"$f":"IF($A35=\"\",,SUMPRODUCT((LOOKUP(ROW(L$1:L$997),ROW(L$1:L$997)/ISNUMBER('Měsíční rekapitulace'!$L$1:$L$997),'Měsíční rekapitulace'!$L$1:$L$997)=L$4)*('Měsíční rekapitulace'!$A$3:$A$999=$A35)*TEXT('Měsíční rekapitulace'!$Q$3:$Q$999,\"0,0;0;0;\\0\")))","v":0},{"$f":"IF($A35=\"\",,SUMPRODUCT((LOOKUP(ROW(M$1:M$997),ROW(M$1:M$997)/ISNUMBER('Měsíční rekapitulace'!$L$1:$L$997),'Měsíční rekapitulace'!$L$1:$L$997)=M$4)*('Měsíční rekapitulace'!$A$3:$A$999=$A35)*TEXT('Měsíční rekapitulace'!$Q$3:$Q$999,\"0,0;0;0;\\0\")))","v":0},{"$f":"IF($A35=\"\",,SUMPRODUCT((LOOKUP(ROW(N$1:N$997),ROW(N$1:N$997)/ISNUMBER('Měsíční rekapitulace'!$L$1:$L$997),'Měsíční rekapitulace'!$L$1:$L$997)=N$4)*('Měsíční rekapitulace'!$A$3:$A$999=$A35)*TEXT('Měsíční rekapitulace'!$Q$3:$Q$999,\"0,0;0;0;\\0\")))","v":0},{"$f":"IF($A35=\"\",,SUMPRODUCT((LOOKUP(ROW(O$1:O$997),ROW(O$1:O$997)/ISNUMBER('Měsíční rekapitulace'!$L$1:$L$997),'Měsíční rekapitulace'!$L$1:$L$997)=O$4)*('Měsíční rekapitulace'!$A$3:$A$999=$A35)*TEXT('Měsíční rekapitulace'!$Q$3:$Q$999,\"0,0;0;0;\\0\")))","v":0},0]
[{"$f":"IFERROR(INDEX('Měsíční rekapitulace'!A$3:A$999,SMALL(IF(('Měsíční rekapitulace'!A$3:A$999<>\"\")*('Měsíční rekapitulace'!A$3:A$999<>'Měsíční rekapitulace'!$A$2)*(COUNTIF(A$5:A35,'Měsíční rekapitulace'!A$3:A$999)=0),ROW('Měsíční rekapitulace'!A$3:A$999)-2),1)),\"\")","v":"S-2126"},{"$f":"IFERROR(INDEX('Měsíční rekapitulace'!E$3:E$999,MATCH(A36,'Měsíční rekapitulace'!A$3:A$999,)),\"\")","v":"Logování změněných přenesených znaků do FIS CODA"},null,{"$f":"IF($A36=\"\",,SUMPRODUCT((LOOKUP(ROW(D$1:D$997),ROW(D$1:D$997)/ISNUMBER('Měsíční rekapitulace'!$L$1:$L$997),'Měsíční rekapitulace'!$L$1:$L$997)=D$4)*('Měsíční rekapitulace'!$A$3:$A$999=$A36)*TEXT('Měsíční rekapitulace'!$Q$3:$Q$999,\"0,0;0;0;\\0\")))","v":0},{"$f":"IF($A36=\"\",,SUMPRODUCT((LOOKUP(ROW(E$1:E$997),ROW(E$1:E$997)/ISNUMBER('Měsíční rekapitulace'!$L$1:$L$997),'Měsíční rekapitulace'!$L$1:$L$997)=E$4)*('Měsíční rekapitulace'!$A$3:$A$999=$A36)*TEXT('Měsíční rekapitulace'!$Q$3:$Q$999,\"0,0;0;0;\\0\")))","v":0},{"$f":"IF($A36=\"\",,SUMPRODUCT((LOOKUP(ROW(F$1:F$997),ROW(F$1:F$997)/ISNUMBER('Měsíční rekapitulace'!$L$1:$L$997),'Měsíční rekapitulace'!$L$1:$L$997)=F$4)*('Měsíční rekapitulace'!$A$3:$A$999=$A36)*TEXT('Měsíční rekapitulace'!$Q$3:$Q$999,\"0,0;0;0;\\0\")))","v":0},{"$f":"IF($A36=\"\",,SUMPRODUCT((LOOKUP(ROW(G$1:G$997),ROW(G$1:G$997)/ISNUMBER('Měsíční rekapitulace'!$L$1:$L$997),'Měsíční rekapitulace'!$L$1:$L$997)=G$4)*('Měsíční rekapitulace'!$A$3:$A$999=$A36)*TEXT('Měsíční rekapitulace'!$Q$3:$Q$999,\"0,0;0;0;\\0\")))","v":0},{"$f":"IF($A36=\"\",,SUMPRODUCT((LOOKUP(ROW(H$1:H$997),ROW(H$1:H$997)/ISNUMBER('Měsíční rekapitulace'!$L$1:$L$997),'Měsíční rekapitulace'!$L$1:$L$997)=H$4)*('Měsíční rekapitulace'!$A$3:$A$999=$A36)*TEXT('Měsíční rekapitulace'!$Q$3:$Q$999,\"0,0;0;0;\\0\")))","v":0},{"$f":"IF($A36=\"\",,SUMPRODUCT((LOOKUP(ROW(I$1:I$997),ROW(I$1:I$997)/ISNUMBER('Měsíční rekapitulace'!$L$1:$L$997),'Měsíční rekapitulace'!$L$1:$L$997)=I$4)*('Měsíční rekapitulace'!$A$3:$A$999=$A36)*TEXT('Měsíční rekapitulace'!$Q$3:$Q$999,\"0,0;0;0;\\0\")))","v":0},{"$f":"IF($A36=\"\",,SUMPRODUCT((LOOKUP(ROW(J$1:J$997),ROW(J$1:J$997)/ISNUMBER('Měsíční rekapitulace'!$L$1:$L$997),'Měsíční rekapitulace'!$L$1:$L$997)=J$4)*('Měsíční rekapitulace'!$A$3:$A$999=$A36)*TEXT('Měsíční rekapitulace'!$Q$3:$Q$999,\"0,0;0;0;\\0\")))","v":0},{"$f":"IF($A36=\"\",,SUMPRODUCT((LOOKUP(ROW(K$1:K$997),ROW(K$1:K$997)/ISNUMBER('Měsíční rekapitulace'!$L$1:$L$997),'Měsíční rekapitulace'!$L$1:$L$997)=K$4)*('Měsíční rekapitulace'!$A$3:$A$999=$A36)*TEXT('Měsíční rekapitulace'!$Q$3:$Q$999,\"0,0;0;0;\\0\")))","v":0},{"$f":"IF($A36=\"\",,SUMPRODUCT((LOOKUP(ROW(L$1:L$997),ROW(L$1:L$997)/ISNUMBER('Měsíční rekapitulace'!$L$1:$L$997),'Měsíční rekapitulace'!$L$1:$L$997)=L$4)*('Měsíční rekapitulace'!$A$3:$A$999=$A36)*TEXT('Měsíční rekapitulace'!$Q$3:$Q$999,\"0,0;0;0;\\0\")))","v":0},{"$f":"IF($A36=\"\",,SUMPRODUCT((LOOKUP(ROW(M$1:M$997),ROW(M$1:M$997)/ISNUMBER('Měsíční rekapitulace'!$L$1:$L$997),'Měsíční rekapitulace'!$L$1:$L$997)=M$4)*('Měsíční rekapitulace'!$A$3:$A$999=$A36)*TEXT('Měsíční rekapitulace'!$Q$3:$Q$999,\"0,0;0;0;\\0\")))","v":0},{"$f":"IF($A36=\"\",,SUMPRODUCT((LOOKUP(ROW(N$1:N$997),ROW(N$1:N$997)/ISNUMBER('Měsíční rekapitulace'!$L$1:$L$997),'Měsíční rekapitulace'!$L$1:$L$997)=N$4)*('Měsíční rekapitulace'!$A$3:$A$999=$A36)*TEXT('Měsíční rekapitulace'!$Q$3:$Q$999,\"0,0;0;0;\\0\")))","v":0},{"$f":"IF($A36=\"\",,SUMPRODUCT((LOOKUP(ROW(O$1:O$997),ROW(O$1:O$997)/ISNUMBER('Měsíční rekapitulace'!$L$1:$L$997),'Měsíční rekapitulace'!$L$1:$L$997)=O$4)*('Měsíční rekapitulace'!$A$3:$A$999=$A36)*TEXT('Měsíční rekapitulace'!$Q$3:$Q$999,\"0,0;0;0;\\0\")))","v":0},0]
[{"$f":"IFERROR(INDEX('Měsíční rekapitulace'!A$3:A$999,SMALL(IF(('Měsíční rekapitulace'!A$3:A$999<>\"\")*('Měsíční rekapitulace'!A$3:A$999<>'Měsíční rekapitulace'!$A$2)*(COUNTIF(A$5:A36,'Měsíční rekapitulace'!A$3:A$999)=0),ROW('Měsíční rekapitulace'!A$3:A$999)-2),1)),\"\")","v":"S-2162"},{"$f":"IFERROR(INDEX('Měsíční rekapitulace'!E$3:E$999,MATCH(A37,'Měsíční rekapitulace'!A$3:A$999,)),\"\")","v":"Úprava APV pro zrychlení zpracování dávek L1 a P1"},null,{"$f":"IF($A37=\"\",,SUMPRODUCT((LOOKUP(ROW(D$1:D$997),ROW(D$1:D$997)/ISNUMBER('Měsíční rekapitulace'!$L$1:$L$997),'Měsíční rekapitulace'!$L$1:$L$997)=D$4)*('Měsíční rekapitulace'!$A$3:$A$999=$A37)*TEXT('Měsíční rekapitulace'!$Q$3:$Q$999,\"0,0;0;0;\\0\")))","v":0},{"$f":"IF($A37=\"\",,SUMPRODUCT((LOOKUP(ROW(E$1:E$997),ROW(E$1:E$997)/ISNUMBER('Měsíční rekapitulace'!$L$1:$L$997),'Měsíční rekapitulace'!$L$1:$L$997)=E$4)*('Měsíční rekapitulace'!$A$3:$A$999=$A37)*TEXT('Měsíční rekapitulace'!$Q$3:$Q$999,\"0,0;0;0;\\0\")))","v":0},{"$f":"IF($A37=\"\",,SUMPRODUCT((LOOKUP(ROW(F$1:F$997),ROW(F$1:F$997)/ISNUMBER('Měsíční rekapitulace'!$L$1:$L$997),'Měsíční rekapitulace'!$L$1:$L$997)=F$4)*('Měsíční rekapitulace'!$A$3:$A$999=$A37)*TEXT('Měsíční rekapitulace'!$Q$3:$Q$999,\"0,0;0;0;\\0\")))","v":0},{"$f":"IF($A37=\"\",,SUMPRODUCT((LOOKUP(ROW(G$1:G$997),ROW(G$1:G$997)/ISNUMBER('Měsíční rekapitulace'!$L$1:$L$997),'Měsíční rekapitulace'!$L$1:$L$997)=G$4)*('Měsíční rekapitulace'!$A$3:$A$999=$A37)*TEXT('Měsíční rekapitulace'!$Q$3:$Q$999,\"0,0;0;0;\\0\")))","v":0},{"$f":"IF($A37=\"\",,SUMPRODUCT((LOOKUP(ROW(H$1:H$997),ROW(H$1:H$997)/ISNUMBER('Měsíční rekapitulace'!$L$1:$L$997),'Měsíční rekapitulace'!$L$1:$L$997)=H$4)*('Měsíční rekapitulace'!$A$3:$A$999=$A37)*TEXT('Měsíční rekapitulace'!$Q$3:$Q$999,\"0,0;0;0;\\0\")))","v":0},{"$f":"IF($A37=\"\",,SUMPRODUCT((LOOKUP(ROW(I$1:I$997),ROW(I$1:I$997)/ISNUMBER('Měsíční rekapitulace'!$L$1:$L$997),'Měsíční rekapitulace'!$L$1:$L$997)=I$4)*('Měsíční rekapitulace'!$A$3:$A$999=$A37)*TEXT('Měsíční rekapitulace'!$Q$3:$Q$999,\"0,0;0;0;\\0\")))","v":0},{"$f":"IF($A37=\"\",,SUMPRODUCT((LOOKUP(ROW(J$1:J$997),ROW(J$1:J$997)/ISNUMBER('Měsíční rekapitulace'!$L$1:$L$997),'Měsíční rekapitulace'!$L$1:$L$997)=J$4)*('Měsíční rekapitulace'!$A$3:$A$999=$A37)*TEXT('Měsíční rekapitulace'!$Q$3:$Q$999,\"0,0;0;0;\\0\")))","v":0},{"$f":"IF($A37=\"\",,SUMPRODUCT((LOOKUP(ROW(K$1:K$997),ROW(K$1:K$997)/ISNUMBER('Měsíční rekapitulace'!$L$1:$L$997),'Měsíční rekapitulace'!$L$1:$L$997)=K$4)*('Měsíční rekapitulace'!$A$3:$A$999=$A37)*TEXT('Měsíční rekapitulace'!$Q$3:$Q$999,\"0,0;0;0;\\0\")))","v":0},{"$f":"IF($A37=\"\",,SUMPRODUCT((LOOKUP(ROW(L$1:L$997),ROW(L$1:L$997)/ISNUMBER('Měsíční rekapitulace'!$L$1:$L$997),'Měsíční rekapitulace'!$L$1:$L$997)=L$4)*('Měsíční rekapitulace'!$A$3:$A$999=$A37)*TEXT('Měsíční rekapitulace'!$Q$3:$Q$999,\"0,0;0;0;\\0\")))","v":0},{"$f":"IF($A37=\"\",,SUMPRODUCT((LOOKUP(ROW(M$1:M$997),ROW(M$1:M$997)/ISNUMBER('Měsíční rekapitulace'!$L$1:$L$997),'Měsíční rekapitulace'!$L$1:$L$997)=M$4)*('Měsíční rekapitulace'!$A$3:$A$999=$A37)*TEXT('Měsíční rekapitulace'!$Q$3:$Q$999,\"0,0;0;0;\\0\")))","v":0},{"$f":"IF($A37=\"\",,SUMPRODUCT((LOOKUP(ROW(N$1:N$997),ROW(N$1:N$997)/ISNUMBER('Měsíční rekapitulace'!$L$1:$L$997),'Měsíční rekapitulace'!$L$1:$L$997)=N$4)*('Měsíční rekapitulace'!$A$3:$A$999=$A37)*TEXT('Měsíční rekapitulace'!$Q$3:$Q$999,\"0,0;0;0;\\0\")))","v":0},{"$f":"IF($A37=\"\",,SUMPRODUCT((LOOKUP(ROW(O$1:O$997),ROW(O$1:O$997)/ISNUMBER('Měsíční rekapitulace'!$L$1:$L$997),'Měsíční rekapitulace'!$L$1:$L$997)=O$4)*('Měsíční rekapitulace'!$A$3:$A$999=$A37)*TEXT('Měsíční rekapitulace'!$Q$3:$Q$999,\"0,0;0;0;\\0\")))","v":0},0]
[{"$f":"IFERROR(INDEX('Měsíční rekapitulace'!A$3:A$999,SMALL(IF(('Měsíční rekapitulace'!A$3:A$999<>\"\")*('Měsíční rekapitulace'!A$3:A$999<>'Měsíční rekapitulace'!$A$2)*(COUNTIF(A$5:A37,'Měsíční rekapitulace'!A$3:A$999)=0),ROW('Měsíční rekapitulace'!A$3:A$999)-2),1)),\"\")","v":"S-1154"},{"$f":"IFERROR(INDEX('Měsíční rekapitulace'!E$3:E$999,MATCH(A38,'Měsíční rekapitulace'!A$3:A$999,)),\"\")","v":"Automatická kontrola POV"},null,{"$f":"IF($A38=\"\",,SUMPRODUCT((LOOKUP(ROW(D$1:D$997),ROW(D$1:D$997)/ISNUMBER('Měsíční rekapitulace'!$L$1:$L$997),'Měsíční rekapitulace'!$L$1:$L$997)=D$4)*('Měsíční rekapitulace'!$A$3:$A$999=$A38)*TEXT('Měsíční rekapitulace'!$Q$3:$Q$999,\"0,0;0;0;\\0\")))","v":0},{"$f":"IF($A38=\"\",,SUMPRODUCT((LOOKUP(ROW(E$1:E$997),ROW(E$1:E$997)/ISNUMBER('Měsíční rekapitulace'!$L$1:$L$997),'Měsíční rekapitulace'!$L$1:$L$997)=E$4)*('Měsíční rekapitulace'!$A$3:$A$999=$A38)*TEXT('Měsíční rekapitulace'!$Q$3:$Q$999,\"0,0;0;0;\\0\")))","v":0},{"$f":"IF($A38=\"\",,SUMPRODUCT((LOOKUP(ROW(F$1:F$997),ROW(F$1:F$997)/ISNUMBER('Měsíční rekapitulace'!$L$1:$L$997),'Měsíční rekapitulace'!$L$1:$L$997)=F$4)*('Měsíční rekapitulace'!$A$3:$A$999=$A38)*TEXT('Měsíční rekapitulace'!$Q$3:$Q$999,\"0,0;0;0;\\0\")))","v":0},{"$f":"IF($A38=\"\",,SUMPRODUCT((LOOKUP(ROW(G$1:G$997),ROW(G$1:G$997)/ISNUMBER('Měsíční rekapitulace'!$L$1:$L$997),'Měsíční rekapitulace'!$L$1:$L$997)=G$4)*('Měsíční rekapitulace'!$A$3:$A$999=$A38)*TEXT('Měsíční rekapitulace'!$Q$3:$Q$999,\"0,0;0;0;\\0\")))","v":0},{"$f":"IF($A38=\"\",,SUMPRODUCT((LOOKUP(ROW(H$1:H$997),ROW(H$1:H$997)/ISNUMBER('Měsíční rekapitulace'!$L$1:$L$997),'Měsíční rekapitulace'!$L$1:$L$997)=H$4)*('Měsíční rekapitulace'!$A$3:$A$999=$A38)*TEXT('Měsíční rekapitulace'!$Q$3:$Q$999,\"0,0;0;0;\\0\")))","v":0},{"$f":"IF($A38=\"\",,SUMPRODUCT((LOOKUP(ROW(I$1:I$997),ROW(I$1:I$997)/ISNUMBER('Měsíční rekapitulace'!$L$1:$L$997),'Měsíční rekapitulace'!$L$1:$L$997)=I$4)*('Měsíční rekapitulace'!$A$3:$A$999=$A38)*TEXT('Měsíční rekapitulace'!$Q$3:$Q$999,\"0,0;0;0;\\0\")))","v":0},{"$f":"IF($A38=\"\",,SUMPRODUCT((LOOKUP(ROW(J$1:J$997),ROW(J$1:J$997)/ISNUMBER('Měsíční rekapitulace'!$L$1:$L$997),'Měsíční rekapitulace'!$L$1:$L$997)=J$4)*('Měsíční rekapitulace'!$A$3:$A$999=$A38)*TEXT('Měsíční rekapitulace'!$Q$3:$Q$999,\"0,0;0;0;\\0\")))","v":0},{"$f":"IF($A38=\"\",,SUMPRODUCT((LOOKUP(ROW(K$1:K$997),ROW(K$1:K$997)/ISNUMBER('Měsíční rekapitulace'!$L$1:$L$997),'Měsíční rekapitulace'!$L$1:$L$997)=K$4)*('Měsíční rekapitulace'!$A$3:$A$999=$A38)*TEXT('Měsíční rekapitulace'!$Q$3:$Q$999,\"0,0;0;0;\\0\")))","v":0},{"$f":"IF($A38=\"\",,SUMPRODUCT((LOOKUP(ROW(L$1:L$997),ROW(L$1:L$997)/ISNUMBER('Měsíční rekapitulace'!$L$1:$L$997),'Měsíční rekapitulace'!$L$1:$L$997)=L$4)*('Měsíční rekapitulace'!$A$3:$A$999=$A38)*TEXT('Měsíční rekapitulace'!$Q$3:$Q$999,\"0,0;0;0;\\0\")))","v":0},{"$f":"IF($A38=\"\",,SUMPRODUCT((LOOKUP(ROW(M$1:M$997),ROW(M$1:M$997)/ISNUMBER('Měsíční rekapitulace'!$L$1:$L$997),'Měsíční rekapitulace'!$L$1:$L$997)=M$4)*('Měsíční rekapitulace'!$A$3:$A$999=$A38)*TEXT('Měsíční rekapitulace'!$Q$3:$Q$999,\"0,0;0;0;\\0\")))","v":0},{"$f":"IF($A38=\"\",,SUMPRODUCT((LOOKUP(ROW(N$1:N$997),ROW(N$1:N$997)/ISNUMBER('Měsíční rekapitulace'!$L$1:$L$997),'Měsíční rekapitulace'!$L$1:$L$997)=N$4)*('Měsíční rekapitulace'!$A$3:$A$999=$A38)*TEXT('Měsíční rekapitulace'!$Q$3:$Q$999,\"0,0;0;0;\\0\")))","v":0},{"$f":"IF($A38=\"\",,SUMPRODUCT((LOOKUP(ROW(O$1:O$997),ROW(O$1:O$997)/ISNUMBER('Měsíční rekapitulace'!$L$1:$L$997),'Měsíční rekapitulace'!$L$1:$L$997)=O$4)*('Měsíční rekapitulace'!$A$3:$A$999=$A38)*TEXT('Měsíční rekapitulace'!$Q$3:$Q$999,\"0,0;0;0;\\0\")))","v":0},0]
[{"$f":"IFERROR(INDEX('Měsíční rekapitulace'!A$3:A$999,SMALL(IF(('Měsíční rekapitulace'!A$3:A$999<>\"\")*('Měsíční rekapitulace'!A$3:A$999<>'Měsíční rekapitulace'!$A$2)*(COUNTIF(A$5:A38,'Měsíční rekapitulace'!A$3:A$999)=0),ROW('Měsíční rekapitulace'!A$3:A$999)-2),1)),\"\")","v":"S-2259"},{"$f":"IFERROR(INDEX('Měsíční rekapitulace'!E$3:E$999,MATCH(A39,'Měsíční rekapitulace'!A$3:A$999,)),\"\")","v":"Administrace plánovaných řídících operací"},null,{"$f":"IF($A39=\"\",,SUMPRODUCT((LOOKUP(ROW(D$1:D$997),ROW(D$1:D$997)/ISNUMBER('Měsíční rekapitulace'!$L$1:$L$997),'Měsíční rekapitulace'!$L$1:$L$997)=D$4)*('Měsíční rekapitulace'!$A$3:$A$999=$A39)*TEXT('Měsíční rekapitulace'!$Q$3:$Q$999,\"0,0;0;0;\\0\")))","v":0},{"$f":"IF($A39=\"\",,SUMPRODUCT((LOOKUP(ROW(E$1:E$997),ROW(E$1:E$997)/ISNUMBER('Měsíční rekapitulace'!$L$1:$L$997),'Měsíční rekapitulace'!$L$1:$L$997)=E$4)*('Měsíční rekapitulace'!$A$3:$A$999=$A39)*TEXT('Měsíční rekapitulace'!$Q$3:$Q$999,\"0,0;0;0;\\0\")))","v":0},{"$f":"IF($A39=\"\",,SUMPRODUCT((LOOKUP(ROW(F$1:F$997),ROW(F$1:F$997)/ISNUMBER('Měsíční rekapitulace'!$L$1:$L$997),'Měsíční rekapitulace'!$L$1:$L$997)=F$4)*('Měsíční rekapitulace'!$A$3:$A$999=$A39)*TEXT('Měsíční rekapitulace'!$Q$3:$Q$999,\"0,0;0;0;\\0\")))","v":0},{"$f":"IF($A39=\"\",,SUMPRODUCT((LOOKUP(ROW(G$1:G$997),ROW(G$1:G$997)/ISNUMBER('Měsíční rekapitulace'!$L$1:$L$997),'Měsíční rekapitulace'!$L$1:$L$997)=G$4)*('Měsíční rekapitulace'!$A$3:$A$999=$A39)*TEXT('Měsíční rekapitulace'!$Q$3:$Q$999,\"0,0;0;0;\\0\")))","v":0},{"$f":"IF($A39=\"\",,SUMPRODUCT((LOOKUP(ROW(H$1:H$997),ROW(H$1:H$997)/ISNUMBER('Měsíční rekapitulace'!$L$1:$L$997),'Měsíční rekapitulace'!$L$1:$L$997)=H$4)*('Měsíční rekapitulace'!$A$3:$A$999=$A39)*TEXT('Měsíční rekapitulace'!$Q$3:$Q$999,\"0,0;0;0;\\0\")))","v":0},{"$f":"IF($A39=\"\",,SUMPRODUCT((LOOKUP(ROW(I$1:I$997),ROW(I$1:I$997)/ISNUMBER('Měsíční rekapitulace'!$L$1:$L$997),'Měsíční rekapitulace'!$L$1:$L$997)=I$4)*('Měsíční rekapitulace'!$A$3:$A$999=$A39)*TEXT('Měsíční rekapitulace'!$Q$3:$Q$999,\"0,0;0;0;\\0\")))","v":0},{"$f":"IF($A39=\"\",,SUMPRODUCT((LOOKUP(ROW(J$1:J$997),ROW(J$1:J$997)/ISNUMBER('Měsíční rekapitulace'!$L$1:$L$997),'Měsíční rekapitulace'!$L$1:$L$997)=J$4)*('Měsíční rekapitulace'!$A$3:$A$999=$A39)*TEXT('Měsíční rekapitulace'!$Q$3:$Q$999,\"0,0;0;0;\\0\")))","v":0},{"$f":"IF($A39=\"\",,SUMPRODUCT((LOOKUP(ROW(K$1:K$997),ROW(K$1:K$997)/ISNUMBER('Měsíční rekapitulace'!$L$1:$L$997),'Měsíční rekapitulace'!$L$1:$L$997)=K$4)*('Měsíční rekapitulace'!$A$3:$A$999=$A39)*TEXT('Měsíční rekapitulace'!$Q$3:$Q$999,\"0,0;0;0;\\0\")))","v":0},{"$f":"IF($A39=\"\",,SUMPRODUCT((LOOKUP(ROW(L$1:L$997),ROW(L$1:L$997)/ISNUMBER('Měsíční rekapitulace'!$L$1:$L$997),'Měsíční rekapitulace'!$L$1:$L$997)=L$4)*('Měsíční rekapitulace'!$A$3:$A$999=$A39)*TEXT('Měsíční rekapitulace'!$Q$3:$Q$999,\"0,0;0;0;\\0\")))","v":0},{"$f":"IF($A39=\"\",,SUMPRODUCT((LOOKUP(ROW(M$1:M$997),ROW(M$1:M$997)/ISNUMBER('Měsíční rekapitulace'!$L$1:$L$997),'Měsíční rekapitulace'!$L$1:$L$997)=M$4)*('Měsíční rekapitulace'!$A$3:$A$999=$A39)*TEXT('Měsíční rekapitulace'!$Q$3:$Q$999,\"0,0;0;0;\\0\")))","v":0},{"$f":"IF($A39=\"\",,SUMPRODUCT((LOOKUP(ROW(N$1:N$997),ROW(N$1:N$997)/ISNUMBER('Měsíční rekapitulace'!$L$1:$L$997),'Měsíční rekapitulace'!$L$1:$L$997)=N$4)*('Měsíční rekapitulace'!$A$3:$A$999=$A39)*TEXT('Měsíční rekapitulace'!$Q$3:$Q$999,\"0,0;0;0;\\0\")))","v":0},{"$f":"IF($A39=\"\",,SUMPRODUCT((LOOKUP(ROW(O$1:O$997),ROW(O$1:O$997)/ISNUMBER('Měsíční rekapitulace'!$L$1:$L$997),'Měsíční rekapitulace'!$L$1:$L$997)=O$4)*('Měsíční rekapitulace'!$A$3:$A$999=$A39)*TEXT('Měsíční rekapitulace'!$Q$3:$Q$999,\"0,0;0;0;\\0\")))","v":46.5},{"$f":"SUM(D39:O39)","v":46.5}]
[{"$f":"IFERROR(INDEX('Měsíční rekapitulace'!A$3:A$999,SMALL(IF(('Měsíční rekapitulace'!A$3:A$999<>\"\")*('Měsíční rekapitulace'!A$3:A$999<>'Měsíční rekapitulace'!$A$2)*(COUNTIF(A$5:A39,'Měsíční rekapitulace'!A$3:A$999)=0),ROW('Měsíční rekapitulace'!A$3:A$999)-2),1)),\"\")","v":"S-2260"},{"$f":"IFERROR(INDEX('Měsíční rekapitulace'!E$3:E$999,MATCH(A40,'Měsíční rekapitulace'!A$3:A$999,)),\"\")","v":"Zrušené smlouvy a program XDSg"},null,{"$f":"IF($A40=\"\",,SUMPRODUCT((LOOKUP(ROW(D$1:D$997),ROW(D$1:D$997)/ISNUMBER('Měsíční rekapitulace'!$L$1:$L$997),'Měsíční rekapitulace'!$L$1:$L$997)=D$4)*('Měsíční rekapitulace'!$A$3:$A$999=$A40)*TEXT('Měsíční rekapitulace'!$Q$3:$Q$999,\"0,0;0;0;\\0\")))","v":0},{"$f":"IF($A40=\"\",,SUMPRODUCT((LOOKUP(ROW(E$1:E$997),ROW(E$1:E$997)/ISNUMBER('Měsíční rekapitulace'!$L$1:$L$997),'Měsíční rekapitulace'!$L$1:$L$997)=E$4)*('Měsíční rekapitulace'!$A$3:$A$999=$A40)*TEXT('Měsíční rekapitulace'!$Q$3:$Q$999,\"0,0;0;0;\\0\")))","v":0},{"$f":"IF($A40=\"\",,SUMPRODUCT((LOOKUP(ROW(F$1:F$997),ROW(F$1:F$997)/ISNUMBER('Měsíční rekapitulace'!$L$1:$L$997),'Měsíční rekapitulace'!$L$1:$L$997)=F$4)*('Měsíční rekapitulace'!$A$3:$A$999=$A40)*TEXT('Měsíční rekapitulace'!$Q$3:$Q$999,\"0,0;0;0;\\0\")))","v":0},{"$f":"IF($A40=\"\",,SUMPRODUCT((LOOKUP(ROW(G$1:G$997),ROW(G$1:G$997)/ISNUMBER('Měsíční rekapitulace'!$L$1:$L$997),'Měsíční rekapitulace'!$L$1:$L$997)=G$4)*('Měsíční rekapitulace'!$A$3:$A$999=$A40)*TEXT('Měsíční rekapitulace'!$Q$3:$Q$999,\"0,0;0;0;\\0\")))","v":0},{"$f":"IF($A40=\"\",,SUMPRODUCT((LOOKUP(ROW(H$1:H$997),ROW(H$1:H$997)/ISNUMBER('Měsíční rekapitulace'!$L$1:$L$997),'Měsíční rekapitulace'!$L$1:$L$997)=H$4)*('Měsíční rekapitulace'!$A$3:$A$999=$A40)*TEXT('Měsíční rekapitulace'!$Q$3:$Q$999,\"0,0;0;0;\\0\")))","v":0},{"$f":"IF($A40=\"\",,SUMPRODUCT((LOOKUP(ROW(I$1:I$997),ROW(I$1:I$997)/ISNUMBER('Měsíční rekapitulace'!$L$1:$L$997),'Měsíční rekapitulace'!$L$1:$L$997)=I$4)*('Měsíční rekapitulace'!$A$3:$A$999=$A40)*TEXT('Měsíční rekapitulace'!$Q$3:$Q$999,\"0,0;0;0;\\0\")))","v":0},{"$f":"IF($A40=\"\",,SUMPRODUCT((LOOKUP(ROW(J$1:J$997),ROW(J$1:J$997)/ISNUMBER('Měsíční rekapitulace'!$L$1:$L$997),'Měsíční rekapitulace'!$L$1:$L$997)=J$4)*('Měsíční rekapitulace'!$A$3:$A$999=$A40)*TEXT('Měsíční rekapitulace'!$Q$3:$Q$999,\"0,0;0;0;\\0\")))","v":0},{"$f":"IF($A40=\"\",,SUMPRODUCT((LOOKUP(ROW(K$1:K$997),ROW(K$1:K$997)/ISNUMBER('Měsíční rekapitulace'!$L$1:$L$997),'Měsíční rekapitulace'!$L$1:$L$997)=K$4)*('Měsíční rekapitulace'!$A$3:$A$999=$A40)*TEXT('Měsíční rekapitulace'!$Q$3:$Q$999,\"0,0;0;0;\\0\")))","v":0},{"$f":"IF($A40=\"\",,SUMPRODUCT((LOOKUP(ROW(L$1:L$997),ROW(L$1:L$997)/ISNUMBER('Měsíční rekapitulace'!$L$1:$L$997),'Měsíční rekapitulace'!$L$1:$L$997)=L$4)*('Měsíční rekapitulace'!$A$3:$A$999=$A40)*TEXT('Měsíční rekapitulace'!$Q$3:$Q$999,\"0,0;0;0;\\0\")))","v":0},{"$f":"IF($A40=\"\",,SUMPRODUCT((LOOKUP(ROW(M$1:M$997),ROW(M$1:M$997)/ISNUMBER('Měsíční rekapitulace'!$L$1:$L$997),'Měsíční rekapitulace'!$L$1:$L$997)=M$4)*('Měsíční rekapitulace'!$A$3:$A$999=$A40)*TEXT('Měsíční rekapitulace'!$Q$3:$Q$999,\"0,0;0;0;\\0\")))","v":0},{"$f":"IF($A40=\"\",,SUMPRODUCT((LOOKUP(ROW(N$1:N$997),ROW(N$1:N$997)/ISNUMBER('Měsíční rekapitulace'!$L$1:$L$997),'Měsíční rekapitulace'!$L$1:$L$997)=N$4)*('Měsíční rekapitulace'!$A$3:$A$999=$A40)*TEXT('Měsíční rekapitulace'!$Q$3:$Q$999,\"0,0;0;0;\\0\")))","v":0},{"$f":"IF($A40=\"\",,SUMPRODUCT((LOOKUP(ROW(O$1:O$997),ROW(O$1:O$997)/ISNUMBER('Měsíční rekapitulace'!$L$1:$L$997),'Měsíční rekapitulace'!$L$1:$L$997)=O$4)*('Měsíční rekapitulace'!$A$3:$A$999=$A40)*TEXT('Měsíční rekapitulace'!$Q$3:$Q$999,\"0,0;0;0;\\0\")))","v":2},{"$f":"SUM(D40:O40)","v":2}]
[{"$f":"IFERROR(INDEX('Měsíční rekapitulace'!A$3:A$999,SMALL(IF(('Měsíční rekapitulace'!A$3:A$999<>\"\")*('Měsíční rekapitulace'!A$3:A$999<>'Měsíční rekapitulace'!$A$2)*(COUNTIF(A$5:A40,'Měsíční rekapitulace'!A$3:A$999)=0),ROW('Měsíční rekapitulace'!A$3:A$999)-2),1)),\"\")","v":"S-2263"},{"$f":"IFERROR(INDEX('Měsíční rekapitulace'!E$3:E$999,MATCH(A41,'Měsíční rekapitulace'!A$3:A$999,)),\"\")","v":"Číselník SLP: \"Hromadný přenos metadat\" omezit právem"},null,{"$f":"IF($A41=\"\",,SUMPRODUCT((LOOKUP(ROW(D$1:D$997),ROW(D$1:D$997)/ISNUMBER('Měsíční rekapitulace'!$L$1:$L$997),'Měsíční rekapitulace'!$L$1:$L$997)=D$4)*('Měsíční rekapitulace'!$A$3:$A$999=$A41)*TEXT('Měsíční rekapitulace'!$Q$3:$Q$999,\"0,0;0;0;\\0\")))","v":0},{"$f":"IF($A41=\"\",,SUMPRODUCT((LOOKUP(ROW(E$1:E$997),ROW(E$1:E$997)/ISNUMBER('Měsíční rekapitulace'!$L$1:$L$997),'Měsíční rekapitulace'!$L$1:$L$997)=E$4)*('Měsíční rekapitulace'!$A$3:$A$999=$A41)*TEXT('Měsíční rekapitulace'!$Q$3:$Q$999,\"0,0;0;0;\\0\")))","v":0},{"$f":"IF($A41=\"\",,SUMPRODUCT((LOOKUP(ROW(F$1:F$997),ROW(F$1:F$997)/ISNUMBER('Měsíční rekapitulace'!$L$1:$L$997),'Měsíční rekapitulace'!$L$1:$L$997)=F$4)*('Měsíční rekapitulace'!$A$3:$A$999=$A41)*TEXT('Měsíční rekapitulace'!$Q$3:$Q$999,\"0,0;0;0;\\0\")))","v":0},{"$f":"IF($A41=\"\",,SUMPRODUCT((LOOKUP(ROW(G$1:G$997),ROW(G$1:G$997)/ISNUMBER('Měsíční rekapitulace'!$L$1:$L$997),'Měsíční rekapitulace'!$L$1:$L$997)=G$4)*('Měsíční rekapitulace'!$A$3:$A$999=$A41)*TEXT('Měsíční rekapitulace'!$Q$3:$Q$999,\"0,0;0;0;\\0\")))","v":0},{"$f":"IF($A41=\"\",,SUMPRODUCT((LOOKUP(ROW(H$1:H$997),ROW(H$1:H$997)/ISNUMBER('Měsíční rekapitulace'!$L$1:$L$997),'Měsíční rekapitulace'!$L$1:$L$997)=H$4)*('Měsíční rekapitulace'!$A$3:$A$999=$A41)*TEXT('Měsíční rekapitulace'!$Q$3:$Q$999,\"0,0;0;0;\\0\")))","v":0},{"$f":"IF($A41=\"\",,SUMPRODUCT((LOOKUP(ROW(I$1:I$997),ROW(I$1:I$997)/ISNUMBER('Měsíční rekapitulace'!$L$1:$L$997),'Měsíční rekapitulace'!$L$1:$L$997)=I$4)*('Měsíční rekapitulace'!$A$3:$A$999=$A41)*TEXT('Měsíční rekapitulace'!$Q$3:$Q$999,\"0,0;0;0;\\0\")))","v":0},{"$f":"IF($A41=\"\",,SUMPRODUCT((LOOKUP(ROW(J$1:J$997),ROW(J$1:J$997)/ISNUMBER('Měsíční rekapitulace'!$L$1:$L$997),'Měsíční rekapitulace'!$L$1:$L$997)=J$4)*('Měsíční rekapitulace'!$A$3:$A$999=$A41)*TEXT('Měsíční rekapitulace'!$Q$3:$Q$999,\"0,0;0;0;\\0\")))","v":0},{"$f":"IF($A41=\"\",,SUMPRODUCT((LOOKUP(ROW(K$1:K$997),ROW(K$1:K$997)/ISNUMBER('Měsíční rekapitulace'!$L$1:$L$997),'Měsíční rekapitulace'!$L$1:$L$997)=K$4)*('Měsíční rekapitulace'!$A$3:$A$999=$A41)*TEXT('Měsíční rekapitulace'!$Q$3:$Q$999,\"0,0;0;0;\\0\")))","v":0},{"$f":"IF($A41=\"\",,SUMPRODUCT((LOOKUP(ROW(L$1:L$997),ROW(L$1:L$997)/ISNUMBER('Měsíční rekapitulace'!$L$1:$L$997),'Měsíční rekapitulace'!$L$1:$L$997)=L$4)*('Měsíční rekapitulace'!$A$3:$A$999=$A41)*TEXT('Měsíční rekapitulace'!$Q$3:$Q$999,\"0,0;0;0;\\0\")))","v":0},{"$f":"IF($A41=\"\",,SUMPRODUCT((LOOKUP(ROW(M$1:M$997),ROW(M$1:M$997)/ISNUMBER('Měsíční rekapitulace'!$L$1:$L$997),'Měsíční rekapitulace'!$L$1:$L$997)=M$4)*('Měsíční rekapitulace'!$A$3:$A$999=$A41)*TEXT('Měsíční rekapitulace'!$Q$3:$Q$999,\"0,0;0;0;\\0\")))","v":0},{"$f":"IF($A41=\"\",,SUMPRODUCT((LOOKUP(ROW(N$1:N$997),ROW(N$1:N$997)/ISNUMBER('Měsíční rekapitulace'!$L$1:$L$997),'Měsíční rekapitulace'!$L$1:$L$997)=N$4)*('Měsíční rekapitulace'!$A$3:$A$999=$A41)*TEXT('Měsíční rekapitulace'!$Q$3:$Q$999,\"0,0;0;0;\\0\")))","v":0},{"$f":"IF($A41=\"\",,SUMPRODUCT((LOOKUP(ROW(O$1:O$997),ROW(O$1:O$997)/ISNUMBER('Měsíční rekapitulace'!$L$1:$L$997),'Měsíční rekapitulace'!$L$1:$L$997)=O$4)*('Měsíční rekapitulace'!$A$3:$A$999=$A41)*TEXT('Měsíční rekapitulace'!$Q$3:$Q$999,\"0,0;0;0;\\0\")))","v":0},0]
[{"$f":"IFERROR(INDEX('Měsíční rekapitulace'!A$3:A$999,SMALL(IF(('Měsíční rekapitulace'!A$3:A$999<>\"\")*('Měsíční rekapitulace'!A$3:A$999<>'Měsíční rekapitulace'!$A$2)*(COUNTIF(A$5:A41,'Měsíční rekapitulace'!A$3:A$999)=0),ROW('Měsíční rekapitulace'!A$3:A$999)-2),1)),\"\")","v":"S-1975SYPO"},{"$f":"IFERROR(INDEX('Měsíční rekapitulace'!E$3:E$999,MATCH(A42,'Měsíční rekapitulace'!A$3:A$999,)),\"\")","v":"Úprava výdeje dat o ŠU – Protokol L6"},null,{"$f":"IF($A42=\"\",,SUMPRODUCT((LOOKUP(ROW(D$1:D$997),ROW(D$1:D$997)/ISNUMBER('Měsíční rekapitulace'!$L$1:$L$997),'Měsíční rekapitulace'!$L$1:$L$997)=D$4)*('Měsíční rekapitulace'!$A$3:$A$999=$A42)*TEXT('Měsíční rekapitulace'!$Q$3:$Q$999,\"0,0;0;0;\\0\")))","v":0},{"$f":"IF($A42=\"\",,SUMPRODUCT((LOOKUP(ROW(E$1:E$997),ROW(E$1:E$997)/ISNUMBER('Měsíční rekapitulace'!$L$1:$L$997),'Měsíční rekapitulace'!$L$1:$L$997)=E$4)*('Měsíční rekapitulace'!$A$3:$A$999=$A42)*TEXT('Měsíční rekapitulace'!$Q$3:$Q$999,\"0,0;0;0;\\0\")))","v":0},{"$f":"IF($A42=\"\",,SUMPRODUCT((LOOKUP(ROW(F$1:F$997),ROW(F$1:F$997)/ISNUMBER('Měsíční rekapitulace'!$L$1:$L$997),'Měsíční rekapitulace'!$L$1:$L$997)=F$4)*('Měsíční rekapitulace'!$A$3:$A$999=$A42)*TEXT('Měsíční rekapitulace'!$Q$3:$Q$999,\"0,0;0;0;\\0\")))","v":0},{"$f":"IF($A42=\"\",,SUMPRODUCT((LOOKUP(ROW(G$1:G$997),ROW(G$1:G$997)/ISNUMBER('Měsíční rekapitulace'!$L$1:$L$997),'Měsíční rekapitulace'!$L$1:$L$997)=G$4)*('Měsíční rekapitulace'!$A$3:$A$999=$A42)*TEXT('Měsíční rekapitulace'!$Q$3:$Q$999,\"0,0;0;0;\\0\")))","v":0},{"$f":"IF($A42=\"\",,SUMPRODUCT((LOOKUP(ROW(H$1:H$997),ROW(H$1:H$997)/ISNUMBER('Měsíční rekapitulace'!$L$1:$L$997),'Měsíční rekapitulace'!$L$1:$L$997)=H$4)*('Měsíční rekapitulace'!$A$3:$A$999=$A42)*TEXT('Měsíční rekapitulace'!$Q$3:$Q$999,\"0,0;0;0;\\0\")))","v":0},{"$f":"IF($A42=\"\",,SUMPRODUCT((LOOKUP(ROW(I$1:I$997),ROW(I$1:I$997)/ISNUMBER('Měsíční rekapitulace'!$L$1:$L$997),'Měsíční rekapitulace'!$L$1:$L$997)=I$4)*('Měsíční rekapitulace'!$A$3:$A$999=$A42)*TEXT('Měsíční rekapitulace'!$Q$3:$Q$999,\"0,0;0;0;\\0\")))","v":0},{"$f":"IF($A42=\"\",,SUMPRODUCT((LOOKUP(ROW(J$1:J$997),ROW(J$1:J$997)/ISNUMBER('Měsíční rekapitulace'!$L$1:$L$997),'Měsíční rekapitulace'!$L$1:$L$997)=J$4)*('Měsíční rekapitulace'!$A$3:$A$999=$A42)*TEXT('Měsíční rekapitulace'!$Q$3:$Q$999,\"0,0;0;0;\\0\")))","v":0},{"$f":"IF($A42=\"\",,SUMPRODUCT((LOOKUP(ROW(K$1:K$997),ROW(K$1:K$997)/ISNUMBER('Měsíční rekapitulace'!$L$1:$L$997),'Měsíční rekapitulace'!$L$1:$L$997)=K$4)*('Měsíční rekapitulace'!$A$3:$A$999=$A42)*TEXT('Měsíční rekapitulace'!$Q$3:$Q$999,\"0,0;0;0;\\0\")))","v":0},{"$f":"IF($A42=\"\",,SUMPRODUCT((LOOKUP(ROW(L$1:L$997),ROW(L$1:L$997)/ISNUMBER('Měsíční rekapitulace'!$L$1:$L$997),'Měsíční rekapitulace'!$L$1:$L$997)=L$4)*('Měsíční rekapitulace'!$A$3:$A$999=$A42)*TEXT('Měsíční rekapitulace'!$Q$3:$Q$999,\"0,0;0;0;\\0\")))","v":0},{"$f":"IF($A42=\"\",,SUMPRODUCT((LOOKUP(ROW(M$1:M$997),ROW(M$1:M$997)/ISNUMBER('Měsíční rekapitulace'!$L$1:$L$997),'Měsíční rekapitulace'!$L$1:$L$997)=M$4)*('Měsíční rekapitulace'!$A$3:$A$999=$A42)*TEXT('Měsíční rekapitulace'!$Q$3:$Q$999,\"0,0;0;0;\\0\")))","v":0},{"$f":"IF($A42=\"\",,SUMPRODUCT((LOOKUP(ROW(N$1:N$997),ROW(N$1:N$997)/ISNUMBER('Měsíční rekapitulace'!$L$1:$L$997),'Měsíční rekapitulace'!$L$1:$L$997)=N$4)*('Měsíční rekapitulace'!$A$3:$A$999=$A42)*TEXT('Měsíční rekapitulace'!$Q$3:$Q$999,\"0,0;0;0;\\0\")))","v":0},{"$f":"IF($A42=\"\",,SUMPRODUCT((LOOKUP(ROW(O$1:O$997),ROW(O$1:O$997)/ISNUMBER('Měsíční rekapitulace'!$L$1:$L$997),'Měsíční rekapitulace'!$L$1:$L$997)=O$4)*('Měsíční rekapitulace'!$A$3:$A$999=$A42)*TEXT('Měsíční rekapitulace'!$Q$3:$Q$999,\"0,0;0;0;\\0\")))","v":5},5]
[{"$f":"IFERROR(INDEX('Měsíční rekapitulace'!A$3:A$999,SMALL(IF(('Měsíční rekapitulace'!A$3:A$999<>\"\")*('Měsíční rekapitulace'!A$3:A$999<>'Měsíční rekapitulace'!$A$2)*(COUNTIF(A$5:A42,'Měsíční rekapitulace'!A$3:A$999)=0),ROW('Měsíční rekapitulace'!A$3:A$999)-2),1)),\"\")","v":"S-2151"},{"$f":"IFERROR(INDEX('Měsíční rekapitulace'!E$3:E$999,MATCH(A43,'Měsíční rekapitulace'!A$3:A$999,)),\"\")","v":"Tvorba rezervy na odměnu Salipu"},null,{"$f":"IF($A43=\"\",,SUMPRODUCT((LOOKUP(ROW(D$1:D$997),ROW(D$1:D$997)/ISNUMBER('Měsíční rekapitulace'!$L$1:$L$997),'Měsíční rekapitulace'!$L$1:$L$997)=D$4)*('Měsíční rekapitulace'!$A$3:$A$999=$A43)*TEXT('Měsíční rekapitulace'!$Q$3:$Q$999,\"0,0;0;0;\\0\")))","v":0},{"$f":"IF($A43=\"\",,SUMPRODUCT((LOOKUP(ROW(E$1:E$997),ROW(E$1:E$997)/ISNUMBER('Měsíční rekapitulace'!$L$1:$L$997),'Měsíční rekapitulace'!$L$1:$L$997)=E$4)*('Měsíční rekapitulace'!$A$3:$A$999=$A43)*TEXT('Měsíční rekapitulace'!$Q$3:$Q$999,\"0,0;0;0;\\0\")))","v":0},{"$f":"IF($A43=\"\",,SUMPRODUCT((LOOKUP(ROW(F$1:F$997),ROW(F$1:F$997)/ISNUMBER('Měsíční rekapitulace'!$L$1:$L$997),'Měsíční rekapitulace'!$L$1:$L$997)=F$4)*('Měsíční rekapitulace'!$A$3:$A$999=$A43)*TEXT('Měsíční rekapitulace'!$Q$3:$Q$999,\"0,0;0;0;\\0\")))","v":0},{"$f":"IF($A43=\"\",,SUMPRODUCT((LOOKUP(ROW(G$1:G$997),ROW(G$1:G$997)/ISNUMBER('Měsíční rekapitulace'!$L$1:$L$997),'Měsíční rekapitulace'!$L$1:$L$997)=G$4)*('Měsíční rekapitulace'!$A$3:$A$999=$A43)*TEXT('Měsíční rekapitulace'!$Q$3:$Q$999,\"0,0;0;0;\\0\")))","v":0},{"$f":"IF($A43=\"\",,SUMPRODUCT((LOOKUP(ROW(H$1:H$997),ROW(H$1:H$997)/ISNUMBER('Měsíční rekapitulace'!$L$1:$L$997),'Měsíční rekapitulace'!$L$1:$L$997)=H$4)*('Měsíční rekapitulace'!$A$3:$A$999=$A43)*TEXT('Měsíční rekapitulace'!$Q$3:$Q$999,\"0,0;0;0;\\0\")))","v":0},{"$f":"IF($A43=\"\",,SUMPRODUCT((LOOKUP(ROW(I$1:I$997),ROW(I$1:I$997)/ISNUMBER('Měsíční rekapitulace'!$L$1:$L$997),'Měsíční rekapitulace'!$L$1:$L$997)=I$4)*('Měsíční rekapitulace'!$A$3:$A$999=$A43)*TEXT('Měsíční rekapitulace'!$Q$3:$Q$999,\"0,0;0;0;\\0\")))","v":0},{"$f":"IF($A43=\"\",,SUMPRODUCT((LOOKUP(ROW(J$1:J$997),ROW(J$1:J$997)/ISNUMBER('Měsíční rekapitulace'!$L$1:$L$997),'Měsíční rekapitulace'!$L$1:$L$997)=J$4)*('Měsíční rekapitulace'!$A$3:$A$999=$A43)*TEXT('Měsíční rekapitulace'!$Q$3:$Q$999,\"0,0;0;0;\\0\")))","v":0},{"$f":"IF($A43=\"\",,SUMPRODUCT((LOOKUP(ROW(K$1:K$997),ROW(K$1:K$997)/ISNUMBER('Měsíční rekapitulace'!$L$1:$L$997),'Měsíční rekapitulace'!$L$1:$L$997)=K$4)*('Měsíční rekapitulace'!$A$3:$A$999=$A43)*TEXT('Měsíční rekapitulace'!$Q$3:$Q$999,\"0,0;0;0;\\0\")))","v":0},{"$f":"IF($A43=\"\",,SUMPRODUCT((LOOKUP(ROW(L$1:L$997),ROW(L$1:L$997)/ISNUMBER('Měsíční rekapitulace'!$L$1:$L$997),'Měsíční rekapitulace'!$L$1:$L$997)=L$4)*('Měsíční rekapitulace'!$A$3:$A$999=$A43)*TEXT('Měsíční rekapitulace'!$Q$3:$Q$999,\"0,0;0;0;\\0\")))","v":0},{"$f":"IF($A43=\"\",,SUMPRODUCT((LOOKUP(ROW(M$1:M$997),ROW(M$1:M$997)/ISNUMBER('Měsíční rekapitulace'!$L$1:$L$997),'Měsíční rekapitulace'!$L$1:$L$997)=M$4)*('Měsíční rekapitulace'!$A$3:$A$999=$A43)*TEXT('Měsíční rekapitulace'!$Q$3:$Q$999,\"0,0;0;0;\\0\")))","v":0},{"$f":"IF($A43=\"\",,SUMPRODUCT((LOOKUP(ROW(N$1:N$997),ROW(N$1:N$997)/ISNUMBER('Měsíční rekapitulace'!$L$1:$L$997),'Měsíční rekapitulace'!$L$1:$L$997)=N$4)*('Měsíční rekapitulace'!$A$3:$A$999=$A43)*TEXT('Měsíční rekapitulace'!$Q$3:$Q$999,\"0,0;0;0;\\0\")))","v":22},{"$f":"IF($A43=\"\",,SUMPRODUCT((LOOKUP(ROW(O$1:O$997),ROW(O$1:O$997)/ISNUMBER('Měsíční rekapitulace'!$L$1:$L$997),'Měsíční rekapitulace'!$L$1:$L$997)=O$4)*('Měsíční rekapitulace'!$A$3:$A$999=$A43)*TEXT('Měsíční rekapitulace'!$Q$3:$Q$999,\"0,0;0;0;\\0\")))","v":22},44]
[{"$f":"IFERROR(INDEX('Měsíční rekapitulace'!A$3:A$999,SMALL(IF(('Měsíční rekapitulace'!A$3:A$999<>\"\")*('Měsíční rekapitulace'!A$3:A$999<>'Měsíční rekapitulace'!$A$2)*(COUNTIF(A$5:A43,'Měsíční rekapitulace'!A$3:A$999)=0),ROW('Měsíční rekapitulace'!A$3:A$999)-2),1)),\"\")","v":""},{"$f":"IFERROR(INDEX('Měsíční rekapitulace'!E$3:E$999,MATCH(A44,'Měsíční rekapitulace'!A$3:A$999,)),\"\")","v":""},null,{"$f":"IF($A44=\"\",,SUMPRODUCT((LOOKUP(ROW(D$1:D$997),ROW(D$1:D$997)/ISNUMBER('Měsíční rekapitulace'!$L$1:$L$997),'Měsíční rekapitulace'!$L$1:$L$997)=D$4)*('Měsíční rekapitulace'!$A$3:$A$999=$A44)*TEXT('Měsíční rekapitulace'!$Q$3:$Q$999,\"0,0;0;0;\\0\")))","v":0},{"$f":"IF($A44=\"\",,SUMPRODUCT((LOOKUP(ROW(E$1:E$997),ROW(E$1:E$997)/ISNUMBER('Měsíční rekapitulace'!$L$1:$L$997),'Měsíční rekapitulace'!$L$1:$L$997)=E$4)*('Měsíční rekapitulace'!$A$3:$A$999=$A44)*TEXT('Měsíční rekapitulace'!$Q$3:$Q$999,\"0,0;0;0;\\0\")))","v":0},{"$f":"IF($A44=\"\",,SUMPRODUCT((LOOKUP(ROW(F$1:F$997),ROW(F$1:F$997)/ISNUMBER('Měsíční rekapitulace'!$L$1:$L$997),'Měsíční rekapitulace'!$L$1:$L$997)=F$4)*('Měsíční rekapitulace'!$A$3:$A$999=$A44)*TEXT('Měsíční rekapitulace'!$Q$3:$Q$999,\"0,0;0;0;\\0\")))","v":0},{"$f":"IF($A44=\"\",,SUMPRODUCT((LOOKUP(ROW(G$1:G$997),ROW(G$1:G$997)/ISNUMBER('Měsíční rekapitulace'!$L$1:$L$997),'Měsíční rekapitulace'!$L$1:$L$997)=G$4)*('Měsíční rekapitulace'!$A$3:$A$999=$A44)*TEXT('Měsíční rekapitulace'!$Q$3:$Q$999,\"0,0;0;0;\\0\")))","v":0},{"$f":"IF($A44=\"\",,SUMPRODUCT((LOOKUP(ROW(H$1:H$997),ROW(H$1:H$997)/ISNUMBER('Měsíční rekapitulace'!$L$1:$L$997),'Měsíční rekapitulace'!$L$1:$L$997)=H$4)*('Měsíční rekapitulace'!$A$3:$A$999=$A44)*TEXT('Měsíční rekapitulace'!$Q$3:$Q$999,\"0,0;0;0;\\0\")))","v":0},{"$f":"IF($A44=\"\",,SUMPRODUCT((LOOKUP(ROW(I$1:I$997),ROW(I$1:I$997)/ISNUMBER('Měsíční rekapitulace'!$L$1:$L$997),'Měsíční rekapitulace'!$L$1:$L$997)=I$4)*('Měsíční rekapitulace'!$A$3:$A$999=$A44)*TEXT('Měsíční rekapitulace'!$Q$3:$Q$999,\"0,0;0;0;\\0\")))","v":0},{"$f":"IF($A44=\"\",,SUMPRODUCT((LOOKUP(ROW(J$1:J$997),ROW(J$1:J$997)/ISNUMBER('Měsíční rekapitulace'!$L$1:$L$997),'Měsíční rekapitulace'!$L$1:$L$997)=J$4)*('Měsíční rekapitulace'!$A$3:$A$999=$A44)*TEXT('Měsíční rekapitulace'!$Q$3:$Q$999,\"0,0;0;0;\\0\")))","v":0},{"$f":"IF($A44=\"\",,SUMPRODUCT((LOOKUP(ROW(K$1:K$997),ROW(K$1:K$997)/ISNUMBER('Měsíční rekapitulace'!$L$1:$L$997),'Měsíční rekapitulace'!$L$1:$L$997)=K$4)*('Měsíční rekapitulace'!$A$3:$A$999=$A44)*TEXT('Měsíční rekapitulace'!$Q$3:$Q$999,\"0,0;0;0;\\0\")))","v":0},{"$f":"IF($A44=\"\",,SUMPRODUCT((LOOKUP(ROW(L$1:L$997),ROW(L$1:L$997)/ISNUMBER('Měsíční rekapitulace'!$L$1:$L$997),'Měsíční rekapitulace'!$L$1:$L$997)=L$4)*('Měsíční rekapitulace'!$A$3:$A$999=$A44)*TEXT('Měsíční rekapitulace'!$Q$3:$Q$999,\"0,0;0;0;\\0\")))","v":0},{"$f":"IF($A44=\"\",,SUMPRODUCT((LOOKUP(ROW(M$1:M$997),ROW(M$1:M$997)/ISNUMBER('Měsíční rekapitulace'!$L$1:$L$997),'Měsíční rekapitulace'!$L$1:$L$997)=M$4)*('Měsíční rekapitulace'!$A$3:$A$999=$A44)*TEXT('Měsíční rekapitulace'!$Q$3:$Q$999,\"0,0;0;0;\\0\")))","v":0},{"$f":"IF($A44=\"\",,SUMPRODUCT((LOOKUP(ROW(N$1:N$997),ROW(N$1:N$997)/ISNUMBER('Měsíční rekapitulace'!$L$1:$L$997),'Měsíční rekapitulace'!$L$1:$L$997)=N$4)*('Měsíční rekapitulace'!$A$3:$A$999=$A44)*TEXT('Měsíční rekapitulace'!$Q$3:$Q$999,\"0,0;0;0;\\0\")))","v":0},{"$f":"IF($A44=\"\",,SUMPRODUCT((LOOKUP(ROW(O$1:O$997),ROW(O$1:O$997)/ISNUMBER('Měsíční rekapitulace'!$L$1:$L$997),'Měsíční rekapitulace'!$L$1:$L$997)=O$4)*('Měsíční rekapitulace'!$A$3:$A$999=$A44)*TEXT('Měsíční rekapitulace'!$Q$3:$Q$999,\"0,0;0;0;\\0\")))","v":0},0]
[{"$f":"IFERROR(INDEX('Měsíční rekapitulace'!A$3:A$999,SMALL(IF(('Měsíční rekapitulace'!A$3:A$999<>\"\")*('Měsíční rekapitulace'!A$3:A$999<>'Měsíční rekapitulace'!$A$2)*(COUNTIF(A$5:A44,'Měsíční rekapitulace'!A$3:A$999)=0),ROW('Měsíční rekapitulace'!A$3:A$999)-2),1)),\"\")","v":""},{"$f":"IFERROR(INDEX('Měsíční rekapitulace'!E$3:E$999,MATCH(A45,'Měsíční rekapitulace'!A$3:A$999,)),\"\")","v":""},null,{"$f":"IF($A45=\"\",,SUMPRODUCT((LOOKUP(ROW(D$1:D$997),ROW(D$1:D$997)/ISNUMBER('Měsíční rekapitulace'!$L$1:$L$997),'Měsíční rekapitulace'!$L$1:$L$997)=D$4)*('Měsíční rekapitulace'!$A$3:$A$999=$A45)*TEXT('Měsíční rekapitulace'!$Q$3:$Q$999,\"0,0;0;0;\\0\")))","v":0},{"$f":"IF($A45=\"\",,SUMPRODUCT((LOOKUP(ROW(E$1:E$997),ROW(E$1:E$997)/ISNUMBER('Měsíční rekapitulace'!$L$1:$L$997),'Měsíční rekapitulace'!$L$1:$L$997)=E$4)*('Měsíční rekapitulace'!$A$3:$A$999=$A45)*TEXT('Měsíční rekapitulace'!$Q$3:$Q$999,\"0,0;0;0;\\0\")))","v":0},{"$f":"IF($A45=\"\",,SUMPRODUCT((LOOKUP(ROW(F$1:F$997),ROW(F$1:F$997)/ISNUMBER('Měsíční rekapitulace'!$L$1:$L$997),'Měsíční rekapitulace'!$L$1:$L$997)=F$4)*('Měsíční rekapitulace'!$A$3:$A$999=$A45)*TEXT('Měsíční rekapitulace'!$Q$3:$Q$999,\"0,0;0;0;\\0\")))","v":0},{"$f":"IF($A45=\"\",,SUMPRODUCT((LOOKUP(ROW(G$1:G$997),ROW(G$1:G$997)/ISNUMBER('Měsíční rekapitulace'!$L$1:$L$997),'Měsíční rekapitulace'!$L$1:$L$997)=G$4)*('Měsíční rekapitulace'!$A$3:$A$999=$A45)*TEXT('Měsíční rekapitulace'!$Q$3:$Q$999,\"0,0;0;0;\\0\")))","v":0},{"$f":"IF($A45=\"\",,SUMPRODUCT((LOOKUP(ROW(H$1:H$997),ROW(H$1:H$997)/ISNUMBER('Měsíční rekapitulace'!$L$1:$L$997),'Měsíční rekapitulace'!$L$1:$L$997)=H$4)*('Měsíční rekapitulace'!$A$3:$A$999=$A45)*TEXT('Měsíční rekapitulace'!$Q$3:$Q$999,\"0,0;0;0;\\0\")))","v":0},{"$f":"IF($A45=\"\",,SUMPRODUCT((LOOKUP(ROW(I$1:I$997),ROW(I$1:I$997)/ISNUMBER('Měsíční rekapitulace'!$L$1:$L$997),'Měsíční rekapitulace'!$L$1:$L$997)=I$4)*('Měsíční rekapitulace'!$A$3:$A$999=$A45)*TEXT('Měsíční rekapitulace'!$Q$3:$Q$999,\"0,0;0;0;\\0\")))","v":0},{"$f":"IF($A45=\"\",,SUMPRODUCT((LOOKUP(ROW(J$1:J$997),ROW(J$1:J$997)/ISNUMBER('Měsíční rekapitulace'!$L$1:$L$997),'Měsíční rekapitulace'!$L$1:$L$997)=J$4)*('Měsíční rekapitulace'!$A$3:$A$999=$A45)*TEXT('Měsíční rekapitulace'!$Q$3:$Q$999,\"0,0;0;0;\\0\")))","v":0},{"$f":"IF($A45=\"\",,SUMPRODUCT((LOOKUP(ROW(K$1:K$997),ROW(K$1:K$997)/ISNUMBER('Měsíční rekapitulace'!$L$1:$L$997),'Měsíční rekapitulace'!$L$1:$L$997)=K$4)*('Měsíční rekapitulace'!$A$3:$A$999=$A45)*TEXT('Měsíční rekapitulace'!$Q$3:$Q$999,\"0,0;0;0;\\0\")))","v":0},{"$f":"IF($A45=\"\",,SUMPRODUCT((LOOKUP(ROW(L$1:L$997),ROW(L$1:L$997)/ISNUMBER('Měsíční rekapitulace'!$L$1:$L$997),'Měsíční rekapitulace'!$L$1:$L$997)=L$4)*('Měsíční rekapitulace'!$A$3:$A$999=$A45)*TEXT('Měsíční rekapitulace'!$Q$3:$Q$999,\"0,0;0;0;\\0\")))","v":0},{"$f":"IF($A45=\"\",,SUMPRODUCT((LOOKUP(ROW(M$1:M$997),ROW(M$1:M$997)/ISNUMBER('Měsíční rekapitulace'!$L$1:$L$997),'Měsíční rekapitulace'!$L$1:$L$997)=M$4)*('Měsíční rekapitulace'!$A$3:$A$999=$A45)*TEXT('Měsíční rekapitulace'!$Q$3:$Q$999,\"0,0;0;0;\\0\")))","v":0},{"$f":"IF($A45=\"\",,SUMPRODUCT((LOOKUP(ROW(N$1:N$997),ROW(N$1:N$997)/ISNUMBER('Měsíční rekapitulace'!$L$1:$L$997),'Měsíční rekapitulace'!$L$1:$L$997)=N$4)*('Měsíční rekapitulace'!$A$3:$A$999=$A45)*TEXT('Měsíční rekapitulace'!$Q$3:$Q$999,\"0,0;0;0;\\0\")))","v":0},{"$f":"IF($A45=\"\",,SUMPRODUCT((LOOKUP(ROW(O$1:O$997),ROW(O$1:O$997)/ISNUMBER('Měsíční rekapitulace'!$L$1:$L$997),'Měsíční rekapitulace'!$L$1:$L$997)=O$4)*('Měsíční rekapitulace'!$A$3:$A$999=$A45)*TEXT('Měsíční rekapitulace'!$Q$3:$Q$999,\"0,0;0;0;\\0\")))","v":0},0]
[{"$f":"IFERROR(INDEX('Měsíční rekapitulace'!A$3:A$999,SMALL(IF(('Měsíční rekapitulace'!A$3:A$999<>\"\")*('Měsíční rekapitulace'!A$3:A$999<>'Měsíční rekapitulace'!$A$2)*(COUNTIF(A$5:A45,'Měsíční rekapitulace'!A$3:A$999)=0),ROW('Měsíční rekapitulace'!A$3:A$999)-2),1)),\"\")","v":""},{"$f":"IFERROR(INDEX('Měsíční rekapitulace'!E$3:E$999,MATCH(A46,'Měsíční rekapitulace'!A$3:A$999,)),\"\")","v":""},null,{"$f":"IF($A46=\"\",,SUMPRODUCT((LOOKUP(ROW(D$1:D$997),ROW(D$1:D$997)/ISNUMBER('Měsíční rekapitulace'!$L$1:$L$997),'Měsíční rekapitulace'!$L$1:$L$997)=D$4)*('Měsíční rekapitulace'!$A$3:$A$999=$A46)*TEXT('Měsíční rekapitulace'!$Q$3:$Q$999,\"0,0;0;0;\\0\")))","v":0},{"$f":"IF($A46=\"\",,SUMPRODUCT((LOOKUP(ROW(E$1:E$997),ROW(E$1:E$997)/ISNUMBER('Měsíční rekapitulace'!$L$1:$L$997),'Měsíční rekapitulace'!$L$1:$L$997)=E$4)*('Měsíční rekapitulace'!$A$3:$A$999=$A46)*TEXT('Měsíční rekapitulace'!$Q$3:$Q$999,\"0,0;0;0;\\0\")))","v":0},{"$f":"IF($A46=\"\",,SUMPRODUCT((LOOKUP(ROW(F$1:F$997),ROW(F$1:F$997)/ISNUMBER('Měsíční rekapitulace'!$L$1:$L$997),'Měsíční rekapitulace'!$L$1:$L$997)=F$4)*('Měsíční rekapitulace'!$A$3:$A$999=$A46)*TEXT('Měsíční rekapitulace'!$Q$3:$Q$999,\"0,0;0;0;\\0\")))","v":0},{"$f":"IF($A46=\"\",,SUMPRODUCT((LOOKUP(ROW(G$1:G$997),ROW(G$1:G$997)/ISNUMBER('Měsíční rekapitulace'!$L$1:$L$997),'Měsíční rekapitulace'!$L$1:$L$997)=G$4)*('Měsíční rekapitulace'!$A$3:$A$999=$A46)*TEXT('Měsíční rekapitulace'!$Q$3:$Q$999,\"0,0;0;0;\\0\")))","v":0},{"$f":"IF($A46=\"\",,SUMPRODUCT((LOOKUP(ROW(H$1:H$997),ROW(H$1:H$997)/ISNUMBER('Měsíční rekapitulace'!$L$1:$L$997),'Měsíční rekapitulace'!$L$1:$L$997)=H$4)*('Měsíční rekapitulace'!$A$3:$A$999=$A46)*TEXT('Měsíční rekapitulace'!$Q$3:$Q$999,\"0,0;0;0;\\0\")))","v":0},{"$f":"IF($A46=\"\",,SUMPRODUCT((LOOKUP(ROW(I$1:I$997),ROW(I$1:I$997)/ISNUMBER('Měsíční rekapitulace'!$L$1:$L$997),'Měsíční rekapitulace'!$L$1:$L$997)=I$4)*('Měsíční rekapitulace'!$A$3:$A$999=$A46)*TEXT('Měsíční rekapitulace'!$Q$3:$Q$999,\"0,0;0;0;\\0\")))","v":0},{"$f":"IF($A46=\"\",,SUMPRODUCT((LOOKUP(ROW(J$1:J$997),ROW(J$1:J$997)/ISNUMBER('Měsíční rekapitulace'!$L$1:$L$997),'Měsíční rekapitulace'!$L$1:$L$997)=J$4)*('Měsíční rekapitulace'!$A$3:$A$999=$A46)*TEXT('Měsíční rekapitulace'!$Q$3:$Q$999,\"0,0;0;0;\\0\")))","v":0},{"$f":"IF($A46=\"\",,SUMPRODUCT((LOOKUP(ROW(K$1:K$997),ROW(K$1:K$997)/ISNUMBER('Měsíční rekapitulace'!$L$1:$L$997),'Měsíční rekapitulace'!$L$1:$L$997)=K$4)*('Měsíční rekapitulace'!$A$3:$A$999=$A46)*TEXT('Měsíční rekapitulace'!$Q$3:$Q$999,\"0,0;0;0;\\0\")))","v":0},{"$f":"IF($A46=\"\",,SUMPRODUCT((LOOKUP(ROW(L$1:L$997),ROW(L$1:L$997)/ISNUMBER('Měsíční rekapitulace'!$L$1:$L$997),'Měsíční rekapitulace'!$L$1:$L$997)=L$4)*('Měsíční rekapitulace'!$A$3:$A$999=$A46)*TEXT('Měsíční rekapitulace'!$Q$3:$Q$999,\"0,0;0;0;\\0\")))","v":0},{"$f":"IF($A46=\"\",,SUMPRODUCT((LOOKUP(ROW(M$1:M$997),ROW(M$1:M$997)/ISNUMBER('Měsíční rekapitulace'!$L$1:$L$997),'Měsíční rekapitulace'!$L$1:$L$997)=M$4)*('Měsíční rekapitulace'!$A$3:$A$999=$A46)*TEXT('Měsíční rekapitulace'!$Q$3:$Q$999,\"0,0;0;0;\\0\")))","v":0},{"$f":"IF($A46=\"\",,SUMPRODUCT((LOOKUP(ROW(N$1:N$997),ROW(N$1:N$997)/ISNUMBER('Měsíční rekapitulace'!$L$1:$L$997),'Měsíční rekapitulace'!$L$1:$L$997)=N$4)*('Měsíční rekapitulace'!$A$3:$A$999=$A46)*TEXT('Měsíční rekapitulace'!$Q$3:$Q$999,\"0,0;0;0;\\0\")))","v":0},{"$f":"IF($A46=\"\",,SUMPRODUCT((LOOKUP(ROW(O$1:O$997),ROW(O$1:O$997)/ISNUMBER('Měsíční rekapitulace'!$L$1:$L$997),'Měsíční rekapitulace'!$L$1:$L$997)=O$4)*('Měsíční rekapitulace'!$A$3:$A$999=$A46)*TEXT('Měsíční rekapitulace'!$Q$3:$Q$999,\"0,0;0;0;\\0\")))","v":0},0]
[{"$f":"IFERROR(INDEX('Měsíční rekapitulace'!A$3:A$999,SMALL(IF(('Měsíční rekapitulace'!A$3:A$999<>\"\")*('Měsíční rekapitulace'!A$3:A$999<>'Měsíční rekapitulace'!$A$2)*(COUNTIF(A$5:A46,'Měsíční rekapitulace'!A$3:A$999)=0),ROW('Měsíční rekapitulace'!A$3:A$999)-2),1)),\"\")","v":""},{"$f":"IFERROR(INDEX('Měsíční rekapitulace'!E$3:E$999,MATCH(A47,'Měsíční rekapitulace'!A$3:A$999,)),\"\")","v":""},null,{"$f":"IF($A47=\"\",,SUMPRODUCT((LOOKUP(ROW(D$1:D$997),ROW(D$1:D$997)/ISNUMBER('Měsíční rekapitulace'!$L$1:$L$997),'Měsíční rekapitulace'!$L$1:$L$997)=D$4)*('Měsíční rekapitulace'!$A$3:$A$999=$A47)*TEXT('Měsíční rekapitulace'!$Q$3:$Q$999,\"0,0;0;0;\\0\")))","v":0},{"$f":"IF($A47=\"\",,SUMPRODUCT((LOOKUP(ROW(E$1:E$997),ROW(E$1:E$997)/ISNUMBER('Měsíční rekapitulace'!$L$1:$L$997),'Měsíční rekapitulace'!$L$1:$L$997)=E$4)*('Měsíční rekapitulace'!$A$3:$A$999=$A47)*TEXT('Měsíční rekapitulace'!$Q$3:$Q$999,\"0,0;0;0;\\0\")))","v":0},{"$f":"IF($A47=\"\",,SUMPRODUCT((LOOKUP(ROW(F$1:F$997),ROW(F$1:F$997)/ISNUMBER('Měsíční rekapitulace'!$L$1:$L$997),'Měsíční rekapitulace'!$L$1:$L$997)=F$4)*('Měsíční rekapitulace'!$A$3:$A$999=$A47)*TEXT('Měsíční rekapitulace'!$Q$3:$Q$999,\"0,0;0;0;\\0\")))","v":0},{"$f":"IF($A47=\"\",,SUMPRODUCT((LOOKUP(ROW(G$1:G$997),ROW(G$1:G$997)/ISNUMBER('Měsíční rekapitulace'!$L$1:$L$997),'Měsíční rekapitulace'!$L$1:$L$997)=G$4)*('Měsíční rekapitulace'!$A$3:$A$999=$A47)*TEXT('Měsíční rekapitulace'!$Q$3:$Q$999,\"0,0;0;0;\\0\")))","v":0},{"$f":"IF($A47=\"\",,SUMPRODUCT((LOOKUP(ROW(H$1:H$997),ROW(H$1:H$997)/ISNUMBER('Měsíční rekapitulace'!$L$1:$L$997),'Měsíční rekapitulace'!$L$1:$L$997)=H$4)*('Měsíční rekapitulace'!$A$3:$A$999=$A47)*TEXT('Měsíční rekapitulace'!$Q$3:$Q$999,\"0,0;0;0;\\0\")))","v":0},{"$f":"IF($A47=\"\",,SUMPRODUCT((LOOKUP(ROW(I$1:I$997),ROW(I$1:I$997)/ISNUMBER('Měsíční rekapitulace'!$L$1:$L$997),'Měsíční rekapitulace'!$L$1:$L$997)=I$4)*('Měsíční rekapitulace'!$A$3:$A$999=$A47)*TEXT('Měsíční rekapitulace'!$Q$3:$Q$999,\"0,0;0;0;\\0\")))","v":0},{"$f":"IF($A47=\"\",,SUMPRODUCT((LOOKUP(ROW(J$1:J$997),ROW(J$1:J$997)/ISNUMBER('Měsíční rekapitulace'!$L$1:$L$997),'Měsíční rekapitulace'!$L$1:$L$997)=J$4)*('Měsíční rekapitulace'!$A$3:$A$999=$A47)*TEXT('Měsíční rekapitulace'!$Q$3:$Q$999,\"0,0;0;0;\\0\")))","v":0},{"$f":"IF($A47=\"\",,SUMPRODUCT((LOOKUP(ROW(K$1:K$997),ROW(K$1:K$997)/ISNUMBER('Měsíční rekapitulace'!$L$1:$L$997),'Měsíční rekapitulace'!$L$1:$L$997)=K$4)*('Měsíční rekapitulace'!$A$3:$A$999=$A47)*TEXT('Měsíční rekapitulace'!$Q$3:$Q$999,\"0,0;0;0;\\0\")))","v":0},{"$f":"IF($A47=\"\",,SUMPRODUCT((LOOKUP(ROW(L$1:L$997),ROW(L$1:L$997)/ISNUMBER('Měsíční rekapitulace'!$L$1:$L$997),'Měsíční rekapitulace'!$L$1:$L$997)=L$4)*('Měsíční rekapitulace'!$A$3:$A$999=$A47)*TEXT('Měsíční rekapitulace'!$Q$3:$Q$999,\"0,0;0;0;\\0\")))","v":0},{"$f":"IF($A47=\"\",,SUMPRODUCT((LOOKUP(ROW(M$1:M$997),ROW(M$1:M$997)/ISNUMBER('Měsíční rekapitulace'!$L$1:$L$997),'Měsíční rekapitulace'!$L$1:$L$997)=M$4)*('Měsíční rekapitulace'!$A$3:$A$999=$A47)*TEXT('Měsíční rekapitulace'!$Q$3:$Q$999,\"0,0;0;0;\\0\")))","v":0},{"$f":"IF($A47=\"\",,SUMPRODUCT((LOOKUP(ROW(N$1:N$997),ROW(N$1:N$997)/ISNUMBER('Měsíční rekapitulace'!$L$1:$L$997),'Měsíční rekapitulace'!$L$1:$L$997)=N$4)*('Měsíční rekapitulace'!$A$3:$A$999=$A47)*TEXT('Měsíční rekapitulace'!$Q$3:$Q$999,\"0,0;0;0;\\0\")))","v":0},{"$f":"IF($A47=\"\",,SUMPRODUCT((LOOKUP(ROW(O$1:O$997),ROW(O$1:O$997)/ISNUMBER('Měsíční rekapitulace'!$L$1:$L$997),'Měsíční rekapitulace'!$L$1:$L$997)=O$4)*('Měsíční rekapitulace'!$A$3:$A$999=$A47)*TEXT('Měsíční rekapitulace'!$Q$3:$Q$999,\"0,0;0;0;\\0\")))","v":0},0]
[{"$f":"IFERROR(INDEX('Měsíční rekapitulace'!A$3:A$999,SMALL(IF(('Měsíční rekapitulace'!A$3:A$999<>\"\")*('Měsíční rekapitulace'!A$3:A$999<>'Měsíční rekapitulace'!$A$2)*(COUNTIF(A$5:A47,'Měsíční rekapitulace'!A$3:A$999)=0),ROW('Měsíční rekapitulace'!A$3:A$999)-2),1)),\"\")","v":""},{"$f":"IFERROR(INDEX('Měsíční rekapitulace'!E$3:E$999,MATCH(A48,'Měsíční rekapitulace'!A$3:A$999,)),\"\")","v":""},null,{"$f":"IF($A48=\"\",,SUMPRODUCT((LOOKUP(ROW(D$1:D$997),ROW(D$1:D$997)/ISNUMBER('Měsíční rekapitulace'!$L$1:$L$997),'Měsíční rekapitulace'!$L$1:$L$997)=D$4)*('Měsíční rekapitulace'!$A$3:$A$999=$A48)*TEXT('Měsíční rekapitulace'!$Q$3:$Q$999,\"0,0;0;0;\\0\")))","v":0},{"$f":"IF($A48=\"\",,SUMPRODUCT((LOOKUP(ROW(E$1:E$997),ROW(E$1:E$997)/ISNUMBER('Měsíční rekapitulace'!$L$1:$L$997),'Měsíční rekapitulace'!$L$1:$L$997)=E$4)*('Měsíční rekapitulace'!$A$3:$A$999=$A48)*TEXT('Měsíční rekapitulace'!$Q$3:$Q$999,\"0,0;0;0;\\0\")))","v":0},{"$f":"IF($A48=\"\",,SUMPRODUCT((LOOKUP(ROW(F$1:F$997),ROW(F$1:F$997)/ISNUMBER('Měsíční rekapitulace'!$L$1:$L$997),'Měsíční rekapitulace'!$L$1:$L$997)=F$4)*('Měsíční rekapitulace'!$A$3:$A$999=$A48)*TEXT('Měsíční rekapitulace'!$Q$3:$Q$999,\"0,0;0;0;\\0\")))","v":0},{"$f":"IF($A48=\"\",,SUMPRODUCT((LOOKUP(ROW(G$1:G$997),ROW(G$1:G$997)/ISNUMBER('Měsíční rekapitulace'!$L$1:$L$997),'Měsíční rekapitulace'!$L$1:$L$997)=G$4)*('Měsíční rekapitulace'!$A$3:$A$999=$A48)*TEXT('Měsíční rekapitulace'!$Q$3:$Q$999,\"0,0;0;0;\\0\")))","v":0},{"$f":"IF($A48=\"\",,SUMPRODUCT((LOOKUP(ROW(H$1:H$997),ROW(H$1:H$997)/ISNUMBER('Měsíční rekapitulace'!$L$1:$L$997),'Měsíční rekapitulace'!$L$1:$L$997)=H$4)*('Měsíční rekapitulace'!$A$3:$A$999=$A48)*TEXT('Měsíční rekapitulace'!$Q$3:$Q$999,\"0,0;0;0;\\0\")))","v":0},{"$f":"IF($A48=\"\",,SUMPRODUCT((LOOKUP(ROW(I$1:I$997),ROW(I$1:I$997)/ISNUMBER('Měsíční rekapitulace'!$L$1:$L$997),'Měsíční rekapitulace'!$L$1:$L$997)=I$4)*('Měsíční rekapitulace'!$A$3:$A$999=$A48)*TEXT('Měsíční rekapitulace'!$Q$3:$Q$999,\"0,0;0;0;\\0\")))","v":0},{"$f":"IF($A48=\"\",,SUMPRODUCT((LOOKUP(ROW(J$1:J$997),ROW(J$1:J$997)/ISNUMBER('Měsíční rekapitulace'!$L$1:$L$997),'Měsíční rekapitulace'!$L$1:$L$997)=J$4)*('Měsíční rekapitulace'!$A$3:$A$999=$A48)*TEXT('Měsíční rekapitulace'!$Q$3:$Q$999,\"0,0;0;0;\\0\")))","v":0},{"$f":"IF($A48=\"\",,SUMPRODUCT((LOOKUP(ROW(K$1:K$997),ROW(K$1:K$997)/ISNUMBER('Měsíční rekapitulace'!$L$1:$L$997),'Měsíční rekapitulace'!$L$1:$L$997)=K$4)*('Měsíční rekapitulace'!$A$3:$A$999=$A48)*TEXT('Měsíční rekapitulace'!$Q$3:$Q$999,\"0,0;0;0;\\0\")))","v":0},{"$f":"IF($A48=\"\",,SUMPRODUCT((LOOKUP(ROW(L$1:L$997),ROW(L$1:L$997)/ISNUMBER('Měsíční rekapitulace'!$L$1:$L$997),'Měsíční rekapitulace'!$L$1:$L$997)=L$4)*('Měsíční rekapitulace'!$A$3:$A$999=$A48)*TEXT('Měsíční rekapitulace'!$Q$3:$Q$999,\"0,0;0;0;\\0\")))","v":0},{"$f":"IF($A48=\"\",,SUMPRODUCT((LOOKUP(ROW(M$1:M$997),ROW(M$1:M$997)/ISNUMBER('Měsíční rekapitulace'!$L$1:$L$997),'Měsíční rekapitulace'!$L$1:$L$997)=M$4)*('Měsíční rekapitulace'!$A$3:$A$999=$A48)*TEXT('Měsíční rekapitulace'!$Q$3:$Q$999,\"0,0;0;0;\\0\")))","v":0},{"$f":"IF($A48=\"\",,SUMPRODUCT((LOOKUP(ROW(N$1:N$997),ROW(N$1:N$997)/ISNUMBER('Měsíční rekapitulace'!$L$1:$L$997),'Měsíční rekapitulace'!$L$1:$L$997)=N$4)*('Měsíční rekapitulace'!$A$3:$A$999=$A48)*TEXT('Měsíční rekapitulace'!$Q$3:$Q$999,\"0,0;0;0;\\0\")))","v":0},{"$f":"IF($A48=\"\",,SUMPRODUCT((LOOKUP(ROW(O$1:O$997),ROW(O$1:O$997)/ISNUMBER('Měsíční rekapitulace'!$L$1:$L$997),'Měsíční rekapitulace'!$L$1:$L$997)=O$4)*('Měsíční rekapitulace'!$A$3:$A$999=$A48)*TEXT('Měsíční rekapitulace'!$Q$3:$Q$999,\"0,0;0;0;\\0\")))","v":0},0]
[{"$f":"IFERROR(INDEX('Měsíční rekapitulace'!A$3:A$999,SMALL(IF(('Měsíční rekapitulace'!A$3:A$999<>\"\")*('Měsíční rekapitulace'!A$3:A$999<>'Měsíční rekapitulace'!$A$2)*(COUNTIF(A$5:A48,'Měsíční rekapitulace'!A$3:A$999)=0),ROW('Měsíční rekapitulace'!A$3:A$999)-2),1)),\"\")","v":""},{"$f":"IFERROR(INDEX('Měsíční rekapitulace'!E$3:E$999,MATCH(A49,'Měsíční rekapitulace'!A$3:A$999,)),\"\")","v":""},null,{"$f":"IF($A49=\"\",,SUMPRODUCT((LOOKUP(ROW(D$1:D$997),ROW(D$1:D$997)/ISNUMBER('Měsíční rekapitulace'!$L$1:$L$997),'Měsíční rekapitulace'!$L$1:$L$997)=D$4)*('Měsíční rekapitulace'!$A$3:$A$999=$A49)*TEXT('Měsíční rekapitulace'!$Q$3:$Q$999,\"0,0;0;0;\\0\")))","v":0},{"$f":"IF($A49=\"\",,SUMPRODUCT((LOOKUP(ROW(E$1:E$997),ROW(E$1:E$997)/ISNUMBER('Měsíční rekapitulace'!$L$1:$L$997),'Měsíční rekapitulace'!$L$1:$L$997)=E$4)*('Měsíční rekapitulace'!$A$3:$A$999=$A49)*TEXT('Měsíční rekapitulace'!$Q$3:$Q$999,\"0,0;0;0;\\0\")))","v":0},{"$f":"IF($A49=\"\",,SUMPRODUCT((LOOKUP(ROW(F$1:F$997),ROW(F$1:F$997)/ISNUMBER('Měsíční rekapitulace'!$L$1:$L$997),'Měsíční rekapitulace'!$L$1:$L$997)=F$4)*('Měsíční rekapitulace'!$A$3:$A$999=$A49)*TEXT('Měsíční rekapitulace'!$Q$3:$Q$999,\"0,0;0;0;\\0\")))","v":0},{"$f":"IF($A49=\"\",,SUMPRODUCT((LOOKUP(ROW(G$1:G$997),ROW(G$1:G$997)/ISNUMBER('Měsíční rekapitulace'!$L$1:$L$997),'Měsíční rekapitulace'!$L$1:$L$997)=G$4)*('Měsíční rekapitulace'!$A$3:$A$999=$A49)*TEXT('Měsíční rekapitulace'!$Q$3:$Q$999,\"0,0;0;0;\\0\")))","v":0},{"$f":"IF($A49=\"\",,SUMPRODUCT((LOOKUP(ROW(H$1:H$997),ROW(H$1:H$997)/ISNUMBER('Měsíční rekapitulace'!$L$1:$L$997),'Měsíční rekapitulace'!$L$1:$L$997)=H$4)*('Měsíční rekapitulace'!$A$3:$A$999=$A49)*TEXT('Měsíční rekapitulace'!$Q$3:$Q$999,\"0,0;0;0;\\0\")))","v":0},{"$f":"IF($A49=\"\",,SUMPRODUCT((LOOKUP(ROW(I$1:I$997),ROW(I$1:I$997)/ISNUMBER('Měsíční rekapitulace'!$L$1:$L$997),'Měsíční rekapitulace'!$L$1:$L$997)=I$4)*('Měsíční rekapitulace'!$A$3:$A$999=$A49)*TEXT('Měsíční rekapitulace'!$Q$3:$Q$999,\"0,0;0;0;\\0\")))","v":0},{"$f":"IF($A49=\"\",,SUMPRODUCT((LOOKUP(ROW(J$1:J$997),ROW(J$1:J$997)/ISNUMBER('Měsíční rekapitulace'!$L$1:$L$997),'Měsíční rekapitulace'!$L$1:$L$997)=J$4)*('Měsíční rekapitulace'!$A$3:$A$999=$A49)*TEXT('Měsíční rekapitulace'!$Q$3:$Q$999,\"0,0;0;0;\\0\")))","v":0},{"$f":"IF($A49=\"\",,SUMPRODUCT((LOOKUP(ROW(K$1:K$997),ROW(K$1:K$997)/ISNUMBER('Měsíční rekapitulace'!$L$1:$L$997),'Měsíční rekapitulace'!$L$1:$L$997)=K$4)*('Měsíční rekapitulace'!$A$3:$A$999=$A49)*TEXT('Měsíční rekapitulace'!$Q$3:$Q$999,\"0,0;0;0;\\0\")))","v":0},{"$f":"IF($A49=\"\",,SUMPRODUCT((LOOKUP(ROW(L$1:L$997),ROW(L$1:L$997)/ISNUMBER('Měsíční rekapitulace'!$L$1:$L$997),'Měsíční rekapitulace'!$L$1:$L$997)=L$4)*('Měsíční rekapitulace'!$A$3:$A$999=$A49)*TEXT('Měsíční rekapitulace'!$Q$3:$Q$999,\"0,0;0;0;\\0\")))","v":0},{"$f":"IF($A49=\"\",,SUMPRODUCT((LOOKUP(ROW(M$1:M$997),ROW(M$1:M$997)/ISNUMBER('Měsíční rekapitulace'!$L$1:$L$997),'Měsíční rekapitulace'!$L$1:$L$997)=M$4)*('Měsíční rekapitulace'!$A$3:$A$999=$A49)*TEXT('Měsíční rekapitulace'!$Q$3:$Q$999,\"0,0;0;0;\\0\")))","v":0},{"$f":"IF($A49=\"\",,SUMPRODUCT((LOOKUP(ROW(N$1:N$997),ROW(N$1:N$997)/ISNUMBER('Měsíční rekapitulace'!$L$1:$L$997),'Měsíční rekapitulace'!$L$1:$L$997)=N$4)*('Měsíční rekapitulace'!$A$3:$A$999=$A49)*TEXT('Měsíční rekapitulace'!$Q$3:$Q$999,\"0,0;0;0;\\0\")))","v":0},{"$f":"IF($A49=\"\",,SUMPRODUCT((LOOKUP(ROW(O$1:O$997),ROW(O$1:O$997)/ISNUMBER('Měsíční rekapitulace'!$L$1:$L$997),'Měsíční rekapitulace'!$L$1:$L$997)=O$4)*('Měsíční rekapitulace'!$A$3:$A$999=$A49)*TEXT('Měsíční rekapitulace'!$Q$3:$Q$999,\"0,0;0;0;\\0\")))","v":0},0]
[{"$f":"IFERROR(INDEX('Měsíční rekapitulace'!A$3:A$999,SMALL(IF(('Měsíční rekapitulace'!A$3:A$999<>\"\")*('Měsíční rekapitulace'!A$3:A$999<>'Měsíční rekapitulace'!$A$2)*(COUNTIF(A$5:A49,'Měsíční rekapitulace'!A$3:A$999)=0),ROW('Měsíční rekapitulace'!A$3:A$999)-2),1)),\"\")","v":""},{"$f":"IFERROR(INDEX('Měsíční rekapitulace'!E$3:E$999,MATCH(A50,'Měsíční rekapitulace'!A$3:A$999,)),\"\")","v":""},null,{"$f":"IF($A50=\"\",,SUMPRODUCT((LOOKUP(ROW(D$1:D$997),ROW(D$1:D$997)/ISNUMBER('Měsíční rekapitulace'!$L$1:$L$997),'Měsíční rekapitulace'!$L$1:$L$997)=D$4)*('Měsíční rekapitulace'!$A$3:$A$999=$A50)*TEXT('Měsíční rekapitulace'!$Q$3:$Q$999,\"0,0;0;0;\\0\")))","v":0},{"$f":"IF($A50=\"\",,SUMPRODUCT((LOOKUP(ROW(E$1:E$997),ROW(E$1:E$997)/ISNUMBER('Měsíční rekapitulace'!$L$1:$L$997),'Měsíční rekapitulace'!$L$1:$L$997)=E$4)*('Měsíční rekapitulace'!$A$3:$A$999=$A50)*TEXT('Měsíční rekapitulace'!$Q$3:$Q$999,\"0,0;0;0;\\0\")))","v":0},{"$f":"IF($A50=\"\",,SUMPRODUCT((LOOKUP(ROW(F$1:F$997),ROW(F$1:F$997)/ISNUMBER('Měsíční rekapitulace'!$L$1:$L$997),'Měsíční rekapitulace'!$L$1:$L$997)=F$4)*('Měsíční rekapitulace'!$A$3:$A$999=$A50)*TEXT('Měsíční rekapitulace'!$Q$3:$Q$999,\"0,0;0;0;\\0\")))","v":0},{"$f":"IF($A50=\"\",,SUMPRODUCT((LOOKUP(ROW(G$1:G$997),ROW(G$1:G$997)/ISNUMBER('Měsíční rekapitulace'!$L$1:$L$997),'Měsíční rekapitulace'!$L$1:$L$997)=G$4)*('Měsíční rekapitulace'!$A$3:$A$999=$A50)*TEXT('Měsíční rekapitulace'!$Q$3:$Q$999,\"0,0;0;0;\\0\")))","v":0},{"$f":"IF($A50=\"\",,SUMPRODUCT((LOOKUP(ROW(H$1:H$997),ROW(H$1:H$997)/ISNUMBER('Měsíční rekapitulace'!$L$1:$L$997),'Měsíční rekapitulace'!$L$1:$L$997)=H$4)*('Měsíční rekapitulace'!$A$3:$A$999=$A50)*TEXT('Měsíční rekapitulace'!$Q$3:$Q$999,\"0,0;0;0;\\0\")))","v":0},{"$f":"IF($A50=\"\",,SUMPRODUCT((LOOKUP(ROW(I$1:I$997),ROW(I$1:I$997)/ISNUMBER('Měsíční rekapitulace'!$L$1:$L$997),'Měsíční rekapitulace'!$L$1:$L$997)=I$4)*('Měsíční rekapitulace'!$A$3:$A$999=$A50)*TEXT('Měsíční rekapitulace'!$Q$3:$Q$999,\"0,0;0;0;\\0\")))","v":0},{"$f":"IF($A50=\"\",,SUMPRODUCT((LOOKUP(ROW(J$1:J$997),ROW(J$1:J$997)/ISNUMBER('Měsíční rekapitulace'!$L$1:$L$997),'Měsíční rekapitulace'!$L$1:$L$997)=J$4)*('Měsíční rekapitulace'!$A$3:$A$999=$A50)*TEXT('Měsíční rekapitulace'!$Q$3:$Q$999,\"0,0;0;0;\\0\")))","v":0},{"$f":"IF($A50=\"\",,SUMPRODUCT((LOOKUP(ROW(K$1:K$997),ROW(K$1:K$997)/ISNUMBER('Měsíční rekapitulace'!$L$1:$L$997),'Měsíční rekapitulace'!$L$1:$L$997)=K$4)*('Měsíční rekapitulace'!$A$3:$A$999=$A50)*TEXT('Měsíční rekapitulace'!$Q$3:$Q$999,\"0,0;0;0;\\0\")))","v":0},{"$f":"IF($A50=\"\",,SUMPRODUCT((LOOKUP(ROW(L$1:L$997),ROW(L$1:L$997)/ISNUMBER('Měsíční rekapitulace'!$L$1:$L$997),'Měsíční rekapitulace'!$L$1:$L$997)=L$4)*('Měsíční rekapitulace'!$A$3:$A$999=$A50)*TEXT('Měsíční rekapitulace'!$Q$3:$Q$999,\"0,0;0;0;\\0\")))","v":0},{"$f":"IF($A50=\"\",,SUMPRODUCT((LOOKUP(ROW(M$1:M$997),ROW(M$1:M$997)/ISNUMBER('Měsíční rekapitulace'!$L$1:$L$997),'Měsíční rekapitulace'!$L$1:$L$997)=M$4)*('Měsíční rekapitulace'!$A$3:$A$999=$A50)*TEXT('Měsíční rekapitulace'!$Q$3:$Q$999,\"0,0;0;0;\\0\")))","v":0},{"$f":"IF($A50=\"\",,SUMPRODUCT((LOOKUP(ROW(N$1:N$997),ROW(N$1:N$997)/ISNUMBER('Měsíční rekapitulace'!$L$1:$L$997),'Měsíční rekapitulace'!$L$1:$L$997)=N$4)*('Měsíční rekapitulace'!$A$3:$A$999=$A50)*TEXT('Měsíční rekapitulace'!$Q$3:$Q$999,\"0,0;0;0;\\0\")))","v":0},{"$f":"IF($A50=\"\",,SUMPRODUCT((LOOKUP(ROW(O$1:O$997),ROW(O$1:O$997)/ISNUMBER('Měsíční rekapitulace'!$L$1:$L$997),'Měsíční rekapitulace'!$L$1:$L$997)=O$4)*('Měsíční rekapitulace'!$A$3:$A$999=$A50)*TEXT('Měsíční rekapitulace'!$Q$3:$Q$999,\"0,0;0;0;\\0\")))","v":0},{"$f":"SUM(D50:O50)","v":0}]
[{"$f":"IFERROR(INDEX('Měsíční rekapitulace'!A$3:A$999,SMALL(IF(('Měsíční rekapitulace'!A$3:A$999<>\"\")*('Měsíční rekapitulace'!A$3:A$999<>'Měsíční rekapitulace'!$A$2)*(COUNTIF(A$5:A50,'Měsíční rekapitulace'!A$3:A$999)=0),ROW('Měsíční rekapitulace'!A$3:A$999)-2),1)),\"\")","v":""},{"$f":"IFERROR(INDEX('Měsíční rekapitulace'!E$3:E$999,MATCH(A51,'Měsíční rekapitulace'!A$3:A$999,)),\"\")","v":""},null,{"$f":"IF($A51=\"\",,SUMPRODUCT((LOOKUP(ROW(D$1:D$997),ROW(D$1:D$997)/ISNUMBER('Měsíční rekapitulace'!$L$1:$L$997),'Měsíční rekapitulace'!$L$1:$L$997)=D$4)*('Měsíční rekapitulace'!$A$3:$A$999=$A51)*TEXT('Měsíční rekapitulace'!$Q$3:$Q$999,\"0,0;0;0;\\0\")))","v":0},{"$f":"IF($A51=\"\",,SUMPRODUCT((LOOKUP(ROW(E$1:E$997),ROW(E$1:E$997)/ISNUMBER('Měsíční rekapitulace'!$L$1:$L$997),'Měsíční rekapitulace'!$L$1:$L$997)=E$4)*('Měsíční rekapitulace'!$A$3:$A$999=$A51)*TEXT('Měsíční rekapitulace'!$Q$3:$Q$999,\"0,0;0;0;\\0\")))","v":0},{"$f":"IF($A51=\"\",,SUMPRODUCT((LOOKUP(ROW(F$1:F$997),ROW(F$1:F$997)/ISNUMBER('Měsíční rekapitulace'!$L$1:$L$997),'Měsíční rekapitulace'!$L$1:$L$997)=F$4)*('Měsíční rekapitulace'!$A$3:$A$999=$A51)*TEXT('Měsíční rekapitulace'!$Q$3:$Q$999,\"0,0;0;0;\\0\")))","v":0},{"$f":"IF($A51=\"\",,SUMPRODUCT((LOOKUP(ROW(G$1:G$997),ROW(G$1:G$997)/ISNUMBER('Měsíční rekapitulace'!$L$1:$L$997),'Měsíční rekapitulace'!$L$1:$L$997)=G$4)*('Měsíční rekapitulace'!$A$3:$A$999=$A51)*TEXT('Měsíční rekapitulace'!$Q$3:$Q$999,\"0,0;0;0;\\0\")))","v":0},{"$f":"IF($A51=\"\",,SUMPRODUCT((LOOKUP(ROW(H$1:H$997),ROW(H$1:H$997)/ISNUMBER('Měsíční rekapitulace'!$L$1:$L$997),'Měsíční rekapitulace'!$L$1:$L$997)=H$4)*('Měsíční rekapitulace'!$A$3:$A$999=$A51)*TEXT('Měsíční rekapitulace'!$Q$3:$Q$999,\"0,0;0;0;\\0\")))","v":0},{"$f":"IF($A51=\"\",,SUMPRODUCT((LOOKUP(ROW(I$1:I$997),ROW(I$1:I$997)/ISNUMBER('Měsíční rekapitulace'!$L$1:$L$997),'Měsíční rekapitulace'!$L$1:$L$997)=I$4)*('Měsíční rekapitulace'!$A$3:$A$999=$A51)*TEXT('Měsíční rekapitulace'!$Q$3:$Q$999,\"0,0;0;0;\\0\")))","v":0},{"$f":"IF($A51=\"\",,SUMPRODUCT((LOOKUP(ROW(J$1:J$997),ROW(J$1:J$997)/ISNUMBER('Měsíční rekapitulace'!$L$1:$L$997),'Měsíční rekapitulace'!$L$1:$L$997)=J$4)*('Měsíční rekapitulace'!$A$3:$A$999=$A51)*TEXT('Měsíční rekapitulace'!$Q$3:$Q$999,\"0,0;0;0;\\0\")))","v":0},{"$f":"IF($A51=\"\",,SUMPRODUCT((LOOKUP(ROW(K$1:K$997),ROW(K$1:K$997)/ISNUMBER('Měsíční rekapitulace'!$L$1:$L$997),'Měsíční rekapitulace'!$L$1:$L$997)=K$4)*('Měsíční rekapitulace'!$A$3:$A$999=$A51)*TEXT('Měsíční rekapitulace'!$Q$3:$Q$999,\"0,0;0;0;\\0\")))","v":0},{"$f":"IF($A51=\"\",,SUMPRODUCT((LOOKUP(ROW(L$1:L$997),ROW(L$1:L$997)/ISNUMBER('Měsíční rekapitulace'!$L$1:$L$997),'Měsíční rekapitulace'!$L$1:$L$997)=L$4)*('Měsíční rekapitulace'!$A$3:$A$999=$A51)*TEXT('Měsíční rekapitulace'!$Q$3:$Q$999,\"0,0;0;0;\\0\")))","v":0},{"$f":"IF($A51=\"\",,SUMPRODUCT((LOOKUP(ROW(M$1:M$997),ROW(M$1:M$997)/ISNUMBER('Měsíční rekapitulace'!$L$1:$L$997),'Měsíční rekapitulace'!$L$1:$L$997)=M$4)*('Měsíční rekapitulace'!$A$3:$A$999=$A51)*TEXT('Měsíční rekapitulace'!$Q$3:$Q$999,\"0,0;0;0;\\0\")))","v":0},{"$f":"IF($A51=\"\",,SUMPRODUCT((LOOKUP(ROW(N$1:N$997),ROW(N$1:N$997)/ISNUMBER('Měsíční rekapitulace'!$L$1:$L$997),'Měsíční rekapitulace'!$L$1:$L$997)=N$4)*('Měsíční rekapitulace'!$A$3:$A$999=$A51)*TEXT('Měsíční rekapitulace'!$Q$3:$Q$999,\"0,0;0;0;\\0\")))","v":0},{"$f":"IF($A51=\"\",,SUMPRODUCT((LOOKUP(ROW(O$1:O$997),ROW(O$1:O$997)/ISNUMBER('Měsíční rekapitulace'!$L$1:$L$997),'Měsíční rekapitulace'!$L$1:$L$997)=O$4)*('Měsíční rekapitulace'!$A$3:$A$999=$A51)*TEXT('Měsíční rekapitulace'!$Q$3:$Q$999,\"0,0;0;0;\\0\")))","v":0},0]
[{"$f":"IFERROR(INDEX('Měsíční rekapitulace'!A$3:A$999,SMALL(IF(('Měsíční rekapitulace'!A$3:A$999<>\"\")*('Měsíční rekapitulace'!A$3:A$999<>'Měsíční rekapitulace'!$A$2)*(COUNTIF(A$5:A51,'Měsíční rekapitulace'!A$3:A$999)=0),ROW('Měsíční rekapitulace'!A$3:A$999)-2),1)),\"\")","v":""},{"$f":"IFERROR(INDEX('Měsíční rekapitulace'!E$3:E$999,MATCH(A52,'Měsíční rekapitulace'!A$3:A$999,)),\"\")","v":""},null,{"$f":"IF($A52=\"\",,SUMPRODUCT((LOOKUP(ROW(D$1:D$997),ROW(D$1:D$997)/ISNUMBER('Měsíční rekapitulace'!$L$1:$L$997),'Měsíční rekapitulace'!$L$1:$L$997)=D$4)*('Měsíční rekapitulace'!$A$3:$A$999=$A52)*TEXT('Měsíční rekapitulace'!$Q$3:$Q$999,\"0,0;0;0;\\0\")))","v":0},{"$f":"IF($A52=\"\",,SUMPRODUCT((LOOKUP(ROW(E$1:E$997),ROW(E$1:E$997)/ISNUMBER('Měsíční rekapitulace'!$L$1:$L$997),'Měsíční rekapitulace'!$L$1:$L$997)=E$4)*('Měsíční rekapitulace'!$A$3:$A$999=$A52)*TEXT('Měsíční rekapitulace'!$Q$3:$Q$999,\"0,0;0;0;\\0\")))","v":0},{"$f":"IF($A52=\"\",,SUMPRODUCT((LOOKUP(ROW(F$1:F$997),ROW(F$1:F$997)/ISNUMBER('Měsíční rekapitulace'!$L$1:$L$997),'Měsíční rekapitulace'!$L$1:$L$997)=F$4)*('Měsíční rekapitulace'!$A$3:$A$999=$A52)*TEXT('Měsíční rekapitulace'!$Q$3:$Q$999,\"0,0;0;0;\\0\")))","v":0},{"$f":"IF($A52=\"\",,SUMPRODUCT((LOOKUP(ROW(G$1:G$997),ROW(G$1:G$997)/ISNUMBER('Měsíční rekapitulace'!$L$1:$L$997),'Měsíční rekapitulace'!$L$1:$L$997)=G$4)*('Měsíční rekapitulace'!$A$3:$A$999=$A52)*TEXT('Měsíční rekapitulace'!$Q$3:$Q$999,\"0,0;0;0;\\0\")))","v":0},{"$f":"IF($A52=\"\",,SUMPRODUCT((LOOKUP(ROW(H$1:H$997),ROW(H$1:H$997)/ISNUMBER('Měsíční rekapitulace'!$L$1:$L$997),'Měsíční rekapitulace'!$L$1:$L$997)=H$4)*('Měsíční rekapitulace'!$A$3:$A$999=$A52)*TEXT('Měsíční rekapitulace'!$Q$3:$Q$999,\"0,0;0;0;\\0\")))","v":0},{"$f":"IF($A52=\"\",,SUMPRODUCT((LOOKUP(ROW(I$1:I$997),ROW(I$1:I$997)/ISNUMBER('Měsíční rekapitulace'!$L$1:$L$997),'Měsíční rekapitulace'!$L$1:$L$997)=I$4)*('Měsíční rekapitulace'!$A$3:$A$999=$A52)*TEXT('Měsíční rekapitulace'!$Q$3:$Q$999,\"0,0;0;0;\\0\")))","v":0},{"$f":"IF($A52=\"\",,SUMPRODUCT((LOOKUP(ROW(J$1:J$997),ROW(J$1:J$997)/ISNUMBER('Měsíční rekapitulace'!$L$1:$L$997),'Měsíční rekapitulace'!$L$1:$L$997)=J$4)*('Měsíční rekapitulace'!$A$3:$A$999=$A52)*TEXT('Měsíční rekapitulace'!$Q$3:$Q$999,\"0,0;0;0;\\0\")))","v":0},{"$f":"IF($A52=\"\",,SUMPRODUCT((LOOKUP(ROW(K$1:K$997),ROW(K$1:K$997)/ISNUMBER('Měsíční rekapitulace'!$L$1:$L$997),'Měsíční rekapitulace'!$L$1:$L$997)=K$4)*('Měsíční rekapitulace'!$A$3:$A$999=$A52)*TEXT('Měsíční rekapitulace'!$Q$3:$Q$999,\"0,0;0;0;\\0\")))","v":0},{"$f":"IF($A52=\"\",,SUMPRODUCT((LOOKUP(ROW(L$1:L$997),ROW(L$1:L$997)/ISNUMBER('Měsíční rekapitulace'!$L$1:$L$997),'Měsíční rekapitulace'!$L$1:$L$997)=L$4)*('Měsíční rekapitulace'!$A$3:$A$999=$A52)*TEXT('Měsíční rekapitulace'!$Q$3:$Q$999,\"0,0;0;0;\\0\")))","v":0},{"$f":"IF($A52=\"\",,SUMPRODUCT((LOOKUP(ROW(M$1:M$997),ROW(M$1:M$997)/ISNUMBER('Měsíční rekapitulace'!$L$1:$L$997),'Měsíční rekapitulace'!$L$1:$L$997)=M$4)*('Měsíční rekapitulace'!$A$3:$A$999=$A52)*TEXT('Měsíční rekapitulace'!$Q$3:$Q$999,\"0,0;0;0;\\0\")))","v":0},{"$f":"IF($A52=\"\",,SUMPRODUCT((LOOKUP(ROW(N$1:N$997),ROW(N$1:N$997)/ISNUMBER('Měsíční rekapitulace'!$L$1:$L$997),'Měsíční rekapitulace'!$L$1:$L$997)=N$4)*('Měsíční rekapitulace'!$A$3:$A$999=$A52)*TEXT('Měsíční rekapitulace'!$Q$3:$Q$999,\"0,0;0;0;\\0\")))","v":0},{"$f":"IF($A52=\"\",,SUMPRODUCT((LOOKUP(ROW(O$1:O$997),ROW(O$1:O$997)/ISNUMBER('Měsíční rekapitulace'!$L$1:$L$997),'Měsíční rekapitulace'!$L$1:$L$997)=O$4)*('Měsíční rekapitulace'!$A$3:$A$999=$A52)*TEXT('Měsíční rekapitulace'!$Q$3:$Q$999,\"0,0;0;0;\\0\")))","v":0},0]
[{"$f":"IFERROR(INDEX('Měsíční rekapitulace'!A$3:A$999,SMALL(IF(('Měsíční rekapitulace'!A$3:A$999<>\"\")*('Měsíční rekapitulace'!A$3:A$999<>'Měsíční rekapitulace'!$A$2)*(COUNTIF(A$5:A52,'Měsíční rekapitulace'!A$3:A$999)=0),ROW('Měsíční rekapitulace'!A$3:A$999)-2),1)),\"\")","v":""},{"$f":"IFERROR(INDEX('Měsíční rekapitulace'!E$3:E$999,MATCH(A53,'Měsíční rekapitulace'!A$3:A$999,)),\"\")","v":""},null,{"$f":"IF($A53=\"\",,SUMPRODUCT((LOOKUP(ROW(D$1:D$997),ROW(D$1:D$997)/ISNUMBER('Měsíční rekapitulace'!$L$1:$L$997),'Měsíční rekapitulace'!$L$1:$L$997)=D$4)*('Měsíční rekapitulace'!$A$3:$A$999=$A53)*TEXT('Měsíční rekapitulace'!$Q$3:$Q$999,\"0,0;0;0;\\0\")))","v":0},{"$f":"IF($A53=\"\",,SUMPRODUCT((LOOKUP(ROW(E$1:E$997),ROW(E$1:E$997)/ISNUMBER('Měsíční rekapitulace'!$L$1:$L$997),'Měsíční rekapitulace'!$L$1:$L$997)=E$4)*('Měsíční rekapitulace'!$A$3:$A$999=$A53)*TEXT('Měsíční rekapitulace'!$Q$3:$Q$999,\"0,0;0;0;\\0\")))","v":0},{"$f":"IF($A53=\"\",,SUMPRODUCT((LOOKUP(ROW(F$1:F$997),ROW(F$1:F$997)/ISNUMBER('Měsíční rekapitulace'!$L$1:$L$997),'Měsíční rekapitulace'!$L$1:$L$997)=F$4)*('Měsíční rekapitulace'!$A$3:$A$999=$A53)*TEXT('Měsíční rekapitulace'!$Q$3:$Q$999,\"0,0;0;0;\\0\")))","v":0},{"$f":"IF($A53=\"\",,SUMPRODUCT((LOOKUP(ROW(G$1:G$997),ROW(G$1:G$997)/ISNUMBER('Měsíční rekapitulace'!$L$1:$L$997),'Měsíční rekapitulace'!$L$1:$L$997)=G$4)*('Měsíční rekapitulace'!$A$3:$A$999=$A53)*TEXT('Měsíční rekapitulace'!$Q$3:$Q$999,\"0,0;0;0;\\0\")))","v":0},{"$f":"IF($A53=\"\",,SUMPRODUCT((LOOKUP(ROW(H$1:H$997),ROW(H$1:H$997)/ISNUMBER('Měsíční rekapitulace'!$L$1:$L$997),'Měsíční rekapitulace'!$L$1:$L$997)=H$4)*('Měsíční rekapitulace'!$A$3:$A$999=$A53)*TEXT('Měsíční rekapitulace'!$Q$3:$Q$999,\"0,0;0;0;\\0\")))","v":0},{"$f":"IF($A53=\"\",,SUMPRODUCT((LOOKUP(ROW(I$1:I$997),ROW(I$1:I$997)/ISNUMBER('Měsíční rekapitulace'!$L$1:$L$997),'Měsíční rekapitulace'!$L$1:$L$997)=I$4)*('Měsíční rekapitulace'!$A$3:$A$999=$A53)*TEXT('Měsíční rekapitulace'!$Q$3:$Q$999,\"0,0;0;0;\\0\")))","v":0},{"$f":"IF($A53=\"\",,SUMPRODUCT((LOOKUP(ROW(J$1:J$997),ROW(J$1:J$997)/ISNUMBER('Měsíční rekapitulace'!$L$1:$L$997),'Měsíční rekapitulace'!$L$1:$L$997)=J$4)*('Měsíční rekapitulace'!$A$3:$A$999=$A53)*TEXT('Měsíční rekapitulace'!$Q$3:$Q$999,\"0,0;0;0;\\0\")))","v":0},{"$f":"IF($A53=\"\",,SUMPRODUCT((LOOKUP(ROW(K$1:K$997),ROW(K$1:K$997)/ISNUMBER('Měsíční rekapitulace'!$L$1:$L$997),'Měsíční rekapitulace'!$L$1:$L$997)=K$4)*('Měsíční rekapitulace'!$A$3:$A$999=$A53)*TEXT('Měsíční rekapitulace'!$Q$3:$Q$999,\"0,0;0;0;\\0\")))","v":0},{"$f":"IF($A53=\"\",,SUMPRODUCT((LOOKUP(ROW(L$1:L$997),ROW(L$1:L$997)/ISNUMBER('Měsíční rekapitulace'!$L$1:$L$997),'Měsíční rekapitulace'!$L$1:$L$997)=L$4)*('Měsíční rekapitulace'!$A$3:$A$999=$A53)*TEXT('Měsíční rekapitulace'!$Q$3:$Q$999,\"0,0;0;0;\\0\")))","v":0},{"$f":"IF($A53=\"\",,SUMPRODUCT((LOOKUP(ROW(M$1:M$997),ROW(M$1:M$997)/ISNUMBER('Měsíční rekapitulace'!$L$1:$L$997),'Měsíční rekapitulace'!$L$1:$L$997)=M$4)*('Měsíční rekapitulace'!$A$3:$A$999=$A53)*TEXT('Měsíční rekapitulace'!$Q$3:$Q$999,\"0,0;0;0;\\0\")))","v":0},{"$f":"IF($A53=\"\",,SUMPRODUCT((LOOKUP(ROW(N$1:N$997),ROW(N$1:N$997)/ISNUMBER('Měsíční rekapitulace'!$L$1:$L$997),'Měsíční rekapitulace'!$L$1:$L$997)=N$4)*('Měsíční rekapitulace'!$A$3:$A$999=$A53)*TEXT('Měsíční rekapitulace'!$Q$3:$Q$999,\"0,0;0;0;\\0\")))","v":0},{"$f":"IF($A53=\"\",,SUMPRODUCT((LOOKUP(ROW(O$1:O$997),ROW(O$1:O$997)/ISNUMBER('Měsíční rekapitulace'!$L$1:$L$997),'Měsíční rekapitulace'!$L$1:$L$997)=O$4)*('Měsíční rekapitulace'!$A$3:$A$999=$A53)*TEXT('Měsíční rekapitulace'!$Q$3:$Q$999,\"0,0;0;0;\\0\")))","v":0},0]
[{"$f":"IFERROR(INDEX('Měsíční rekapitulace'!A$3:A$999,SMALL(IF(('Měsíční rekapitulace'!A$3:A$999<>\"\")*('Měsíční rekapitulace'!A$3:A$999<>'Měsíční rekapitulace'!$A$2)*(COUNTIF(A$5:A53,'Měsíční rekapitulace'!A$3:A$999)=0),ROW('Měsíční rekapitulace'!A$3:A$999)-2),1)),\"\")","v":""},{"$f":"IFERROR(INDEX('Měsíční rekapitulace'!E$3:E$999,MATCH(A54,'Měsíční rekapitulace'!A$3:A$999,)),\"\")","v":""},null,{"$f":"IF($A54=\"\",,SUMPRODUCT((LOOKUP(ROW(D$1:D$997),ROW(D$1:D$997)/ISNUMBER('Měsíční rekapitulace'!$L$1:$L$997),'Měsíční rekapitulace'!$L$1:$L$997)=D$4)*('Měsíční rekapitulace'!$A$3:$A$999=$A54)*TEXT('Měsíční rekapitulace'!$Q$3:$Q$999,\"0,0;0;0;\\0\")))","v":0},{"$f":"IF($A54=\"\",,SUMPRODUCT((LOOKUP(ROW(E$1:E$997),ROW(E$1:E$997)/ISNUMBER('Měsíční rekapitulace'!$L$1:$L$997),'Měsíční rekapitulace'!$L$1:$L$997)=E$4)*('Měsíční rekapitulace'!$A$3:$A$999=$A54)*TEXT('Měsíční rekapitulace'!$Q$3:$Q$999,\"0,0;0;0;\\0\")))","v":0},{"$f":"IF($A54=\"\",,SUMPRODUCT((LOOKUP(ROW(F$1:F$997),ROW(F$1:F$997)/ISNUMBER('Měsíční rekapitulace'!$L$1:$L$997),'Měsíční rekapitulace'!$L$1:$L$997)=F$4)*('Měsíční rekapitulace'!$A$3:$A$999=$A54)*TEXT('Měsíční rekapitulace'!$Q$3:$Q$999,\"0,0;0;0;\\0\")))","v":0},{"$f":"IF($A54=\"\",,SUMPRODUCT((LOOKUP(ROW(G$1:G$997),ROW(G$1:G$997)/ISNUMBER('Měsíční rekapitulace'!$L$1:$L$997),'Měsíční rekapitulace'!$L$1:$L$997)=G$4)*('Měsíční rekapitulace'!$A$3:$A$999=$A54)*TEXT('Měsíční rekapitulace'!$Q$3:$Q$999,\"0,0;0;0;\\0\")))","v":0},{"$f":"IF($A54=\"\",,SUMPRODUCT((LOOKUP(ROW(H$1:H$997),ROW(H$1:H$997)/ISNUMBER('Měsíční rekapitulace'!$L$1:$L$997),'Měsíční rekapitulace'!$L$1:$L$997)=H$4)*('Měsíční rekapitulace'!$A$3:$A$999=$A54)*TEXT('Měsíční rekapitulace'!$Q$3:$Q$999,\"0,0;0;0;\\0\")))","v":0},{"$f":"IF($A54=\"\",,SUMPRODUCT((LOOKUP(ROW(I$1:I$997),ROW(I$1:I$997)/ISNUMBER('Měsíční rekapitulace'!$L$1:$L$997),'Měsíční rekapitulace'!$L$1:$L$997)=I$4)*('Měsíční rekapitulace'!$A$3:$A$999=$A54)*TEXT('Měsíční rekapitulace'!$Q$3:$Q$999,\"0,0;0;0;\\0\")))","v":0},{"$f":"IF($A54=\"\",,SUMPRODUCT((LOOKUP(ROW(J$1:J$997),ROW(J$1:J$997)/ISNUMBER('Měsíční rekapitulace'!$L$1:$L$997),'Měsíční rekapitulace'!$L$1:$L$997)=J$4)*('Měsíční rekapitulace'!$A$3:$A$999=$A54)*TEXT('Měsíční rekapitulace'!$Q$3:$Q$999,\"0,0;0;0;\\0\")))","v":0},{"$f":"IF($A54=\"\",,SUMPRODUCT((LOOKUP(ROW(K$1:K$997),ROW(K$1:K$997)/ISNUMBER('Měsíční rekapitulace'!$L$1:$L$997),'Měsíční rekapitulace'!$L$1:$L$997)=K$4)*('Měsíční rekapitulace'!$A$3:$A$999=$A54)*TEXT('Měsíční rekapitulace'!$Q$3:$Q$999,\"0,0;0;0;\\0\")))","v":0},{"$f":"IF($A54=\"\",,SUMPRODUCT((LOOKUP(ROW(L$1:L$997),ROW(L$1:L$997)/ISNUMBER('Měsíční rekapitulace'!$L$1:$L$997),'Měsíční rekapitulace'!$L$1:$L$997)=L$4)*('Měsíční rekapitulace'!$A$3:$A$999=$A54)*TEXT('Měsíční rekapitulace'!$Q$3:$Q$999,\"0,0;0;0;\\0\")))","v":0},{"$f":"IF($A54=\"\",,SUMPRODUCT((LOOKUP(ROW(M$1:M$997),ROW(M$1:M$997)/ISNUMBER('Měsíční rekapitulace'!$L$1:$L$997),'Měsíční rekapitulace'!$L$1:$L$997)=M$4)*('Měsíční rekapitulace'!$A$3:$A$999=$A54)*TEXT('Měsíční rekapitulace'!$Q$3:$Q$999,\"0,0;0;0;\\0\")))","v":0},{"$f":"IF($A54=\"\",,SUMPRODUCT((LOOKUP(ROW(N$1:N$997),ROW(N$1:N$997)/ISNUMBER('Měsíční rekapitulace'!$L$1:$L$997),'Měsíční rekapitulace'!$L$1:$L$997)=N$4)*('Měsíční rekapitulace'!$A$3:$A$999=$A54)*TEXT('Měsíční rekapitulace'!$Q$3:$Q$999,\"0,0;0;0;\\0\")))","v":0},{"$f":"IF($A54=\"\",,SUMPRODUCT((LOOKUP(ROW(O$1:O$997),ROW(O$1:O$997)/ISNUMBER('Měsíční rekapitulace'!$L$1:$L$997),'Měsíční rekapitulace'!$L$1:$L$997)=O$4)*('Měsíční rekapitulace'!$A$3:$A$999=$A54)*TEXT('Měsíční rekapitulace'!$Q$3:$Q$999,\"0,0;0;0;\\0\")))","v":0},0]
[{"$f":"IFERROR(INDEX('Měsíční rekapitulace'!A$3:A$999,SMALL(IF(('Měsíční rekapitulace'!A$3:A$999<>\"\")*('Měsíční rekapitulace'!A$3:A$999<>'Měsíční rekapitulace'!$A$2)*(COUNTIF(A$5:A54,'Měsíční rekapitulace'!A$3:A$999)=0),ROW('Měsíční rekapitulace'!A$3:A$999)-2),1)),\"\")","v":""},{"$f":"IFERROR(INDEX('Měsíční rekapitulace'!E$3:E$999,MATCH(A55,'Měsíční rekapitulace'!A$3:A$999,)),\"\")","v":""},null,{"$f":"IF($A55=\"\",,SUMPRODUCT((LOOKUP(ROW(D$1:D$997),ROW(D$1:D$997)/ISNUMBER('Měsíční rekapitulace'!$L$1:$L$997),'Měsíční rekapitulace'!$L$1:$L$997)=D$4)*('Měsíční rekapitulace'!$A$3:$A$999=$A55)*TEXT('Měsíční rekapitulace'!$Q$3:$Q$999,\"0,0;0;0;\\0\")))","v":0},{"$f":"IF($A55=\"\",,SUMPRODUCT((LOOKUP(ROW(E$1:E$997),ROW(E$1:E$997)/ISNUMBER('Měsíční rekapitulace'!$L$1:$L$997),'Měsíční rekapitulace'!$L$1:$L$997)=E$4)*('Měsíční rekapitulace'!$A$3:$A$999=$A55)*TEXT('Měsíční rekapitulace'!$Q$3:$Q$999,\"0,0;0;0;\\0\")))","v":0},{"$f":"IF($A55=\"\",,SUMPRODUCT((LOOKUP(ROW(F$1:F$997),ROW(F$1:F$997)/ISNUMBER('Měsíční rekapitulace'!$L$1:$L$997),'Měsíční rekapitulace'!$L$1:$L$997)=F$4)*('Měsíční rekapitulace'!$A$3:$A$999=$A55)*TEXT('Měsíční rekapitulace'!$Q$3:$Q$999,\"0,0;0;0;\\0\")))","v":0},{"$f":"IF($A55=\"\",,SUMPRODUCT((LOOKUP(ROW(G$1:G$997),ROW(G$1:G$997)/ISNUMBER('Měsíční rekapitulace'!$L$1:$L$997),'Měsíční rekapitulace'!$L$1:$L$997)=G$4)*('Měsíční rekapitulace'!$A$3:$A$999=$A55)*TEXT('Měsíční rekapitulace'!$Q$3:$Q$999,\"0,0;0;0;\\0\")))","v":0},{"$f":"IF($A55=\"\",,SUMPRODUCT((LOOKUP(ROW(H$1:H$997),ROW(H$1:H$997)/ISNUMBER('Měsíční rekapitulace'!$L$1:$L$997),'Měsíční rekapitulace'!$L$1:$L$997)=H$4)*('Měsíční rekapitulace'!$A$3:$A$999=$A55)*TEXT('Měsíční rekapitulace'!$Q$3:$Q$999,\"0,0;0;0;\\0\")))","v":0},{"$f":"IF($A55=\"\",,SUMPRODUCT((LOOKUP(ROW(I$1:I$997),ROW(I$1:I$997)/ISNUMBER('Měsíční rekapitulace'!$L$1:$L$997),'Měsíční rekapitulace'!$L$1:$L$997)=I$4)*('Měsíční rekapitulace'!$A$3:$A$999=$A55)*TEXT('Měsíční rekapitulace'!$Q$3:$Q$999,\"0,0;0;0;\\0\")))","v":0},{"$f":"IF($A55=\"\",,SUMPRODUCT((LOOKUP(ROW(J$1:J$997),ROW(J$1:J$997)/ISNUMBER('Měsíční rekapitulace'!$L$1:$L$997),'Měsíční rekapitulace'!$L$1:$L$997)=J$4)*('Měsíční rekapitulace'!$A$3:$A$999=$A55)*TEXT('Měsíční rekapitulace'!$Q$3:$Q$999,\"0,0;0;0;\\0\")))","v":0},{"$f":"IF($A55=\"\",,SUMPRODUCT((LOOKUP(ROW(K$1:K$997),ROW(K$1:K$997)/ISNUMBER('Měsíční rekapitulace'!$L$1:$L$997),'Měsíční rekapitulace'!$L$1:$L$997)=K$4)*('Měsíční rekapitulace'!$A$3:$A$999=$A55)*TEXT('Měsíční rekapitulace'!$Q$3:$Q$999,\"0,0;0;0;\\0\")))","v":0},{"$f":"IF($A55=\"\",,SUMPRODUCT((LOOKUP(ROW(L$1:L$997),ROW(L$1:L$997)/ISNUMBER('Měsíční rekapitulace'!$L$1:$L$997),'Měsíční rekapitulace'!$L$1:$L$997)=L$4)*('Měsíční rekapitulace'!$A$3:$A$999=$A55)*TEXT('Měsíční rekapitulace'!$Q$3:$Q$999,\"0,0;0;0;\\0\")))","v":0},{"$f":"IF($A55=\"\",,SUMPRODUCT((LOOKUP(ROW(M$1:M$997),ROW(M$1:M$997)/ISNUMBER('Měsíční rekapitulace'!$L$1:$L$997),'Měsíční rekapitulace'!$L$1:$L$997)=M$4)*('Měsíční rekapitulace'!$A$3:$A$999=$A55)*TEXT('Měsíční rekapitulace'!$Q$3:$Q$999,\"0,0;0;0;\\0\")))","v":0},{"$f":"IF($A55=\"\",,SUMPRODUCT((LOOKUP(ROW(N$1:N$997),ROW(N$1:N$997)/ISNUMBER('Měsíční rekapitulace'!$L$1:$L$997),'Měsíční rekapitulace'!$L$1:$L$997)=N$4)*('Měsíční rekapitulace'!$A$3:$A$999=$A55)*TEXT('Měsíční rekapitulace'!$Q$3:$Q$999,\"0,0;0;0;\\0\")))","v":0},{"$f":"IF($A55=\"\",,SUMPRODUCT((LOOKUP(ROW(O$1:O$997),ROW(O$1:O$997)/ISNUMBER('Měsíční rekapitulace'!$L$1:$L$997),'Měsíční rekapitulace'!$L$1:$L$997)=O$4)*('Měsíční rekapitulace'!$A$3:$A$999=$A55)*TEXT('Měsíční rekapitulace'!$Q$3:$Q$999,\"0,0;0;0;\\0\")))","v":0},0]
[{"$f":"IFERROR(INDEX('Měsíční rekapitulace'!A$3:A$999,SMALL(IF(('Měsíční rekapitulace'!A$3:A$999<>\"\")*('Měsíční rekapitulace'!A$3:A$999<>'Měsíční rekapitulace'!$A$2)*(COUNTIF(A$5:A55,'Měsíční rekapitulace'!A$3:A$999)=0),ROW('Měsíční rekapitulace'!A$3:A$999)-2),1)),\"\")","v":""},{"$f":"IFERROR(INDEX('Měsíční rekapitulace'!E$3:E$999,MATCH(A56,'Měsíční rekapitulace'!A$3:A$999,)),\"\")","v":""},null,{"$f":"IF($A56=\"\",,SUMPRODUCT((LOOKUP(ROW(D$1:D$997),ROW(D$1:D$997)/ISNUMBER('Měsíční rekapitulace'!$L$1:$L$997),'Měsíční rekapitulace'!$L$1:$L$997)=D$4)*('Měsíční rekapitulace'!$A$3:$A$999=$A56)*TEXT('Měsíční rekapitulace'!$Q$3:$Q$999,\"0,0;0;0;\\0\")))","v":0},{"$f":"IF($A56=\"\",,SUMPRODUCT((LOOKUP(ROW(E$1:E$997),ROW(E$1:E$997)/ISNUMBER('Měsíční rekapitulace'!$L$1:$L$997),'Měsíční rekapitulace'!$L$1:$L$997)=E$4)*('Měsíční rekapitulace'!$A$3:$A$999=$A56)*TEXT('Měsíční rekapitulace'!$Q$3:$Q$999,\"0,0;0;0;\\0\")))","v":0},{"$f":"IF($A56=\"\",,SUMPRODUCT((LOOKUP(ROW(F$1:F$997),ROW(F$1:F$997)/ISNUMBER('Měsíční rekapitulace'!$L$1:$L$997),'Měsíční rekapitulace'!$L$1:$L$997)=F$4)*('Měsíční rekapitulace'!$A$3:$A$999=$A56)*TEXT('Měsíční rekapitulace'!$Q$3:$Q$999,\"0,0;0;0;\\0\")))","v":0},{"$f":"IF($A56=\"\",,SUMPRODUCT((LOOKUP(ROW(G$1:G$997),ROW(G$1:G$997)/ISNUMBER('Měsíční rekapitulace'!$L$1:$L$997),'Měsíční rekapitulace'!$L$1:$L$997)=G$4)*('Měsíční rekapitulace'!$A$3:$A$999=$A56)*TEXT('Měsíční rekapitulace'!$Q$3:$Q$999,\"0,0;0;0;\\0\")))","v":0},{"$f":"IF($A56=\"\",,SUMPRODUCT((LOOKUP(ROW(H$1:H$997),ROW(H$1:H$997)/ISNUMBER('Měsíční rekapitulace'!$L$1:$L$997),'Měsíční rekapitulace'!$L$1:$L$997)=H$4)*('Měsíční rekapitulace'!$A$3:$A$999=$A56)*TEXT('Měsíční rekapitulace'!$Q$3:$Q$999,\"0,0;0;0;\\0\")))","v":0},{"$f":"IF($A56=\"\",,SUMPRODUCT((LOOKUP(ROW(I$1:I$997),ROW(I$1:I$997)/ISNUMBER('Měsíční rekapitulace'!$L$1:$L$997),'Měsíční rekapitulace'!$L$1:$L$997)=I$4)*('Měsíční rekapitulace'!$A$3:$A$999=$A56)*TEXT('Měsíční rekapitulace'!$Q$3:$Q$999,\"0,0;0;0;\\0\")))","v":0},{"$f":"IF($A56=\"\",,SUMPRODUCT((LOOKUP(ROW(J$1:J$997),ROW(J$1:J$997)/ISNUMBER('Měsíční rekapitulace'!$L$1:$L$997),'Měsíční rekapitulace'!$L$1:$L$997)=J$4)*('Měsíční rekapitulace'!$A$3:$A$999=$A56)*TEXT('Měsíční rekapitulace'!$Q$3:$Q$999,\"0,0;0;0;\\0\")))","v":0},{"$f":"IF($A56=\"\",,SUMPRODUCT((LOOKUP(ROW(K$1:K$997),ROW(K$1:K$997)/ISNUMBER('Měsíční rekapitulace'!$L$1:$L$997),'Měsíční rekapitulace'!$L$1:$L$997)=K$4)*('Měsíční rekapitulace'!$A$3:$A$999=$A56)*TEXT('Měsíční rekapitulace'!$Q$3:$Q$999,\"0,0;0;0;\\0\")))","v":0},{"$f":"IF($A56=\"\",,SUMPRODUCT((LOOKUP(ROW(L$1:L$997),ROW(L$1:L$997)/ISNUMBER('Měsíční rekapitulace'!$L$1:$L$997),'Měsíční rekapitulace'!$L$1:$L$997)=L$4)*('Měsíční rekapitulace'!$A$3:$A$999=$A56)*TEXT('Měsíční rekapitulace'!$Q$3:$Q$999,\"0,0;0;0;\\0\")))","v":0},{"$f":"IF($A56=\"\",,SUMPRODUCT((LOOKUP(ROW(M$1:M$997),ROW(M$1:M$997)/ISNUMBER('Měsíční rekapitulace'!$L$1:$L$997),'Měsíční rekapitulace'!$L$1:$L$997)=M$4)*('Měsíční rekapitulace'!$A$3:$A$999=$A56)*TEXT('Měsíční rekapitulace'!$Q$3:$Q$999,\"0,0;0;0;\\0\")))","v":0},{"$f":"IF($A56=\"\",,SUMPRODUCT((LOOKUP(ROW(N$1:N$997),ROW(N$1:N$997)/ISNUMBER('Měsíční rekapitulace'!$L$1:$L$997),'Měsíční rekapitulace'!$L$1:$L$997)=N$4)*('Měsíční rekapitulace'!$A$3:$A$999=$A56)*TEXT('Měsíční rekapitulace'!$Q$3:$Q$999,\"0,0;0;0;\\0\")))","v":0},{"$f":"IF($A56=\"\",,SUMPRODUCT((LOOKUP(ROW(O$1:O$997),ROW(O$1:O$997)/ISNUMBER('Měsíční rekapitulace'!$L$1:$L$997),'Měsíční rekapitulace'!$L$1:$L$997)=O$4)*('Měsíční rekapitulace'!$A$3:$A$999=$A56)*TEXT('Měsíční rekapitulace'!$Q$3:$Q$999,\"0,0;0;0;\\0\")))","v":0},0]
[{"$f":"IFERROR(INDEX('Měsíční rekapitulace'!A$3:A$999,SMALL(IF(('Měsíční rekapitulace'!A$3:A$999<>\"\")*('Měsíční rekapitulace'!A$3:A$999<>'Měsíční rekapitulace'!$A$2)*(COUNTIF(A$5:A56,'Měsíční rekapitulace'!A$3:A$999)=0),ROW('Měsíční rekapitulace'!A$3:A$999)-2),1)),\"\")","v":""},{"$f":"IFERROR(INDEX('Měsíční rekapitulace'!E$3:E$999,MATCH(A57,'Měsíční rekapitulace'!A$3:A$999,)),\"\")","v":""},null,{"$f":"IF($A57=\"\",,SUMPRODUCT((LOOKUP(ROW(D$1:D$997),ROW(D$1:D$997)/ISNUMBER('Měsíční rekapitulace'!$L$1:$L$997),'Měsíční rekapitulace'!$L$1:$L$997)=D$4)*('Měsíční rekapitulace'!$A$3:$A$999=$A57)*TEXT('Měsíční rekapitulace'!$Q$3:$Q$999,\"0,0;0;0;\\0\")))","v":0},{"$f":"IF($A57=\"\",,SUMPRODUCT((LOOKUP(ROW(E$1:E$997),ROW(E$1:E$997)/ISNUMBER('Měsíční rekapitulace'!$L$1:$L$997),'Měsíční rekapitulace'!$L$1:$L$997)=E$4)*('Měsíční rekapitulace'!$A$3:$A$999=$A57)*TEXT('Měsíční rekapitulace'!$Q$3:$Q$999,\"0,0;0;0;\\0\")))","v":0},{"$f":"IF($A57=\"\",,SUMPRODUCT((LOOKUP(ROW(F$1:F$997),ROW(F$1:F$997)/ISNUMBER('Měsíční rekapitulace'!$L$1:$L$997),'Měsíční rekapitulace'!$L$1:$L$997)=F$4)*('Měsíční rekapitulace'!$A$3:$A$999=$A57)*TEXT('Měsíční rekapitulace'!$Q$3:$Q$999,\"0,0;0;0;\\0\")))","v":0},{"$f":"IF($A57=\"\",,SUMPRODUCT((LOOKUP(ROW(G$1:G$997),ROW(G$1:G$997)/ISNUMBER('Měsíční rekapitulace'!$L$1:$L$997),'Měsíční rekapitulace'!$L$1:$L$997)=G$4)*('Měsíční rekapitulace'!$A$3:$A$999=$A57)*TEXT('Měsíční rekapitulace'!$Q$3:$Q$999,\"0,0;0;0;\\0\")))","v":0},{"$f":"IF($A57=\"\",,SUMPRODUCT((LOOKUP(ROW(H$1:H$997),ROW(H$1:H$997)/ISNUMBER('Měsíční rekapitulace'!$L$1:$L$997),'Měsíční rekapitulace'!$L$1:$L$997)=H$4)*('Měsíční rekapitulace'!$A$3:$A$999=$A57)*TEXT('Měsíční rekapitulace'!$Q$3:$Q$999,\"0,0;0;0;\\0\")))","v":0},{"$f":"IF($A57=\"\",,SUMPRODUCT((LOOKUP(ROW(I$1:I$997),ROW(I$1:I$997)/ISNUMBER('Měsíční rekapitulace'!$L$1:$L$997),'Měsíční rekapitulace'!$L$1:$L$997)=I$4)*('Měsíční rekapitulace'!$A$3:$A$999=$A57)*TEXT('Měsíční rekapitulace'!$Q$3:$Q$999,\"0,0;0;0;\\0\")))","v":0},{"$f":"IF($A57=\"\",,SUMPRODUCT((LOOKUP(ROW(J$1:J$997),ROW(J$1:J$997)/ISNUMBER('Měsíční rekapitulace'!$L$1:$L$997),'Měsíční rekapitulace'!$L$1:$L$997)=J$4)*('Měsíční rekapitulace'!$A$3:$A$999=$A57)*TEXT('Měsíční rekapitulace'!$Q$3:$Q$999,\"0,0;0;0;\\0\")))","v":0},{"$f":"IF($A57=\"\",,SUMPRODUCT((LOOKUP(ROW(K$1:K$997),ROW(K$1:K$997)/ISNUMBER('Měsíční rekapitulace'!$L$1:$L$997),'Měsíční rekapitulace'!$L$1:$L$997)=K$4)*('Měsíční rekapitulace'!$A$3:$A$999=$A57)*TEXT('Měsíční rekapitulace'!$Q$3:$Q$999,\"0,0;0;0;\\0\")))","v":0},{"$f":"IF($A57=\"\",,SUMPRODUCT((LOOKUP(ROW(L$1:L$997),ROW(L$1:L$997)/ISNUMBER('Měsíční rekapitulace'!$L$1:$L$997),'Měsíční rekapitulace'!$L$1:$L$997)=L$4)*('Měsíční rekapitulace'!$A$3:$A$999=$A57)*TEXT('Měsíční rekapitulace'!$Q$3:$Q$999,\"0,0;0;0;\\0\")))","v":0},{"$f":"IF($A57=\"\",,SUMPRODUCT((LOOKUP(ROW(M$1:M$997),ROW(M$1:M$997)/ISNUMBER('Měsíční rekapitulace'!$L$1:$L$997),'Měsíční rekapitulace'!$L$1:$L$997)=M$4)*('Měsíční rekapitulace'!$A$3:$A$999=$A57)*TEXT('Měsíční rekapitulace'!$Q$3:$Q$999,\"0,0;0;0;\\0\")))","v":0},{"$f":"IF($A57=\"\",,SUMPRODUCT((LOOKUP(ROW(N$1:N$997),ROW(N$1:N$997)/ISNUMBER('Měsíční rekapitulace'!$L$1:$L$997),'Měsíční rekapitulace'!$L$1:$L$997)=N$4)*('Měsíční rekapitulace'!$A$3:$A$999=$A57)*TEXT('Měsíční rekapitulace'!$Q$3:$Q$999,\"0,0;0;0;\\0\")))","v":0},{"$f":"IF($A57=\"\",,SUMPRODUCT((LOOKUP(ROW(O$1:O$997),ROW(O$1:O$997)/ISNUMBER('Měsíční rekapitulace'!$L$1:$L$997),'Měsíční rekapitulace'!$L$1:$L$997)=O$4)*('Měsíční rekapitulace'!$A$3:$A$999=$A57)*TEXT('Měsíční rekapitulace'!$Q$3:$Q$999,\"0,0;0;0;\\0\")))","v":0},0]
[{"$f":"IFERROR(INDEX('Měsíční rekapitulace'!A$3:A$999,SMALL(IF(('Měsíční rekapitulace'!A$3:A$999<>\"\")*('Měsíční rekapitulace'!A$3:A$999<>'Měsíční rekapitulace'!$A$2)*(COUNTIF(A$5:A57,'Měsíční rekapitulace'!A$3:A$999)=0),ROW('Měsíční rekapitulace'!A$3:A$999)-2),1)),\"\")","v":""},{"$f":"IFERROR(INDEX('Měsíční rekapitulace'!E$3:E$999,MATCH(A58,'Měsíční rekapitulace'!A$3:A$999,)),\"\")","v":""},null,{"$f":"IF($A58=\"\",,SUMPRODUCT((LOOKUP(ROW(D$1:D$997),ROW(D$1:D$997)/ISNUMBER('Měsíční rekapitulace'!$L$1:$L$997),'Měsíční rekapitulace'!$L$1:$L$997)=D$4)*('Měsíční rekapitulace'!$A$3:$A$999=$A58)*TEXT('Měsíční rekapitulace'!$Q$3:$Q$999,\"0,0;0;0;\\0\")))","v":0},{"$f":"IF($A58=\"\",,SUMPRODUCT((LOOKUP(ROW(E$1:E$997),ROW(E$1:E$997)/ISNUMBER('Měsíční rekapitulace'!$L$1:$L$997),'Měsíční rekapitulace'!$L$1:$L$997)=E$4)*('Měsíční rekapitulace'!$A$3:$A$999=$A58)*TEXT('Měsíční rekapitulace'!$Q$3:$Q$999,\"0,0;0;0;\\0\")))","v":0},{"$f":"IF($A58=\"\",,SUMPRODUCT((LOOKUP(ROW(F$1:F$997),ROW(F$1:F$997)/ISNUMBER('Měsíční rekapitulace'!$L$1:$L$997),'Měsíční rekapitulace'!$L$1:$L$997)=F$4)*('Měsíční rekapitulace'!$A$3:$A$999=$A58)*TEXT('Měsíční rekapitulace'!$Q$3:$Q$999,\"0,0;0;0;\\0\")))","v":0},{"$f":"IF($A58=\"\",,SUMPRODUCT((LOOKUP(ROW(G$1:G$997),ROW(G$1:G$997)/ISNUMBER('Měsíční rekapitulace'!$L$1:$L$997),'Měsíční rekapitulace'!$L$1:$L$997)=G$4)*('Měsíční rekapitulace'!$A$3:$A$999=$A58)*TEXT('Měsíční rekapitulace'!$Q$3:$Q$999,\"0,0;0;0;\\0\")))","v":0},{"$f":"IF($A58=\"\",,SUMPRODUCT((LOOKUP(ROW(H$1:H$997),ROW(H$1:H$997)/ISNUMBER('Měsíční rekapitulace'!$L$1:$L$997),'Měsíční rekapitulace'!$L$1:$L$997)=H$4)*('Měsíční rekapitulace'!$A$3:$A$999=$A58)*TEXT('Měsíční rekapitulace'!$Q$3:$Q$999,\"0,0;0;0;\\0\")))","v":0},{"$f":"IF($A58=\"\",,SUMPRODUCT((LOOKUP(ROW(I$1:I$997),ROW(I$1:I$997)/ISNUMBER('Měsíční rekapitulace'!$L$1:$L$997),'Měsíční rekapitulace'!$L$1:$L$997)=I$4)*('Měsíční rekapitulace'!$A$3:$A$999=$A58)*TEXT('Měsíční rekapitulace'!$Q$3:$Q$999,\"0,0;0;0;\\0\")))","v":0},{"$f":"IF($A58=\"\",,SUMPRODUCT((LOOKUP(ROW(J$1:J$997),ROW(J$1:J$997)/ISNUMBER('Měsíční rekapitulace'!$L$1:$L$997),'Měsíční rekapitulace'!$L$1:$L$997)=J$4)*('Měsíční rekapitulace'!$A$3:$A$999=$A58)*TEXT('Měsíční rekapitulace'!$Q$3:$Q$999,\"0,0;0;0;\\0\")))","v":0},{"$f":"IF($A58=\"\",,SUMPRODUCT((LOOKUP(ROW(K$1:K$997),ROW(K$1:K$997)/ISNUMBER('Měsíční rekapitulace'!$L$1:$L$997),'Měsíční rekapitulace'!$L$1:$L$997)=K$4)*('Měsíční rekapitulace'!$A$3:$A$999=$A58)*TEXT('Měsíční rekapitulace'!$Q$3:$Q$999,\"0,0;0;0;\\0\")))","v":0},{"$f":"IF($A58=\"\",,SUMPRODUCT((LOOKUP(ROW(L$1:L$997),ROW(L$1:L$997)/ISNUMBER('Měsíční rekapitulace'!$L$1:$L$997),'Měsíční rekapitulace'!$L$1:$L$997)=L$4)*('Měsíční rekapitulace'!$A$3:$A$999=$A58)*TEXT('Měsíční rekapitulace'!$Q$3:$Q$999,\"0,0;0;0;\\0\")))","v":0},{"$f":"IF($A58=\"\",,SUMPRODUCT((LOOKUP(ROW(M$1:M$997),ROW(M$1:M$997)/ISNUMBER('Měsíční rekapitulace'!$L$1:$L$997),'Měsíční rekapitulace'!$L$1:$L$997)=M$4)*('Měsíční rekapitulace'!$A$3:$A$999=$A58)*TEXT('Měsíční rekapitulace'!$Q$3:$Q$999,\"0,0;0;0;\\0\")))","v":0},{"$f":"IF($A58=\"\",,SUMPRODUCT((LOOKUP(ROW(N$1:N$997),ROW(N$1:N$997)/ISNUMBER('Měsíční rekapitulace'!$L$1:$L$997),'Měsíční rekapitulace'!$L$1:$L$997)=N$4)*('Měsíční rekapitulace'!$A$3:$A$999=$A58)*TEXT('Měsíční rekapitulace'!$Q$3:$Q$999,\"0,0;0;0;\\0\")))","v":0},{"$f":"IF($A58=\"\",,SUMPRODUCT((LOOKUP(ROW(O$1:O$997),ROW(O$1:O$997)/ISNUMBER('Měsíční rekapitulace'!$L$1:$L$997),'Měsíční rekapitulace'!$L$1:$L$997)=O$4)*('Měsíční rekapitulace'!$A$3:$A$999=$A58)*TEXT('Měsíční rekapitulace'!$Q$3:$Q$999,\"0,0;0;0;\\0\")))","v":0},0]
[{"$f":"IFERROR(INDEX('Měsíční rekapitulace'!A$3:A$999,SMALL(IF(('Měsíční rekapitulace'!A$3:A$999<>\"\")*('Měsíční rekapitulace'!A$3:A$999<>'Měsíční rekapitulace'!$A$2)*(COUNTIF(A$5:A58,'Měsíční rekapitulace'!A$3:A$999)=0),ROW('Měsíční rekapitulace'!A$3:A$999)-2),1)),\"\")","v":""},{"$f":"IFERROR(INDEX('Měsíční rekapitulace'!E$3:E$999,MATCH(A59,'Měsíční rekapitulace'!A$3:A$999,)),\"\")","v":""},null,{"$f":"IF($A59=\"\",,SUMPRODUCT((LOOKUP(ROW(D$1:D$997),ROW(D$1:D$997)/ISNUMBER('Měsíční rekapitulace'!$L$1:$L$997),'Měsíční rekapitulace'!$L$1:$L$997)=D$4)*('Měsíční rekapitulace'!$A$3:$A$999=$A59)*TEXT('Měsíční rekapitulace'!$Q$3:$Q$999,\"0,0;0;0;\\0\")))","v":0},{"$f":"IF($A59=\"\",,SUMPRODUCT((LOOKUP(ROW(E$1:E$997),ROW(E$1:E$997)/ISNUMBER('Měsíční rekapitulace'!$L$1:$L$997),'Měsíční rekapitulace'!$L$1:$L$997)=E$4)*('Měsíční rekapitulace'!$A$3:$A$999=$A59)*TEXT('Měsíční rekapitulace'!$Q$3:$Q$999,\"0,0;0;0;\\0\")))","v":0},{"$f":"IF($A59=\"\",,SUMPRODUCT((LOOKUP(ROW(F$1:F$997),ROW(F$1:F$997)/ISNUMBER('Měsíční rekapitulace'!$L$1:$L$997),'Měsíční rekapitulace'!$L$1:$L$997)=F$4)*('Měsíční rekapitulace'!$A$3:$A$999=$A59)*TEXT('Měsíční rekapitulace'!$Q$3:$Q$999,\"0,0;0;0;\\0\")))","v":0},{"$f":"IF($A59=\"\",,SUMPRODUCT((LOOKUP(ROW(G$1:G$997),ROW(G$1:G$997)/ISNUMBER('Měsíční rekapitulace'!$L$1:$L$997),'Měsíční rekapitulace'!$L$1:$L$997)=G$4)*('Měsíční rekapitulace'!$A$3:$A$999=$A59)*TEXT('Měsíční rekapitulace'!$Q$3:$Q$999,\"0,0;0;0;\\0\")))","v":0},{"$f":"IF($A59=\"\",,SUMPRODUCT((LOOKUP(ROW(H$1:H$997),ROW(H$1:H$997)/ISNUMBER('Měsíční rekapitulace'!$L$1:$L$997),'Měsíční rekapitulace'!$L$1:$L$997)=H$4)*('Měsíční rekapitulace'!$A$3:$A$999=$A59)*TEXT('Měsíční rekapitulace'!$Q$3:$Q$999,\"0,0;0;0;\\0\")))","v":0},{"$f":"IF($A59=\"\",,SUMPRODUCT((LOOKUP(ROW(I$1:I$997),ROW(I$1:I$997)/ISNUMBER('Měsíční rekapitulace'!$L$1:$L$997),'Měsíční rekapitulace'!$L$1:$L$997)=I$4)*('Měsíční rekapitulace'!$A$3:$A$999=$A59)*TEXT('Měsíční rekapitulace'!$Q$3:$Q$999,\"0,0;0;0;\\0\")))","v":0},{"$f":"IF($A59=\"\",,SUMPRODUCT((LOOKUP(ROW(J$1:J$997),ROW(J$1:J$997)/ISNUMBER('Měsíční rekapitulace'!$L$1:$L$997),'Měsíční rekapitulace'!$L$1:$L$997)=J$4)*('Měsíční rekapitulace'!$A$3:$A$999=$A59)*TEXT('Měsíční rekapitulace'!$Q$3:$Q$999,\"0,0;0;0;\\0\")))","v":0},{"$f":"IF($A59=\"\",,SUMPRODUCT((LOOKUP(ROW(K$1:K$997),ROW(K$1:K$997)/ISNUMBER('Měsíční rekapitulace'!$L$1:$L$997),'Měsíční rekapitulace'!$L$1:$L$997)=K$4)*('Měsíční rekapitulace'!$A$3:$A$999=$A59)*TEXT('Měsíční rekapitulace'!$Q$3:$Q$999,\"0,0;0;0;\\0\")))","v":0},{"$f":"IF($A59=\"\",,SUMPRODUCT((LOOKUP(ROW(L$1:L$997),ROW(L$1:L$997)/ISNUMBER('Měsíční rekapitulace'!$L$1:$L$997),'Měsíční rekapitulace'!$L$1:$L$997)=L$4)*('Měsíční rekapitulace'!$A$3:$A$999=$A59)*TEXT('Měsíční rekapitulace'!$Q$3:$Q$999,\"0,0;0;0;\\0\")))","v":0},{"$f":"IF($A59=\"\",,SUMPRODUCT((LOOKUP(ROW(M$1:M$997),ROW(M$1:M$997)/ISNUMBER('Měsíční rekapitulace'!$L$1:$L$997),'Měsíční rekapitulace'!$L$1:$L$997)=M$4)*('Měsíční rekapitulace'!$A$3:$A$999=$A59)*TEXT('Měsíční rekapitulace'!$Q$3:$Q$999,\"0,0;0;0;\\0\")))","v":0},{"$f":"IF($A59=\"\",,SUMPRODUCT((LOOKUP(ROW(N$1:N$997),ROW(N$1:N$997)/ISNUMBER('Měsíční rekapitulace'!$L$1:$L$997),'Měsíční rekapitulace'!$L$1:$L$997)=N$4)*('Měsíční rekapitulace'!$A$3:$A$999=$A59)*TEXT('Měsíční rekapitulace'!$Q$3:$Q$999,\"0,0;0;0;\\0\")))","v":0},{"$f":"IF($A59=\"\",,SUMPRODUCT((LOOKUP(ROW(O$1:O$997),ROW(O$1:O$997)/ISNUMBER('Měsíční rekapitulace'!$L$1:$L$997),'Měsíční rekapitulace'!$L$1:$L$997)=O$4)*('Měsíční rekapitulace'!$A$3:$A$999=$A59)*TEXT('Měsíční rekapitulace'!$Q$3:$Q$999,\"0,0;0;0;\\0\")))","v":0},0]
[{"$f":"IFERROR(INDEX('Měsíční rekapitulace'!A$3:A$999,SMALL(IF(('Měsíční rekapitulace'!A$3:A$999<>\"\")*('Měsíční rekapitulace'!A$3:A$999<>'Měsíční rekapitulace'!$A$2)*(COUNTIF(A$5:A59,'Měsíční rekapitulace'!A$3:A$999)=0),ROW('Měsíční rekapitulace'!A$3:A$999)-2),1)),\"\")","v":""},{"$f":"IFERROR(INDEX('Měsíční rekapitulace'!E$3:E$999,MATCH(A60,'Měsíční rekapitulace'!A$3:A$999,)),\"\")","v":""},null,{"$f":"IF($A60=\"\",,SUMPRODUCT((LOOKUP(ROW(D$1:D$997),ROW(D$1:D$997)/ISNUMBER('Měsíční rekapitulace'!$L$1:$L$997),'Měsíční rekapitulace'!$L$1:$L$997)=D$4)*('Měsíční rekapitulace'!$A$3:$A$999=$A60)*TEXT('Měsíční rekapitulace'!$Q$3:$Q$999,\"0,0;0;0;\\0\")))","v":0},{"$f":"IF($A60=\"\",,SUMPRODUCT((LOOKUP(ROW(E$1:E$997),ROW(E$1:E$997)/ISNUMBER('Měsíční rekapitulace'!$L$1:$L$997),'Měsíční rekapitulace'!$L$1:$L$997)=E$4)*('Měsíční rekapitulace'!$A$3:$A$999=$A60)*TEXT('Měsíční rekapitulace'!$Q$3:$Q$999,\"0,0;0;0;\\0\")))","v":0},{"$f":"IF($A60=\"\",,SUMPRODUCT((LOOKUP(ROW(F$1:F$997),ROW(F$1:F$997)/ISNUMBER('Měsíční rekapitulace'!$L$1:$L$997),'Měsíční rekapitulace'!$L$1:$L$997)=F$4)*('Měsíční rekapitulace'!$A$3:$A$999=$A60)*TEXT('Měsíční rekapitulace'!$Q$3:$Q$999,\"0,0;0;0;\\0\")))","v":0},{"$f":"IF($A60=\"\",,SUMPRODUCT((LOOKUP(ROW(G$1:G$997),ROW(G$1:G$997)/ISNUMBER('Měsíční rekapitulace'!$L$1:$L$997),'Měsíční rekapitulace'!$L$1:$L$997)=G$4)*('Měsíční rekapitulace'!$A$3:$A$999=$A60)*TEXT('Měsíční rekapitulace'!$Q$3:$Q$999,\"0,0;0;0;\\0\")))","v":0},{"$f":"IF($A60=\"\",,SUMPRODUCT((LOOKUP(ROW(H$1:H$997),ROW(H$1:H$997)/ISNUMBER('Měsíční rekapitulace'!$L$1:$L$997),'Měsíční rekapitulace'!$L$1:$L$997)=H$4)*('Měsíční rekapitulace'!$A$3:$A$999=$A60)*TEXT('Měsíční rekapitulace'!$Q$3:$Q$999,\"0,0;0;0;\\0\")))","v":0},{"$f":"IF($A60=\"\",,SUMPRODUCT((LOOKUP(ROW(I$1:I$997),ROW(I$1:I$997)/ISNUMBER('Měsíční rekapitulace'!$L$1:$L$997),'Měsíční rekapitulace'!$L$1:$L$997)=I$4)*('Měsíční rekapitulace'!$A$3:$A$999=$A60)*TEXT('Měsíční rekapitulace'!$Q$3:$Q$999,\"0,0;0;0;\\0\")))","v":0},{"$f":"IF($A60=\"\",,SUMPRODUCT((LOOKUP(ROW(J$1:J$997),ROW(J$1:J$997)/ISNUMBER('Měsíční rekapitulace'!$L$1:$L$997),'Měsíční rekapitulace'!$L$1:$L$997)=J$4)*('Měsíční rekapitulace'!$A$3:$A$999=$A60)*TEXT('Měsíční rekapitulace'!$Q$3:$Q$999,\"0,0;0;0;\\0\")))","v":0},{"$f":"IF($A60=\"\",,SUMPRODUCT((LOOKUP(ROW(K$1:K$997),ROW(K$1:K$997)/ISNUMBER('Měsíční rekapitulace'!$L$1:$L$997),'Měsíční rekapitulace'!$L$1:$L$997)=K$4)*('Měsíční rekapitulace'!$A$3:$A$999=$A60)*TEXT('Měsíční rekapitulace'!$Q$3:$Q$999,\"0,0;0;0;\\0\")))","v":0},{"$f":"IF($A60=\"\",,SUMPRODUCT((LOOKUP(ROW(L$1:L$997),ROW(L$1:L$997)/ISNUMBER('Měsíční rekapitulace'!$L$1:$L$997),'Měsíční rekapitulace'!$L$1:$L$997)=L$4)*('Měsíční rekapitulace'!$A$3:$A$999=$A60)*TEXT('Měsíční rekapitulace'!$Q$3:$Q$999,\"0,0;0;0;\\0\")))","v":0},{"$f":"IF($A60=\"\",,SUMPRODUCT((LOOKUP(ROW(M$1:M$997),ROW(M$1:M$997)/ISNUMBER('Měsíční rekapitulace'!$L$1:$L$997),'Měsíční rekapitulace'!$L$1:$L$997)=M$4)*('Měsíční rekapitulace'!$A$3:$A$999=$A60)*TEXT('Měsíční rekapitulace'!$Q$3:$Q$999,\"0,0;0;0;\\0\")))","v":0},{"$f":"IF($A60=\"\",,SUMPRODUCT((LOOKUP(ROW(N$1:N$997),ROW(N$1:N$997)/ISNUMBER('Měsíční rekapitulace'!$L$1:$L$997),'Měsíční rekapitulace'!$L$1:$L$997)=N$4)*('Měsíční rekapitulace'!$A$3:$A$999=$A60)*TEXT('Měsíční rekapitulace'!$Q$3:$Q$999,\"0,0;0;0;\\0\")))","v":0},{"$f":"IF($A60=\"\",,SUMPRODUCT((LOOKUP(ROW(O$1:O$997),ROW(O$1:O$997)/ISNUMBER('Měsíční rekapitulace'!$L$1:$L$997),'Měsíční rekapitulace'!$L$1:$L$997)=O$4)*('Měsíční rekapitulace'!$A$3:$A$999=$A60)*TEXT('Měsíční rekapitulace'!$Q$3:$Q$999,\"0,0;0;0;\\0\")))","v":0},0]
[{"$f":"IFERROR(INDEX('Měsíční rekapitulace'!A$3:A$999,SMALL(IF(('Měsíční rekapitulace'!A$3:A$999<>\"\")*('Měsíční rekapitulace'!A$3:A$999<>'Měsíční rekapitulace'!$A$2)*(COUNTIF(A$5:A60,'Měsíční rekapitulace'!A$3:A$999)=0),ROW('Měsíční rekapitulace'!A$3:A$999)-2),1)),\"\")","v":""},{"$f":"IFERROR(INDEX('Měsíční rekapitulace'!E$3:E$999,MATCH(A61,'Měsíční rekapitulace'!A$3:A$999,)),\"\")","v":""},null,{"$f":"IF($A61=\"\",,SUMPRODUCT((LOOKUP(ROW(D$1:D$997),ROW(D$1:D$997)/ISNUMBER('Měsíční rekapitulace'!$L$1:$L$997),'Měsíční rekapitulace'!$L$1:$L$997)=D$4)*('Měsíční rekapitulace'!$A$3:$A$999=$A61)*TEXT('Měsíční rekapitulace'!$Q$3:$Q$999,\"0,0;0;0;\\0\")))","v":0},{"$f":"IF($A61=\"\",,SUMPRODUCT((LOOKUP(ROW(E$1:E$997),ROW(E$1:E$997)/ISNUMBER('Měsíční rekapitulace'!$L$1:$L$997),'Měsíční rekapitulace'!$L$1:$L$997)=E$4)*('Měsíční rekapitulace'!$A$3:$A$999=$A61)*TEXT('Měsíční rekapitulace'!$Q$3:$Q$999,\"0,0;0;0;\\0\")))","v":0},{"$f":"IF($A61=\"\",,SUMPRODUCT((LOOKUP(ROW(F$1:F$997),ROW(F$1:F$997)/ISNUMBER('Měsíční rekapitulace'!$L$1:$L$997),'Měsíční rekapitulace'!$L$1:$L$997)=F$4)*('Měsíční rekapitulace'!$A$3:$A$999=$A61)*TEXT('Měsíční rekapitulace'!$Q$3:$Q$999,\"0,0;0;0;\\0\")))","v":0},{"$f":"IF($A61=\"\",,SUMPRODUCT((LOOKUP(ROW(G$1:G$997),ROW(G$1:G$997)/ISNUMBER('Měsíční rekapitulace'!$L$1:$L$997),'Měsíční rekapitulace'!$L$1:$L$997)=G$4)*('Měsíční rekapitulace'!$A$3:$A$999=$A61)*TEXT('Měsíční rekapitulace'!$Q$3:$Q$999,\"0,0;0;0;\\0\")))","v":0},{"$f":"IF($A61=\"\",,SUMPRODUCT((LOOKUP(ROW(H$1:H$997),ROW(H$1:H$997)/ISNUMBER('Měsíční rekapitulace'!$L$1:$L$997),'Měsíční rekapitulace'!$L$1:$L$997)=H$4)*('Měsíční rekapitulace'!$A$3:$A$999=$A61)*TEXT('Měsíční rekapitulace'!$Q$3:$Q$999,\"0,0;0;0;\\0\")))","v":0},{"$f":"IF($A61=\"\",,SUMPRODUCT((LOOKUP(ROW(I$1:I$997),ROW(I$1:I$997)/ISNUMBER('Měsíční rekapitulace'!$L$1:$L$997),'Měsíční rekapitulace'!$L$1:$L$997)=I$4)*('Měsíční rekapitulace'!$A$3:$A$999=$A61)*TEXT('Měsíční rekapitulace'!$Q$3:$Q$999,\"0,0;0;0;\\0\")))","v":0},{"$f":"IF($A61=\"\",,SUMPRODUCT((LOOKUP(ROW(J$1:J$997),ROW(J$1:J$997)/ISNUMBER('Měsíční rekapitulace'!$L$1:$L$997),'Měsíční rekapitulace'!$L$1:$L$997)=J$4)*('Měsíční rekapitulace'!$A$3:$A$999=$A61)*TEXT('Měsíční rekapitulace'!$Q$3:$Q$999,\"0,0;0;0;\\0\")))","v":0},{"$f":"IF($A61=\"\",,SUMPRODUCT((LOOKUP(ROW(K$1:K$997),ROW(K$1:K$997)/ISNUMBER('Měsíční rekapitulace'!$L$1:$L$997),'Měsíční rekapitulace'!$L$1:$L$997)=K$4)*('Měsíční rekapitulace'!$A$3:$A$999=$A61)*TEXT('Měsíční rekapitulace'!$Q$3:$Q$999,\"0,0;0;0;\\0\")))","v":0},{"$f":"IF($A61=\"\",,SUMPRODUCT((LOOKUP(ROW(L$1:L$997),ROW(L$1:L$997)/ISNUMBER('Měsíční rekapitulace'!$L$1:$L$997),'Měsíční rekapitulace'!$L$1:$L$997)=L$4)*('Měsíční rekapitulace'!$A$3:$A$999=$A61)*TEXT('Měsíční rekapitulace'!$Q$3:$Q$999,\"0,0;0;0;\\0\")))","v":0},{"$f":"IF($A61=\"\",,SUMPRODUCT((LOOKUP(ROW(M$1:M$997),ROW(M$1:M$997)/ISNUMBER('Měsíční rekapitulace'!$L$1:$L$997),'Měsíční rekapitulace'!$L$1:$L$997)=M$4)*('Měsíční rekapitulace'!$A$3:$A$999=$A61)*TEXT('Měsíční rekapitulace'!$Q$3:$Q$999,\"0,0;0;0;\\0\")))","v":0},{"$f":"IF($A61=\"\",,SUMPRODUCT((LOOKUP(ROW(N$1:N$997),ROW(N$1:N$997)/ISNUMBER('Měsíční rekapitulace'!$L$1:$L$997),'Měsíční rekapitulace'!$L$1:$L$997)=N$4)*('Měsíční rekapitulace'!$A$3:$A$999=$A61)*TEXT('Měsíční rekapitulace'!$Q$3:$Q$999,\"0,0;0;0;\\0\")))","v":0},{"$f":"IF($A61=\"\",,SUMPRODUCT((LOOKUP(ROW(O$1:O$997),ROW(O$1:O$997)/ISNUMBER('Měsíční rekapitulace'!$L$1:$L$997),'Měsíční rekapitulace'!$L$1:$L$997)=O$4)*('Měsíční rekapitulace'!$A$3:$A$999=$A61)*TEXT('Měsíční rekapitulace'!$Q$3:$Q$999,\"0,0;0;0;\\0\")))","v":0},0]
[{"$f":"IFERROR(INDEX('Měsíční rekapitulace'!A$3:A$999,SMALL(IF(('Měsíční rekapitulace'!A$3:A$999<>\"\")*('Měsíční rekapitulace'!A$3:A$999<>'Měsíční rekapitulace'!$A$2)*(COUNTIF(A$5:A61,'Měsíční rekapitulace'!A$3:A$999)=0),ROW('Měsíční rekapitulace'!A$3:A$999)-2),1)),\"\")","v":""},{"$f":"IFERROR(INDEX('Měsíční rekapitulace'!E$3:E$999,MATCH(A62,'Měsíční rekapitulace'!A$3:A$999,)),\"\")","v":""},null,{"$f":"IF($A62=\"\",,SUMPRODUCT((LOOKUP(ROW(D$1:D$997),ROW(D$1:D$997)/ISNUMBER('Měsíční rekapitulace'!$L$1:$L$997),'Měsíční rekapitulace'!$L$1:$L$997)=D$4)*('Měsíční rekapitulace'!$A$3:$A$999=$A62)*TEXT('Měsíční rekapitulace'!$Q$3:$Q$999,\"0,0;0;0;\\0\")))","v":0},{"$f":"IF($A62=\"\",,SUMPRODUCT((LOOKUP(ROW(E$1:E$997),ROW(E$1:E$997)/ISNUMBER('Měsíční rekapitulace'!$L$1:$L$997),'Měsíční rekapitulace'!$L$1:$L$997)=E$4)*('Měsíční rekapitulace'!$A$3:$A$999=$A62)*TEXT('Měsíční rekapitulace'!$Q$3:$Q$999,\"0,0;0;0;\\0\")))","v":0},{"$f":"IF($A62=\"\",,SUMPRODUCT((LOOKUP(ROW(F$1:F$997),ROW(F$1:F$997)/ISNUMBER('Měsíční rekapitulace'!$L$1:$L$997),'Měsíční rekapitulace'!$L$1:$L$997)=F$4)*('Měsíční rekapitulace'!$A$3:$A$999=$A62)*TEXT('Měsíční rekapitulace'!$Q$3:$Q$999,\"0,0;0;0;\\0\")))","v":0},{"$f":"IF($A62=\"\",,SUMPRODUCT((LOOKUP(ROW(G$1:G$997),ROW(G$1:G$997)/ISNUMBER('Měsíční rekapitulace'!$L$1:$L$997),'Měsíční rekapitulace'!$L$1:$L$997)=G$4)*('Měsíční rekapitulace'!$A$3:$A$999=$A62)*TEXT('Měsíční rekapitulace'!$Q$3:$Q$999,\"0,0;0;0;\\0\")))","v":0},{"$f":"IF($A62=\"\",,SUMPRODUCT((LOOKUP(ROW(H$1:H$997),ROW(H$1:H$997)/ISNUMBER('Měsíční rekapitulace'!$L$1:$L$997),'Měsíční rekapitulace'!$L$1:$L$997)=H$4)*('Měsíční rekapitulace'!$A$3:$A$999=$A62)*TEXT('Měsíční rekapitulace'!$Q$3:$Q$999,\"0,0;0;0;\\0\")))","v":0},{"$f":"IF($A62=\"\",,SUMPRODUCT((LOOKUP(ROW(I$1:I$997),ROW(I$1:I$997)/ISNUMBER('Měsíční rekapitulace'!$L$1:$L$997),'Měsíční rekapitulace'!$L$1:$L$997)=I$4)*('Měsíční rekapitulace'!$A$3:$A$999=$A62)*TEXT('Měsíční rekapitulace'!$Q$3:$Q$999,\"0,0;0;0;\\0\")))","v":0},{"$f":"IF($A62=\"\",,SUMPRODUCT((LOOKUP(ROW(J$1:J$997),ROW(J$1:J$997)/ISNUMBER('Měsíční rekapitulace'!$L$1:$L$997),'Měsíční rekapitulace'!$L$1:$L$997)=J$4)*('Měsíční rekapitulace'!$A$3:$A$999=$A62)*TEXT('Měsíční rekapitulace'!$Q$3:$Q$999,\"0,0;0;0;\\0\")))","v":0},{"$f":"IF($A62=\"\",,SUMPRODUCT((LOOKUP(ROW(K$1:K$997),ROW(K$1:K$997)/ISNUMBER('Měsíční rekapitulace'!$L$1:$L$997),'Měsíční rekapitulace'!$L$1:$L$997)=K$4)*('Měsíční rekapitulace'!$A$3:$A$999=$A62)*TEXT('Měsíční rekapitulace'!$Q$3:$Q$999,\"0,0;0;0;\\0\")))","v":0},{"$f":"IF($A62=\"\",,SUMPRODUCT((LOOKUP(ROW(L$1:L$997),ROW(L$1:L$997)/ISNUMBER('Měsíční rekapitulace'!$L$1:$L$997),'Měsíční rekapitulace'!$L$1:$L$997)=L$4)*('Měsíční rekapitulace'!$A$3:$A$999=$A62)*TEXT('Měsíční rekapitulace'!$Q$3:$Q$999,\"0,0;0;0;\\0\")))","v":0},{"$f":"IF($A62=\"\",,SUMPRODUCT((LOOKUP(ROW(M$1:M$997),ROW(M$1:M$997)/ISNUMBER('Měsíční rekapitulace'!$L$1:$L$997),'Měsíční rekapitulace'!$L$1:$L$997)=M$4)*('Měsíční rekapitulace'!$A$3:$A$999=$A62)*TEXT('Měsíční rekapitulace'!$Q$3:$Q$999,\"0,0;0;0;\\0\")))","v":0},{"$f":"IF($A62=\"\",,SUMPRODUCT((LOOKUP(ROW(N$1:N$997),ROW(N$1:N$997)/ISNUMBER('Měsíční rekapitulace'!$L$1:$L$997),'Měsíční rekapitulace'!$L$1:$L$997)=N$4)*('Měsíční rekapitulace'!$A$3:$A$999=$A62)*TEXT('Měsíční rekapitulace'!$Q$3:$Q$999,\"0,0;0;0;\\0\")))","v":0},{"$f":"IF($A62=\"\",,SUMPRODUCT((LOOKUP(ROW(O$1:O$997),ROW(O$1:O$997)/ISNUMBER('Měsíční rekapitulace'!$L$1:$L$997),'Měsíční rekapitulace'!$L$1:$L$997)=O$4)*('Měsíční rekapitulace'!$A$3:$A$999=$A62)*TEXT('Měsíční rekapitulace'!$Q$3:$Q$999,\"0,0;0;0;\\0\")))","v":0},0]
[{"$f":"IFERROR(INDEX('Měsíční rekapitulace'!A$3:A$999,SMALL(IF(('Měsíční rekapitulace'!A$3:A$999<>\"\")*('Měsíční rekapitulace'!A$3:A$999<>'Měsíční rekapitulace'!$A$2)*(COUNTIF(A$5:A62,'Měsíční rekapitulace'!A$3:A$999)=0),ROW('Měsíční rekapitulace'!A$3:A$999)-2),1)),\"\")","v":""},{"$f":"IFERROR(INDEX('Měsíční rekapitulace'!E$3:E$999,MATCH(A63,'Měsíční rekapitulace'!A$3:A$999,)),\"\")","v":""},null,{"$f":"IF($A63=\"\",,SUMPRODUCT((LOOKUP(ROW(D$1:D$997),ROW(D$1:D$997)/ISNUMBER('Měsíční rekapitulace'!$L$1:$L$997),'Měsíční rekapitulace'!$L$1:$L$997)=D$4)*('Měsíční rekapitulace'!$A$3:$A$999=$A63)*TEXT('Měsíční rekapitulace'!$Q$3:$Q$999,\"0,0;0;0;\\0\")))","v":0},{"$f":"IF($A63=\"\",,SUMPRODUCT((LOOKUP(ROW(E$1:E$997),ROW(E$1:E$997)/ISNUMBER('Měsíční rekapitulace'!$L$1:$L$997),'Měsíční rekapitulace'!$L$1:$L$997)=E$4)*('Měsíční rekapitulace'!$A$3:$A$999=$A63)*TEXT('Měsíční rekapitulace'!$Q$3:$Q$999,\"0,0;0;0;\\0\")))","v":0},{"$f":"IF($A63=\"\",,SUMPRODUCT((LOOKUP(ROW(F$1:F$997),ROW(F$1:F$997)/ISNUMBER('Měsíční rekapitulace'!$L$1:$L$997),'Měsíční rekapitulace'!$L$1:$L$997)=F$4)*('Měsíční rekapitulace'!$A$3:$A$999=$A63)*TEXT('Měsíční rekapitulace'!$Q$3:$Q$999,\"0,0;0;0;\\0\")))","v":0},{"$f":"IF($A63=\"\",,SUMPRODUCT((LOOKUP(ROW(G$1:G$997),ROW(G$1:G$997)/ISNUMBER('Měsíční rekapitulace'!$L$1:$L$997),'Měsíční rekapitulace'!$L$1:$L$997)=G$4)*('Měsíční rekapitulace'!$A$3:$A$999=$A63)*TEXT('Měsíční rekapitulace'!$Q$3:$Q$999,\"0,0;0;0;\\0\")))","v":0},{"$f":"IF($A63=\"\",,SUMPRODUCT((LOOKUP(ROW(H$1:H$997),ROW(H$1:H$997)/ISNUMBER('Měsíční rekapitulace'!$L$1:$L$997),'Měsíční rekapitulace'!$L$1:$L$997)=H$4)*('Měsíční rekapitulace'!$A$3:$A$999=$A63)*TEXT('Měsíční rekapitulace'!$Q$3:$Q$999,\"0,0;0;0;\\0\")))","v":0},{"$f":"IF($A63=\"\",,SUMPRODUCT((LOOKUP(ROW(I$1:I$997),ROW(I$1:I$997)/ISNUMBER('Měsíční rekapitulace'!$L$1:$L$997),'Měsíční rekapitulace'!$L$1:$L$997)=I$4)*('Měsíční rekapitulace'!$A$3:$A$999=$A63)*TEXT('Měsíční rekapitulace'!$Q$3:$Q$999,\"0,0;0;0;\\0\")))","v":0},{"$f":"IF($A63=\"\",,SUMPRODUCT((LOOKUP(ROW(J$1:J$997),ROW(J$1:J$997)/ISNUMBER('Měsíční rekapitulace'!$L$1:$L$997),'Měsíční rekapitulace'!$L$1:$L$997)=J$4)*('Měsíční rekapitulace'!$A$3:$A$999=$A63)*TEXT('Měsíční rekapitulace'!$Q$3:$Q$999,\"0,0;0;0;\\0\")))","v":0},{"$f":"IF($A63=\"\",,SUMPRODUCT((LOOKUP(ROW(K$1:K$997),ROW(K$1:K$997)/ISNUMBER('Měsíční rekapitulace'!$L$1:$L$997),'Měsíční rekapitulace'!$L$1:$L$997)=K$4)*('Měsíční rekapitulace'!$A$3:$A$999=$A63)*TEXT('Měsíční rekapitulace'!$Q$3:$Q$999,\"0,0;0;0;\\0\")))","v":0},{"$f":"IF($A63=\"\",,SUMPRODUCT((LOOKUP(ROW(L$1:L$997),ROW(L$1:L$997)/ISNUMBER('Měsíční rekapitulace'!$L$1:$L$997),'Měsíční rekapitulace'!$L$1:$L$997)=L$4)*('Měsíční rekapitulace'!$A$3:$A$999=$A63)*TEXT('Měsíční rekapitulace'!$Q$3:$Q$999,\"0,0;0;0;\\0\")))","v":0},{"$f":"IF($A63=\"\",,SUMPRODUCT((LOOKUP(ROW(M$1:M$997),ROW(M$1:M$997)/ISNUMBER('Měsíční rekapitulace'!$L$1:$L$997),'Měsíční rekapitulace'!$L$1:$L$997)=M$4)*('Měsíční rekapitulace'!$A$3:$A$999=$A63)*TEXT('Měsíční rekapitulace'!$Q$3:$Q$999,\"0,0;0;0;\\0\")))","v":0},{"$f":"IF($A63=\"\",,SUMPRODUCT((LOOKUP(ROW(N$1:N$997),ROW(N$1:N$997)/ISNUMBER('Měsíční rekapitulace'!$L$1:$L$997),'Měsíční rekapitulace'!$L$1:$L$997)=N$4)*('Měsíční rekapitulace'!$A$3:$A$999=$A63)*TEXT('Měsíční rekapitulace'!$Q$3:$Q$999,\"0,0;0;0;\\0\")))","v":0},{"$f":"IF($A63=\"\",,SUMPRODUCT((LOOKUP(ROW(O$1:O$997),ROW(O$1:O$997)/ISNUMBER('Měsíční rekapitulace'!$L$1:$L$997),'Měsíční rekapitulace'!$L$1:$L$997)=O$4)*('Měsíční rekapitulace'!$A$3:$A$999=$A63)*TEXT('Měsíční rekapitulace'!$Q$3:$Q$999,\"0,0;0;0;\\0\")))","v":0},0]
[{"$f":"IFERROR(INDEX('Měsíční rekapitulace'!A$3:A$999,SMALL(IF(('Měsíční rekapitulace'!A$3:A$999<>\"\")*('Měsíční rekapitulace'!A$3:A$999<>'Měsíční rekapitulace'!$A$2)*(COUNTIF(A$5:A63,'Měsíční rekapitulace'!A$3:A$999)=0),ROW('Měsíční rekapitulace'!A$3:A$999)-2),1)),\"\")","v":""},{"$f":"IFERROR(INDEX('Měsíční rekapitulace'!E$3:E$999,MATCH(A64,'Měsíční rekapitulace'!A$3:A$999,)),\"\")","v":""},null,{"$f":"IF($A64=\"\",,SUMPRODUCT((LOOKUP(ROW(D$1:D$997),ROW(D$1:D$997)/ISNUMBER('Měsíční rekapitulace'!$L$1:$L$997),'Měsíční rekapitulace'!$L$1:$L$997)=D$4)*('Měsíční rekapitulace'!$A$3:$A$999=$A64)*TEXT('Měsíční rekapitulace'!$Q$3:$Q$999,\"0,0;0;0;\\0\")))","v":0},{"$f":"IF($A64=\"\",,SUMPRODUCT((LOOKUP(ROW(E$1:E$997),ROW(E$1:E$997)/ISNUMBER('Měsíční rekapitulace'!$L$1:$L$997),'Měsíční rekapitulace'!$L$1:$L$997)=E$4)*('Měsíční rekapitulace'!$A$3:$A$999=$A64)*TEXT('Měsíční rekapitulace'!$Q$3:$Q$999,\"0,0;0;0;\\0\")))","v":0},{"$f":"IF($A64=\"\",,SUMPRODUCT((LOOKUP(ROW(F$1:F$997),ROW(F$1:F$997)/ISNUMBER('Měsíční rekapitulace'!$L$1:$L$997),'Měsíční rekapitulace'!$L$1:$L$997)=F$4)*('Měsíční rekapitulace'!$A$3:$A$999=$A64)*TEXT('Měsíční rekapitulace'!$Q$3:$Q$999,\"0,0;0;0;\\0\")))","v":0},{"$f":"IF($A64=\"\",,SUMPRODUCT((LOOKUP(ROW(G$1:G$997),ROW(G$1:G$997)/ISNUMBER('Měsíční rekapitulace'!$L$1:$L$997),'Měsíční rekapitulace'!$L$1:$L$997)=G$4)*('Měsíční rekapitulace'!$A$3:$A$999=$A64)*TEXT('Měsíční rekapitulace'!$Q$3:$Q$999,\"0,0;0;0;\\0\")))","v":0},{"$f":"IF($A64=\"\",,SUMPRODUCT((LOOKUP(ROW(H$1:H$997),ROW(H$1:H$997)/ISNUMBER('Měsíční rekapitulace'!$L$1:$L$997),'Měsíční rekapitulace'!$L$1:$L$997)=H$4)*('Měsíční rekapitulace'!$A$3:$A$999=$A64)*TEXT('Měsíční rekapitulace'!$Q$3:$Q$999,\"0,0;0;0;\\0\")))","v":0},{"$f":"IF($A64=\"\",,SUMPRODUCT((LOOKUP(ROW(I$1:I$997),ROW(I$1:I$997)/ISNUMBER('Měsíční rekapitulace'!$L$1:$L$997),'Měsíční rekapitulace'!$L$1:$L$997)=I$4)*('Měsíční rekapitulace'!$A$3:$A$999=$A64)*TEXT('Měsíční rekapitulace'!$Q$3:$Q$999,\"0,0;0;0;\\0\")))","v":0},{"$f":"IF($A64=\"\",,SUMPRODUCT((LOOKUP(ROW(J$1:J$997),ROW(J$1:J$997)/ISNUMBER('Měsíční rekapitulace'!$L$1:$L$997),'Měsíční rekapitulace'!$L$1:$L$997)=J$4)*('Měsíční rekapitulace'!$A$3:$A$999=$A64)*TEXT('Měsíční rekapitulace'!$Q$3:$Q$999,\"0,0;0;0;\\0\")))","v":0},{"$f":"IF($A64=\"\",,SUMPRODUCT((LOOKUP(ROW(K$1:K$997),ROW(K$1:K$997)/ISNUMBER('Měsíční rekapitulace'!$L$1:$L$997),'Měsíční rekapitulace'!$L$1:$L$997)=K$4)*('Měsíční rekapitulace'!$A$3:$A$999=$A64)*TEXT('Měsíční rekapitulace'!$Q$3:$Q$999,\"0,0;0;0;\\0\")))","v":0},{"$f":"IF($A64=\"\",,SUMPRODUCT((LOOKUP(ROW(L$1:L$997),ROW(L$1:L$997)/ISNUMBER('Měsíční rekapitulace'!$L$1:$L$997),'Měsíční rekapitulace'!$L$1:$L$997)=L$4)*('Měsíční rekapitulace'!$A$3:$A$999=$A64)*TEXT('Měsíční rekapitulace'!$Q$3:$Q$999,\"0,0;0;0;\\0\")))","v":0},{"$f":"IF($A64=\"\",,SUMPRODUCT((LOOKUP(ROW(M$1:M$997),ROW(M$1:M$997)/ISNUMBER('Měsíční rekapitulace'!$L$1:$L$997),'Měsíční rekapitulace'!$L$1:$L$997)=M$4)*('Měsíční rekapitulace'!$A$3:$A$999=$A64)*TEXT('Měsíční rekapitulace'!$Q$3:$Q$999,\"0,0;0;0;\\0\")))","v":0},{"$f":"IF($A64=\"\",,SUMPRODUCT((LOOKUP(ROW(N$1:N$997),ROW(N$1:N$997)/ISNUMBER('Měsíční rekapitulace'!$L$1:$L$997),'Měsíční rekapitulace'!$L$1:$L$997)=N$4)*('Měsíční rekapitulace'!$A$3:$A$999=$A64)*TEXT('Měsíční rekapitulace'!$Q$3:$Q$999,\"0,0;0;0;\\0\")))","v":0},{"$f":"IF($A64=\"\",,SUMPRODUCT((LOOKUP(ROW(O$1:O$997),ROW(O$1:O$997)/ISNUMBER('Měsíční rekapitulace'!$L$1:$L$997),'Měsíční rekapitulace'!$L$1:$L$997)=O$4)*('Měsíční rekapitulace'!$A$3:$A$999=$A64)*TEXT('Měsíční rekapitulace'!$Q$3:$Q$999,\"0,0;0;0;\\0\")))","v":0},0]
[{"$f":"IFERROR(INDEX('Měsíční rekapitulace'!A$3:A$999,SMALL(IF(('Měsíční rekapitulace'!A$3:A$999<>\"\")*('Měsíční rekapitulace'!A$3:A$999<>'Měsíční rekapitulace'!$A$2)*(COUNTIF(A$5:A64,'Měsíční rekapitulace'!A$3:A$999)=0),ROW('Měsíční rekapitulace'!A$3:A$999)-2),1)),\"\")","v":""},{"$f":"IFERROR(INDEX('Měsíční rekapitulace'!E$3:E$999,MATCH(A65,'Měsíční rekapitulace'!A$3:A$999,)),\"\")","v":""},null,{"$f":"IF($A65=\"\",,SUMPRODUCT((LOOKUP(ROW(D$1:D$997),ROW(D$1:D$997)/ISNUMBER('Měsíční rekapitulace'!$L$1:$L$997),'Měsíční rekapitulace'!$L$1:$L$997)=D$4)*('Měsíční rekapitulace'!$A$3:$A$999=$A65)*TEXT('Měsíční rekapitulace'!$Q$3:$Q$999,\"0,0;0;0;\\0\")))","v":0},{"$f":"IF($A65=\"\",,SUMPRODUCT((LOOKUP(ROW(E$1:E$997),ROW(E$1:E$997)/ISNUMBER('Měsíční rekapitulace'!$L$1:$L$997),'Měsíční rekapitulace'!$L$1:$L$997)=E$4)*('Měsíční rekapitulace'!$A$3:$A$999=$A65)*TEXT('Měsíční rekapitulace'!$Q$3:$Q$999,\"0,0;0;0;\\0\")))","v":0},{"$f":"IF($A65=\"\",,SUMPRODUCT((LOOKUP(ROW(F$1:F$997),ROW(F$1:F$997)/ISNUMBER('Měsíční rekapitulace'!$L$1:$L$997),'Měsíční rekapitulace'!$L$1:$L$997)=F$4)*('Měsíční rekapitulace'!$A$3:$A$999=$A65)*TEXT('Měsíční rekapitulace'!$Q$3:$Q$999,\"0,0;0;0;\\0\")))","v":0},{"$f":"IF($A65=\"\",,SUMPRODUCT((LOOKUP(ROW(G$1:G$997),ROW(G$1:G$997)/ISNUMBER('Měsíční rekapitulace'!$L$1:$L$997),'Měsíční rekapitulace'!$L$1:$L$997)=G$4)*('Měsíční rekapitulace'!$A$3:$A$999=$A65)*TEXT('Měsíční rekapitulace'!$Q$3:$Q$999,\"0,0;0;0;\\0\")))","v":0},{"$f":"IF($A65=\"\",,SUMPRODUCT((LOOKUP(ROW(H$1:H$997),ROW(H$1:H$997)/ISNUMBER('Měsíční rekapitulace'!$L$1:$L$997),'Měsíční rekapitulace'!$L$1:$L$997)=H$4)*('Měsíční rekapitulace'!$A$3:$A$999=$A65)*TEXT('Měsíční rekapitulace'!$Q$3:$Q$999,\"0,0;0;0;\\0\")))","v":0},{"$f":"IF($A65=\"\",,SUMPRODUCT((LOOKUP(ROW(I$1:I$997),ROW(I$1:I$997)/ISNUMBER('Měsíční rekapitulace'!$L$1:$L$997),'Měsíční rekapitulace'!$L$1:$L$997)=I$4)*('Měsíční rekapitulace'!$A$3:$A$999=$A65)*TEXT('Měsíční rekapitulace'!$Q$3:$Q$999,\"0,0;0;0;\\0\")))","v":0},{"$f":"IF($A65=\"\",,SUMPRODUCT((LOOKUP(ROW(J$1:J$997),ROW(J$1:J$997)/ISNUMBER('Měsíční rekapitulace'!$L$1:$L$997),'Měsíční rekapitulace'!$L$1:$L$997)=J$4)*('Měsíční rekapitulace'!$A$3:$A$999=$A65)*TEXT('Měsíční rekapitulace'!$Q$3:$Q$999,\"0,0;0;0;\\0\")))","v":0},{"$f":"IF($A65=\"\",,SUMPRODUCT((LOOKUP(ROW(K$1:K$997),ROW(K$1:K$997)/ISNUMBER('Měsíční rekapitulace'!$L$1:$L$997),'Měsíční rekapitulace'!$L$1:$L$997)=K$4)*('Měsíční rekapitulace'!$A$3:$A$999=$A65)*TEXT('Měsíční rekapitulace'!$Q$3:$Q$999,\"0,0;0;0;\\0\")))","v":0},{"$f":"IF($A65=\"\",,SUMPRODUCT((LOOKUP(ROW(L$1:L$997),ROW(L$1:L$997)/ISNUMBER('Měsíční rekapitulace'!$L$1:$L$997),'Měsíční rekapitulace'!$L$1:$L$997)=L$4)*('Měsíční rekapitulace'!$A$3:$A$999=$A65)*TEXT('Měsíční rekapitulace'!$Q$3:$Q$999,\"0,0;0;0;\\0\")))","v":0},{"$f":"IF($A65=\"\",,SUMPRODUCT((LOOKUP(ROW(M$1:M$997),ROW(M$1:M$997)/ISNUMBER('Měsíční rekapitulace'!$L$1:$L$997),'Měsíční rekapitulace'!$L$1:$L$997)=M$4)*('Měsíční rekapitulace'!$A$3:$A$999=$A65)*TEXT('Měsíční rekapitulace'!$Q$3:$Q$999,\"0,0;0;0;\\0\")))","v":0},{"$f":"IF($A65=\"\",,SUMPRODUCT((LOOKUP(ROW(N$1:N$997),ROW(N$1:N$997)/ISNUMBER('Měsíční rekapitulace'!$L$1:$L$997),'Měsíční rekapitulace'!$L$1:$L$997)=N$4)*('Měsíční rekapitulace'!$A$3:$A$999=$A65)*TEXT('Měsíční rekapitulace'!$Q$3:$Q$999,\"0,0;0;0;\\0\")))","v":0},{"$f":"IF($A65=\"\",,SUMPRODUCT((LOOKUP(ROW(O$1:O$997),ROW(O$1:O$997)/ISNUMBER('Měsíční rekapitulace'!$L$1:$L$997),'Měsíční rekapitulace'!$L$1:$L$997)=O$4)*('Měsíční rekapitulace'!$A$3:$A$999=$A65)*TEXT('Měsíční rekapitulace'!$Q$3:$Q$999,\"0,0;0;0;\\0\")))","v":0},0]
[{"$f":"IFERROR(INDEX('Měsíční rekapitulace'!A$3:A$999,SMALL(IF(('Měsíční rekapitulace'!A$3:A$999<>\"\")*('Měsíční rekapitulace'!A$3:A$999<>'Měsíční rekapitulace'!$A$2)*(COUNTIF(A$5:A65,'Měsíční rekapitulace'!A$3:A$999)=0),ROW('Měsíční rekapitulace'!A$3:A$999)-2),1)),\"\")","v":""},{"$f":"IFERROR(INDEX('Měsíční rekapitulace'!E$3:E$999,MATCH(A66,'Měsíční rekapitulace'!A$3:A$999,)),\"\")","v":""},null,{"$f":"IF($A66=\"\",,SUMPRODUCT((LOOKUP(ROW(D$1:D$997),ROW(D$1:D$997)/ISNUMBER('Měsíční rekapitulace'!$L$1:$L$997),'Měsíční rekapitulace'!$L$1:$L$997)=D$4)*('Měsíční rekapitulace'!$A$3:$A$999=$A66)*TEXT('Měsíční rekapitulace'!$Q$3:$Q$999,\"0,0;0;0;\\0\")))","v":0},{"$f":"IF($A66=\"\",,SUMPRODUCT((LOOKUP(ROW(E$1:E$997),ROW(E$1:E$997)/ISNUMBER('Měsíční rekapitulace'!$L$1:$L$997),'Měsíční rekapitulace'!$L$1:$L$997)=E$4)*('Měsíční rekapitulace'!$A$3:$A$999=$A66)*TEXT('Měsíční rekapitulace'!$Q$3:$Q$999,\"0,0;0;0;\\0\")))","v":0},{"$f":"IF($A66=\"\",,SUMPRODUCT((LOOKUP(ROW(F$1:F$997),ROW(F$1:F$997)/ISNUMBER('Měsíční rekapitulace'!$L$1:$L$997),'Měsíční rekapitulace'!$L$1:$L$997)=F$4)*('Měsíční rekapitulace'!$A$3:$A$999=$A66)*TEXT('Měsíční rekapitulace'!$Q$3:$Q$999,\"0,0;0;0;\\0\")))","v":0},{"$f":"IF($A66=\"\",,SUMPRODUCT((LOOKUP(ROW(G$1:G$997),ROW(G$1:G$997)/ISNUMBER('Měsíční rekapitulace'!$L$1:$L$997),'Měsíční rekapitulace'!$L$1:$L$997)=G$4)*('Měsíční rekapitulace'!$A$3:$A$999=$A66)*TEXT('Měsíční rekapitulace'!$Q$3:$Q$999,\"0,0;0;0;\\0\")))","v":0},{"$f":"IF($A66=\"\",,SUMPRODUCT((LOOKUP(ROW(H$1:H$997),ROW(H$1:H$997)/ISNUMBER('Měsíční rekapitulace'!$L$1:$L$997),'Měsíční rekapitulace'!$L$1:$L$997)=H$4)*('Měsíční rekapitulace'!$A$3:$A$999=$A66)*TEXT('Měsíční rekapitulace'!$Q$3:$Q$999,\"0,0;0;0;\\0\")))","v":0},{"$f":"IF($A66=\"\",,SUMPRODUCT((LOOKUP(ROW(I$1:I$997),ROW(I$1:I$997)/ISNUMBER('Měsíční rekapitulace'!$L$1:$L$997),'Měsíční rekapitulace'!$L$1:$L$997)=I$4)*('Měsíční rekapitulace'!$A$3:$A$999=$A66)*TEXT('Měsíční rekapitulace'!$Q$3:$Q$999,\"0,0;0;0;\\0\")))","v":0},{"$f":"IF($A66=\"\",,SUMPRODUCT((LOOKUP(ROW(J$1:J$997),ROW(J$1:J$997)/ISNUMBER('Měsíční rekapitulace'!$L$1:$L$997),'Měsíční rekapitulace'!$L$1:$L$997)=J$4)*('Měsíční rekapitulace'!$A$3:$A$999=$A66)*TEXT('Měsíční rekapitulace'!$Q$3:$Q$999,\"0,0;0;0;\\0\")))","v":0},{"$f":"IF($A66=\"\",,SUMPRODUCT((LOOKUP(ROW(K$1:K$997),ROW(K$1:K$997)/ISNUMBER('Měsíční rekapitulace'!$L$1:$L$997),'Měsíční rekapitulace'!$L$1:$L$997)=K$4)*('Měsíční rekapitulace'!$A$3:$A$999=$A66)*TEXT('Měsíční rekapitulace'!$Q$3:$Q$999,\"0,0;0;0;\\0\")))","v":0},{"$f":"IF($A66=\"\",,SUMPRODUCT((LOOKUP(ROW(L$1:L$997),ROW(L$1:L$997)/ISNUMBER('Měsíční rekapitulace'!$L$1:$L$997),'Měsíční rekapitulace'!$L$1:$L$997)=L$4)*('Měsíční rekapitulace'!$A$3:$A$999=$A66)*TEXT('Měsíční rekapitulace'!$Q$3:$Q$999,\"0,0;0;0;\\0\")))","v":0},{"$f":"IF($A66=\"\",,SUMPRODUCT((LOOKUP(ROW(M$1:M$997),ROW(M$1:M$997)/ISNUMBER('Měsíční rekapitulace'!$L$1:$L$997),'Měsíční rekapitulace'!$L$1:$L$997)=M$4)*('Měsíční rekapitulace'!$A$3:$A$999=$A66)*TEXT('Měsíční rekapitulace'!$Q$3:$Q$999,\"0,0;0;0;\\0\")))","v":0},{"$f":"IF($A66=\"\",,SUMPRODUCT((LOOKUP(ROW(N$1:N$997),ROW(N$1:N$997)/ISNUMBER('Měsíční rekapitulace'!$L$1:$L$997),'Měsíční rekapitulace'!$L$1:$L$997)=N$4)*('Měsíční rekapitulace'!$A$3:$A$999=$A66)*TEXT('Měsíční rekapitulace'!$Q$3:$Q$999,\"0,0;0;0;\\0\")))","v":0},{"$f":"IF($A66=\"\",,SUMPRODUCT((LOOKUP(ROW(O$1:O$997),ROW(O$1:O$997)/ISNUMBER('Měsíční rekapitulace'!$L$1:$L$997),'Měsíční rekapitulace'!$L$1:$L$997)=O$4)*('Měsíční rekapitulace'!$A$3:$A$999=$A66)*TEXT('Měsíční rekapitulace'!$Q$3:$Q$999,\"0,0;0;0;\\0\")))","v":0},0]
[{"$f":"IFERROR(INDEX('Měsíční rekapitulace'!A$3:A$999,SMALL(IF(('Měsíční rekapitulace'!A$3:A$999<>\"\")*('Měsíční rekapitulace'!A$3:A$999<>'Měsíční rekapitulace'!$A$2)*(COUNTIF(A$5:A66,'Měsíční rekapitulace'!A$3:A$999)=0),ROW('Měsíční rekapitulace'!A$3:A$999)-2),1)),\"\")","v":""},{"$f":"IFERROR(INDEX('Měsíční rekapitulace'!E$3:E$999,MATCH(A67,'Měsíční rekapitulace'!A$3:A$999,)),\"\")","v":""},null,{"$f":"IF($A67=\"\",,SUMPRODUCT((LOOKUP(ROW(D$1:D$997),ROW(D$1:D$997)/ISNUMBER('Měsíční rekapitulace'!$L$1:$L$997),'Měsíční rekapitulace'!$L$1:$L$997)=D$4)*('Měsíční rekapitulace'!$A$3:$A$999=$A67)*TEXT('Měsíční rekapitulace'!$Q$3:$Q$999,\"0,0;0;0;\\0\")))","v":0},{"$f":"IF($A67=\"\",,SUMPRODUCT((LOOKUP(ROW(E$1:E$997),ROW(E$1:E$997)/ISNUMBER('Měsíční rekapitulace'!$L$1:$L$997),'Měsíční rekapitulace'!$L$1:$L$997)=E$4)*('Měsíční rekapitulace'!$A$3:$A$999=$A67)*TEXT('Měsíční rekapitulace'!$Q$3:$Q$999,\"0,0;0;0;\\0\")))","v":0},{"$f":"IF($A67=\"\",,SUMPRODUCT((LOOKUP(ROW(F$1:F$997),ROW(F$1:F$997)/ISNUMBER('Měsíční rekapitulace'!$L$1:$L$997),'Měsíční rekapitulace'!$L$1:$L$997)=F$4)*('Měsíční rekapitulace'!$A$3:$A$999=$A67)*TEXT('Měsíční rekapitulace'!$Q$3:$Q$999,\"0,0;0;0;\\0\")))","v":0},{"$f":"IF($A67=\"\",,SUMPRODUCT((LOOKUP(ROW(G$1:G$997),ROW(G$1:G$997)/ISNUMBER('Měsíční rekapitulace'!$L$1:$L$997),'Měsíční rekapitulace'!$L$1:$L$997)=G$4)*('Měsíční rekapitulace'!$A$3:$A$999=$A67)*TEXT('Měsíční rekapitulace'!$Q$3:$Q$999,\"0,0;0;0;\\0\")))","v":0},{"$f":"IF($A67=\"\",,SUMPRODUCT((LOOKUP(ROW(H$1:H$997),ROW(H$1:H$997)/ISNUMBER('Měsíční rekapitulace'!$L$1:$L$997),'Měsíční rekapitulace'!$L$1:$L$997)=H$4)*('Měsíční rekapitulace'!$A$3:$A$999=$A67)*TEXT('Měsíční rekapitulace'!$Q$3:$Q$999,\"0,0;0;0;\\0\")))","v":0},{"$f":"IF($A67=\"\",,SUMPRODUCT((LOOKUP(ROW(I$1:I$997),ROW(I$1:I$997)/ISNUMBER('Měsíční rekapitulace'!$L$1:$L$997),'Měsíční rekapitulace'!$L$1:$L$997)=I$4)*('Měsíční rekapitulace'!$A$3:$A$999=$A67)*TEXT('Měsíční rekapitulace'!$Q$3:$Q$999,\"0,0;0;0;\\0\")))","v":0},{"$f":"IF($A67=\"\",,SUMPRODUCT((LOOKUP(ROW(J$1:J$997),ROW(J$1:J$997)/ISNUMBER('Měsíční rekapitulace'!$L$1:$L$997),'Měsíční rekapitulace'!$L$1:$L$997)=J$4)*('Měsíční rekapitulace'!$A$3:$A$999=$A67)*TEXT('Měsíční rekapitulace'!$Q$3:$Q$999,\"0,0;0;0;\\0\")))","v":0},{"$f":"IF($A67=\"\",,SUMPRODUCT((LOOKUP(ROW(K$1:K$997),ROW(K$1:K$997)/ISNUMBER('Měsíční rekapitulace'!$L$1:$L$997),'Měsíční rekapitulace'!$L$1:$L$997)=K$4)*('Měsíční rekapitulace'!$A$3:$A$999=$A67)*TEXT('Měsíční rekapitulace'!$Q$3:$Q$999,\"0,0;0;0;\\0\")))","v":0},{"$f":"IF($A67=\"\",,SUMPRODUCT((LOOKUP(ROW(L$1:L$997),ROW(L$1:L$997)/ISNUMBER('Měsíční rekapitulace'!$L$1:$L$997),'Měsíční rekapitulace'!$L$1:$L$997)=L$4)*('Měsíční rekapitulace'!$A$3:$A$999=$A67)*TEXT('Měsíční rekapitulace'!$Q$3:$Q$999,\"0,0;0;0;\\0\")))","v":0},{"$f":"IF($A67=\"\",,SUMPRODUCT((LOOKUP(ROW(M$1:M$997),ROW(M$1:M$997)/ISNUMBER('Měsíční rekapitulace'!$L$1:$L$997),'Měsíční rekapitulace'!$L$1:$L$997)=M$4)*('Měsíční rekapitulace'!$A$3:$A$999=$A67)*TEXT('Měsíční rekapitulace'!$Q$3:$Q$999,\"0,0;0;0;\\0\")))","v":0},{"$f":"IF($A67=\"\",,SUMPRODUCT((LOOKUP(ROW(N$1:N$997),ROW(N$1:N$997)/ISNUMBER('Měsíční rekapitulace'!$L$1:$L$997),'Měsíční rekapitulace'!$L$1:$L$997)=N$4)*('Měsíční rekapitulace'!$A$3:$A$999=$A67)*TEXT('Měsíční rekapitulace'!$Q$3:$Q$999,\"0,0;0;0;\\0\")))","v":0},{"$f":"IF($A67=\"\",,SUMPRODUCT((LOOKUP(ROW(O$1:O$997),ROW(O$1:O$997)/ISNUMBER('Měsíční rekapitulace'!$L$1:$L$997),'Měsíční rekapitulace'!$L$1:$L$997)=O$4)*('Měsíční rekapitulace'!$A$3:$A$999=$A67)*TEXT('Měsíční rekapitulace'!$Q$3:$Q$999,\"0,0;0;0;\\0\")))","v":0},0]
[{"$f":"IFERROR(INDEX('Měsíční rekapitulace'!A$3:A$999,SMALL(IF(('Měsíční rekapitulace'!A$3:A$999<>\"\")*('Měsíční rekapitulace'!A$3:A$999<>'Měsíční rekapitulace'!$A$2)*(COUNTIF(A$5:A67,'Měsíční rekapitulace'!A$3:A$999)=0),ROW('Měsíční rekapitulace'!A$3:A$999)-2),1)),\"\")","v":""},{"$f":"IFERROR(INDEX('Měsíční rekapitulace'!E$3:E$999,MATCH(A68,'Měsíční rekapitulace'!A$3:A$999,)),\"\")","v":""},null,{"$f":"IF($A68=\"\",,SUMPRODUCT((LOOKUP(ROW(D$1:D$997),ROW(D$1:D$997)/ISNUMBER('Měsíční rekapitulace'!$L$1:$L$997),'Měsíční rekapitulace'!$L$1:$L$997)=D$4)*('Měsíční rekapitulace'!$A$3:$A$999=$A68)*TEXT('Měsíční rekapitulace'!$Q$3:$Q$999,\"0,0;0;0;\\0\")))","v":0},{"$f":"IF($A68=\"\",,SUMPRODUCT((LOOKUP(ROW(E$1:E$997),ROW(E$1:E$997)/ISNUMBER('Měsíční rekapitulace'!$L$1:$L$997),'Měsíční rekapitulace'!$L$1:$L$997)=E$4)*('Měsíční rekapitulace'!$A$3:$A$999=$A68)*TEXT('Měsíční rekapitulace'!$Q$3:$Q$999,\"0,0;0;0;\\0\")))","v":0},{"$f":"IF($A68=\"\",,SUMPRODUCT((LOOKUP(ROW(F$1:F$997),ROW(F$1:F$997)/ISNUMBER('Měsíční rekapitulace'!$L$1:$L$997),'Měsíční rekapitulace'!$L$1:$L$997)=F$4)*('Měsíční rekapitulace'!$A$3:$A$999=$A68)*TEXT('Měsíční rekapitulace'!$Q$3:$Q$999,\"0,0;0;0;\\0\")))","v":0},{"$f":"IF($A68=\"\",,SUMPRODUCT((LOOKUP(ROW(G$1:G$997),ROW(G$1:G$997)/ISNUMBER('Měsíční rekapitulace'!$L$1:$L$997),'Měsíční rekapitulace'!$L$1:$L$997)=G$4)*('Měsíční rekapitulace'!$A$3:$A$999=$A68)*TEXT('Měsíční rekapitulace'!$Q$3:$Q$999,\"0,0;0;0;\\0\")))","v":0},{"$f":"IF($A68=\"\",,SUMPRODUCT((LOOKUP(ROW(H$1:H$997),ROW(H$1:H$997)/ISNUMBER('Měsíční rekapitulace'!$L$1:$L$997),'Měsíční rekapitulace'!$L$1:$L$997)=H$4)*('Měsíční rekapitulace'!$A$3:$A$999=$A68)*TEXT('Měsíční rekapitulace'!$Q$3:$Q$999,\"0,0;0;0;\\0\")))","v":0},{"$f":"IF($A68=\"\",,SUMPRODUCT((LOOKUP(ROW(I$1:I$997),ROW(I$1:I$997)/ISNUMBER('Měsíční rekapitulace'!$L$1:$L$997),'Měsíční rekapitulace'!$L$1:$L$997)=I$4)*('Měsíční rekapitulace'!$A$3:$A$999=$A68)*TEXT('Měsíční rekapitulace'!$Q$3:$Q$999,\"0,0;0;0;\\0\")))","v":0},{"$f":"IF($A68=\"\",,SUMPRODUCT((LOOKUP(ROW(J$1:J$997),ROW(J$1:J$997)/ISNUMBER('Měsíční rekapitulace'!$L$1:$L$997),'Měsíční rekapitulace'!$L$1:$L$997)=J$4)*('Měsíční rekapitulace'!$A$3:$A$999=$A68)*TEXT('Měsíční rekapitulace'!$Q$3:$Q$999,\"0,0;0;0;\\0\")))","v":0},{"$f":"IF($A68=\"\",,SUMPRODUCT((LOOKUP(ROW(K$1:K$997),ROW(K$1:K$997)/ISNUMBER('Měsíční rekapitulace'!$L$1:$L$997),'Měsíční rekapitulace'!$L$1:$L$997)=K$4)*('Měsíční rekapitulace'!$A$3:$A$999=$A68)*TEXT('Měsíční rekapitulace'!$Q$3:$Q$999,\"0,0;0;0;\\0\")))","v":0},{"$f":"IF($A68=\"\",,SUMPRODUCT((LOOKUP(ROW(L$1:L$997),ROW(L$1:L$997)/ISNUMBER('Měsíční rekapitulace'!$L$1:$L$997),'Měsíční rekapitulace'!$L$1:$L$997)=L$4)*('Měsíční rekapitulace'!$A$3:$A$999=$A68)*TEXT('Měsíční rekapitulace'!$Q$3:$Q$999,\"0,0;0;0;\\0\")))","v":0},{"$f":"IF($A68=\"\",,SUMPRODUCT((LOOKUP(ROW(M$1:M$997),ROW(M$1:M$997)/ISNUMBER('Měsíční rekapitulace'!$L$1:$L$997),'Měsíční rekapitulace'!$L$1:$L$997)=M$4)*('Měsíční rekapitulace'!$A$3:$A$999=$A68)*TEXT('Měsíční rekapitulace'!$Q$3:$Q$999,\"0,0;0;0;\\0\")))","v":0},{"$f":"IF($A68=\"\",,SUMPRODUCT((LOOKUP(ROW(N$1:N$997),ROW(N$1:N$997)/ISNUMBER('Měsíční rekapitulace'!$L$1:$L$997),'Měsíční rekapitulace'!$L$1:$L$997)=N$4)*('Měsíční rekapitulace'!$A$3:$A$999=$A68)*TEXT('Měsíční rekapitulace'!$Q$3:$Q$999,\"0,0;0;0;\\0\")))","v":0},{"$f":"IF($A68=\"\",,SUMPRODUCT((LOOKUP(ROW(O$1:O$997),ROW(O$1:O$997)/ISNUMBER('Měsíční rekapitulace'!$L$1:$L$997),'Měsíční rekapitulace'!$L$1:$L$997)=O$4)*('Měsíční rekapitulace'!$A$3:$A$999=$A68)*TEXT('Měsíční rekapitulace'!$Q$3:$Q$999,\"0,0;0;0;\\0\")))","v":0},0]
[{"$f":"IFERROR(INDEX('Měsíční rekapitulace'!A$3:A$999,SMALL(IF(('Měsíční rekapitulace'!A$3:A$999<>\"\")*('Měsíční rekapitulace'!A$3:A$999<>'Měsíční rekapitulace'!$A$2)*(COUNTIF(A$5:A68,'Měsíční rekapitulace'!A$3:A$999)=0),ROW('Měsíční rekapitulace'!A$3:A$999)-2),1)),\"\")","v":""},{"$f":"IFERROR(INDEX('Měsíční rekapitulace'!E$3:E$999,MATCH(A69,'Měsíční rekapitulace'!A$3:A$999,)),\"\")","v":""},null,{"$f":"IF($A69=\"\",,SUMPRODUCT((LOOKUP(ROW(D$1:D$997),ROW(D$1:D$997)/ISNUMBER('Měsíční rekapitulace'!$L$1:$L$997),'Měsíční rekapitulace'!$L$1:$L$997)=D$4)*('Měsíční rekapitulace'!$A$3:$A$999=$A69)*TEXT('Měsíční rekapitulace'!$Q$3:$Q$999,\"0,0;0;0;\\0\")))","v":0},{"$f":"IF($A69=\"\",,SUMPRODUCT((LOOKUP(ROW(E$1:E$997),ROW(E$1:E$997)/ISNUMBER('Měsíční rekapitulace'!$L$1:$L$997),'Měsíční rekapitulace'!$L$1:$L$997)=E$4)*('Měsíční rekapitulace'!$A$3:$A$999=$A69)*TEXT('Měsíční rekapitulace'!$Q$3:$Q$999,\"0,0;0;0;\\0\")))","v":0},{"$f":"IF($A69=\"\",,SUMPRODUCT((LOOKUP(ROW(F$1:F$997),ROW(F$1:F$997)/ISNUMBER('Měsíční rekapitulace'!$L$1:$L$997),'Měsíční rekapitulace'!$L$1:$L$997)=F$4)*('Měsíční rekapitulace'!$A$3:$A$999=$A69)*TEXT('Měsíční rekapitulace'!$Q$3:$Q$999,\"0,0;0;0;\\0\")))","v":0},{"$f":"IF($A69=\"\",,SUMPRODUCT((LOOKUP(ROW(G$1:G$997),ROW(G$1:G$997)/ISNUMBER('Měsíční rekapitulace'!$L$1:$L$997),'Měsíční rekapitulace'!$L$1:$L$997)=G$4)*('Měsíční rekapitulace'!$A$3:$A$999=$A69)*TEXT('Měsíční rekapitulace'!$Q$3:$Q$999,\"0,0;0;0;\\0\")))","v":0},{"$f":"IF($A69=\"\",,SUMPRODUCT((LOOKUP(ROW(H$1:H$997),ROW(H$1:H$997)/ISNUMBER('Měsíční rekapitulace'!$L$1:$L$997),'Měsíční rekapitulace'!$L$1:$L$997)=H$4)*('Měsíční rekapitulace'!$A$3:$A$999=$A69)*TEXT('Měsíční rekapitulace'!$Q$3:$Q$999,\"0,0;0;0;\\0\")))","v":0},{"$f":"IF($A69=\"\",,SUMPRODUCT((LOOKUP(ROW(I$1:I$997),ROW(I$1:I$997)/ISNUMBER('Měsíční rekapitulace'!$L$1:$L$997),'Měsíční rekapitulace'!$L$1:$L$997)=I$4)*('Měsíční rekapitulace'!$A$3:$A$999=$A69)*TEXT('Měsíční rekapitulace'!$Q$3:$Q$999,\"0,0;0;0;\\0\")))","v":0},{"$f":"IF($A69=\"\",,SUMPRODUCT((LOOKUP(ROW(J$1:J$997),ROW(J$1:J$997)/ISNUMBER('Měsíční rekapitulace'!$L$1:$L$997),'Měsíční rekapitulace'!$L$1:$L$997)=J$4)*('Měsíční rekapitulace'!$A$3:$A$999=$A69)*TEXT('Měsíční rekapitulace'!$Q$3:$Q$999,\"0,0;0;0;\\0\")))","v":0},{"$f":"IF($A69=\"\",,SUMPRODUCT((LOOKUP(ROW(K$1:K$997),ROW(K$1:K$997)/ISNUMBER('Měsíční rekapitulace'!$L$1:$L$997),'Měsíční rekapitulace'!$L$1:$L$997)=K$4)*('Měsíční rekapitulace'!$A$3:$A$999=$A69)*TEXT('Měsíční rekapitulace'!$Q$3:$Q$999,\"0,0;0;0;\\0\")))","v":0},{"$f":"IF($A69=\"\",,SUMPRODUCT((LOOKUP(ROW(L$1:L$997),ROW(L$1:L$997)/ISNUMBER('Měsíční rekapitulace'!$L$1:$L$997),'Měsíční rekapitulace'!$L$1:$L$997)=L$4)*('Měsíční rekapitulace'!$A$3:$A$999=$A69)*TEXT('Měsíční rekapitulace'!$Q$3:$Q$999,\"0,0;0;0;\\0\")))","v":0},{"$f":"IF($A69=\"\",,SUMPRODUCT((LOOKUP(ROW(M$1:M$997),ROW(M$1:M$997)/ISNUMBER('Měsíční rekapitulace'!$L$1:$L$997),'Měsíční rekapitulace'!$L$1:$L$997)=M$4)*('Měsíční rekapitulace'!$A$3:$A$999=$A69)*TEXT('Měsíční rekapitulace'!$Q$3:$Q$999,\"0,0;0;0;\\0\")))","v":0},{"$f":"IF($A69=\"\",,SUMPRODUCT((LOOKUP(ROW(N$1:N$997),ROW(N$1:N$997)/ISNUMBER('Měsíční rekapitulace'!$L$1:$L$997),'Měsíční rekapitulace'!$L$1:$L$997)=N$4)*('Měsíční rekapitulace'!$A$3:$A$999=$A69)*TEXT('Měsíční rekapitulace'!$Q$3:$Q$999,\"0,0;0;0;\\0\")))","v":0},{"$f":"IF($A69=\"\",,SUMPRODUCT((LOOKUP(ROW(O$1:O$997),ROW(O$1:O$997)/ISNUMBER('Měsíční rekapitulace'!$L$1:$L$997),'Měsíční rekapitulace'!$L$1:$L$997)=O$4)*('Měsíční rekapitulace'!$A$3:$A$999=$A69)*TEXT('Měsíční rekapitulace'!$Q$3:$Q$999,\"0,0;0;0;\\0\")))","v":0},0]
[{"$f":"IFERROR(INDEX('Měsíční rekapitulace'!A$3:A$999,SMALL(IF(('Měsíční rekapitulace'!A$3:A$999<>\"\")*('Měsíční rekapitulace'!A$3:A$999<>'Měsíční rekapitulace'!$A$2)*(COUNTIF(A$5:A69,'Měsíční rekapitulace'!A$3:A$999)=0),ROW('Měsíční rekapitulace'!A$3:A$999)-2),1)),\"\")","v":""},{"$f":"IFERROR(INDEX('Měsíční rekapitulace'!E$3:E$999,MATCH(A70,'Měsíční rekapitulace'!A$3:A$999,)),\"\")","v":""},null,{"$f":"IF($A70=\"\",,SUMPRODUCT((LOOKUP(ROW(D$1:D$997),ROW(D$1:D$997)/ISNUMBER('Měsíční rekapitulace'!$L$1:$L$997),'Měsíční rekapitulace'!$L$1:$L$997)=D$4)*('Měsíční rekapitulace'!$A$3:$A$999=$A70)*TEXT('Měsíční rekapitulace'!$Q$3:$Q$999,\"0,0;0;0;\\0\")))","v":0},{"$f":"IF($A70=\"\",,SUMPRODUCT((LOOKUP(ROW(E$1:E$997),ROW(E$1:E$997)/ISNUMBER('Měsíční rekapitulace'!$L$1:$L$997),'Měsíční rekapitulace'!$L$1:$L$997)=E$4)*('Měsíční rekapitulace'!$A$3:$A$999=$A70)*TEXT('Měsíční rekapitulace'!$Q$3:$Q$999,\"0,0;0;0;\\0\")))","v":0},{"$f":"IF($A70=\"\",,SUMPRODUCT((LOOKUP(ROW(F$1:F$997),ROW(F$1:F$997)/ISNUMBER('Měsíční rekapitulace'!$L$1:$L$997),'Měsíční rekapitulace'!$L$1:$L$997)=F$4)*('Měsíční rekapitulace'!$A$3:$A$999=$A70)*TEXT('Měsíční rekapitulace'!$Q$3:$Q$999,\"0,0;0;0;\\0\")))","v":0},{"$f":"IF($A70=\"\",,SUMPRODUCT((LOOKUP(ROW(G$1:G$997),ROW(G$1:G$997)/ISNUMBER('Měsíční rekapitulace'!$L$1:$L$997),'Měsíční rekapitulace'!$L$1:$L$997)=G$4)*('Měsíční rekapitulace'!$A$3:$A$999=$A70)*TEXT('Měsíční rekapitulace'!$Q$3:$Q$999,\"0,0;0;0;\\0\")))","v":0},{"$f":"IF($A70=\"\",,SUMPRODUCT((LOOKUP(ROW(H$1:H$997),ROW(H$1:H$997)/ISNUMBER('Měsíční rekapitulace'!$L$1:$L$997),'Měsíční rekapitulace'!$L$1:$L$997)=H$4)*('Měsíční rekapitulace'!$A$3:$A$999=$A70)*TEXT('Měsíční rekapitulace'!$Q$3:$Q$999,\"0,0;0;0;\\0\")))","v":0},{"$f":"IF($A70=\"\",,SUMPRODUCT((LOOKUP(ROW(I$1:I$997),ROW(I$1:I$997)/ISNUMBER('Měsíční rekapitulace'!$L$1:$L$997),'Měsíční rekapitulace'!$L$1:$L$997)=I$4)*('Měsíční rekapitulace'!$A$3:$A$999=$A70)*TEXT('Měsíční rekapitulace'!$Q$3:$Q$999,\"0,0;0;0;\\0\")))","v":0},{"$f":"IF($A70=\"\",,SUMPRODUCT((LOOKUP(ROW(J$1:J$997),ROW(J$1:J$997)/ISNUMBER('Měsíční rekapitulace'!$L$1:$L$997),'Měsíční rekapitulace'!$L$1:$L$997)=J$4)*('Měsíční rekapitulace'!$A$3:$A$999=$A70)*TEXT('Měsíční rekapitulace'!$Q$3:$Q$999,\"0,0;0;0;\\0\")))","v":0},{"$f":"IF($A70=\"\",,SUMPRODUCT((LOOKUP(ROW(K$1:K$997),ROW(K$1:K$997)/ISNUMBER('Měsíční rekapitulace'!$L$1:$L$997),'Měsíční rekapitulace'!$L$1:$L$997)=K$4)*('Měsíční rekapitulace'!$A$3:$A$999=$A70)*TEXT('Měsíční rekapitulace'!$Q$3:$Q$999,\"0,0;0;0;\\0\")))","v":0},{"$f":"IF($A70=\"\",,SUMPRODUCT((LOOKUP(ROW(L$1:L$997),ROW(L$1:L$997)/ISNUMBER('Měsíční rekapitulace'!$L$1:$L$997),'Měsíční rekapitulace'!$L$1:$L$997)=L$4)*('Měsíční rekapitulace'!$A$3:$A$999=$A70)*TEXT('Měsíční rekapitulace'!$Q$3:$Q$999,\"0,0;0;0;\\0\")))","v":0},{"$f":"IF($A70=\"\",,SUMPRODUCT((LOOKUP(ROW(M$1:M$997),ROW(M$1:M$997)/ISNUMBER('Měsíční rekapitulace'!$L$1:$L$997),'Měsíční rekapitulace'!$L$1:$L$997)=M$4)*('Měsíční rekapitulace'!$A$3:$A$999=$A70)*TEXT('Měsíční rekapitulace'!$Q$3:$Q$999,\"0,0;0;0;\\0\")))","v":0},{"$f":"IF($A70=\"\",,SUMPRODUCT((LOOKUP(ROW(N$1:N$997),ROW(N$1:N$997)/ISNUMBER('Měsíční rekapitulace'!$L$1:$L$997),'Měsíční rekapitulace'!$L$1:$L$997)=N$4)*('Měsíční rekapitulace'!$A$3:$A$999=$A70)*TEXT('Měsíční rekapitulace'!$Q$3:$Q$999,\"0,0;0;0;\\0\")))","v":0},{"$f":"IF($A70=\"\",,SUMPRODUCT((LOOKUP(ROW(O$1:O$997),ROW(O$1:O$997)/ISNUMBER('Měsíční rekapitulace'!$L$1:$L$997),'Měsíční rekapitulace'!$L$1:$L$997)=O$4)*('Měsíční rekapitulace'!$A$3:$A$999=$A70)*TEXT('Měsíční rekapitulace'!$Q$3:$Q$999,\"0,0;0;0;\\0\")))","v":0},0]
[{"$f":"IFERROR(INDEX('Měsíční rekapitulace'!A$3:A$999,SMALL(IF(('Měsíční rekapitulace'!A$3:A$999<>\"\")*('Měsíční rekapitulace'!A$3:A$999<>'Měsíční rekapitulace'!$A$2)*(COUNTIF(A$5:A70,'Měsíční rekapitulace'!A$3:A$999)=0),ROW('Měsíční rekapitulace'!A$3:A$999)-2),1)),\"\")","v":""},{"$f":"IFERROR(INDEX('Měsíční rekapitulace'!E$3:E$999,MATCH(A71,'Měsíční rekapitulace'!A$3:A$999,)),\"\")","v":""},null,{"$f":"IF($A71=\"\",,SUMPRODUCT((LOOKUP(ROW(D$1:D$997),ROW(D$1:D$997)/ISNUMBER('Měsíční rekapitulace'!$L$1:$L$997),'Měsíční rekapitulace'!$L$1:$L$997)=D$4)*('Měsíční rekapitulace'!$A$3:$A$999=$A71)*TEXT('Měsíční rekapitulace'!$Q$3:$Q$999,\"0,0;0;0;\\0\")))","v":0},{"$f":"IF($A71=\"\",,SUMPRODUCT((LOOKUP(ROW(E$1:E$997),ROW(E$1:E$997)/ISNUMBER('Měsíční rekapitulace'!$L$1:$L$997),'Měsíční rekapitulace'!$L$1:$L$997)=E$4)*('Měsíční rekapitulace'!$A$3:$A$999=$A71)*TEXT('Měsíční rekapitulace'!$Q$3:$Q$999,\"0,0;0;0;\\0\")))","v":0},{"$f":"IF($A71=\"\",,SUMPRODUCT((LOOKUP(ROW(F$1:F$997),ROW(F$1:F$997)/ISNUMBER('Měsíční rekapitulace'!$L$1:$L$997),'Měsíční rekapitulace'!$L$1:$L$997)=F$4)*('Měsíční rekapitulace'!$A$3:$A$999=$A71)*TEXT('Měsíční rekapitulace'!$Q$3:$Q$999,\"0,0;0;0;\\0\")))","v":0},{"$f":"IF($A71=\"\",,SUMPRODUCT((LOOKUP(ROW(G$1:G$997),ROW(G$1:G$997)/ISNUMBER('Měsíční rekapitulace'!$L$1:$L$997),'Měsíční rekapitulace'!$L$1:$L$997)=G$4)*('Měsíční rekapitulace'!$A$3:$A$999=$A71)*TEXT('Měsíční rekapitulace'!$Q$3:$Q$999,\"0,0;0;0;\\0\")))","v":0},{"$f":"IF($A71=\"\",,SUMPRODUCT((LOOKUP(ROW(H$1:H$997),ROW(H$1:H$997)/ISNUMBER('Měsíční rekapitulace'!$L$1:$L$997),'Měsíční rekapitulace'!$L$1:$L$997)=H$4)*('Měsíční rekapitulace'!$A$3:$A$999=$A71)*TEXT('Měsíční rekapitulace'!$Q$3:$Q$999,\"0,0;0;0;\\0\")))","v":0},{"$f":"IF($A71=\"\",,SUMPRODUCT((LOOKUP(ROW(I$1:I$997),ROW(I$1:I$997)/ISNUMBER('Měsíční rekapitulace'!$L$1:$L$997),'Měsíční rekapitulace'!$L$1:$L$997)=I$4)*('Měsíční rekapitulace'!$A$3:$A$999=$A71)*TEXT('Měsíční rekapitulace'!$Q$3:$Q$999,\"0,0;0;0;\\0\")))","v":0},{"$f":"IF($A71=\"\",,SUMPRODUCT((LOOKUP(ROW(J$1:J$997),ROW(J$1:J$997)/ISNUMBER('Měsíční rekapitulace'!$L$1:$L$997),'Měsíční rekapitulace'!$L$1:$L$997)=J$4)*('Měsíční rekapitulace'!$A$3:$A$999=$A71)*TEXT('Měsíční rekapitulace'!$Q$3:$Q$999,\"0,0;0;0;\\0\")))","v":0},{"$f":"IF($A71=\"\",,SUMPRODUCT((LOOKUP(ROW(K$1:K$997),ROW(K$1:K$997)/ISNUMBER('Měsíční rekapitulace'!$L$1:$L$997),'Měsíční rekapitulace'!$L$1:$L$997)=K$4)*('Měsíční rekapitulace'!$A$3:$A$999=$A71)*TEXT('Měsíční rekapitulace'!$Q$3:$Q$999,\"0,0;0;0;\\0\")))","v":0},{"$f":"IF($A71=\"\",,SUMPRODUCT((LOOKUP(ROW(L$1:L$997),ROW(L$1:L$997)/ISNUMBER('Měsíční rekapitulace'!$L$1:$L$997),'Měsíční rekapitulace'!$L$1:$L$997)=L$4)*('Měsíční rekapitulace'!$A$3:$A$999=$A71)*TEXT('Měsíční rekapitulace'!$Q$3:$Q$999,\"0,0;0;0;\\0\")))","v":0},{"$f":"IF($A71=\"\",,SUMPRODUCT((LOOKUP(ROW(M$1:M$997),ROW(M$1:M$997)/ISNUMBER('Měsíční rekapitulace'!$L$1:$L$997),'Měsíční rekapitulace'!$L$1:$L$997)=M$4)*('Měsíční rekapitulace'!$A$3:$A$999=$A71)*TEXT('Měsíční rekapitulace'!$Q$3:$Q$999,\"0,0;0;0;\\0\")))","v":0},{"$f":"IF($A71=\"\",,SUMPRODUCT((LOOKUP(ROW(N$1:N$997),ROW(N$1:N$997)/ISNUMBER('Měsíční rekapitulace'!$L$1:$L$997),'Měsíční rekapitulace'!$L$1:$L$997)=N$4)*('Měsíční rekapitulace'!$A$3:$A$999=$A71)*TEXT('Měsíční rekapitulace'!$Q$3:$Q$999,\"0,0;0;0;\\0\")))","v":0},{"$f":"IF($A71=\"\",,SUMPRODUCT((LOOKUP(ROW(O$1:O$997),ROW(O$1:O$997)/ISNUMBER('Měsíční rekapitulace'!$L$1:$L$997),'Měsíční rekapitulace'!$L$1:$L$997)=O$4)*('Měsíční rekapitulace'!$A$3:$A$999=$A71)*TEXT('Měsíční rekapitulace'!$Q$3:$Q$999,\"0,0;0;0;\\0\")))","v":0},0]
[{"$f":"IFERROR(INDEX('Měsíční rekapitulace'!A$3:A$999,SMALL(IF(('Měsíční rekapitulace'!A$3:A$999<>\"\")*('Měsíční rekapitulace'!A$3:A$999<>'Měsíční rekapitulace'!$A$2)*(COUNTIF(A$5:A71,'Měsíční rekapitulace'!A$3:A$999)=0),ROW('Měsíční rekapitulace'!A$3:A$999)-2),1)),\"\")","v":""},{"$f":"IFERROR(INDEX('Měsíční rekapitulace'!E$3:E$999,MATCH(A72,'Měsíční rekapitulace'!A$3:A$999,)),\"\")","v":""},null,{"$f":"IF($A72=\"\",,SUMPRODUCT((LOOKUP(ROW(D$1:D$997),ROW(D$1:D$997)/ISNUMBER('Měsíční rekapitulace'!$L$1:$L$997),'Měsíční rekapitulace'!$L$1:$L$997)=D$4)*('Měsíční rekapitulace'!$A$3:$A$999=$A72)*TEXT('Měsíční rekapitulace'!$Q$3:$Q$999,\"0,0;0;0;\\0\")))","v":0},{"$f":"IF($A72=\"\",,SUMPRODUCT((LOOKUP(ROW(E$1:E$997),ROW(E$1:E$997)/ISNUMBER('Měsíční rekapitulace'!$L$1:$L$997),'Měsíční rekapitulace'!$L$1:$L$997)=E$4)*('Měsíční rekapitulace'!$A$3:$A$999=$A72)*TEXT('Měsíční rekapitulace'!$Q$3:$Q$999,\"0,0;0;0;\\0\")))","v":0},{"$f":"IF($A72=\"\",,SUMPRODUCT((LOOKUP(ROW(F$1:F$997),ROW(F$1:F$997)/ISNUMBER('Měsíční rekapitulace'!$L$1:$L$997),'Měsíční rekapitulace'!$L$1:$L$997)=F$4)*('Měsíční rekapitulace'!$A$3:$A$999=$A72)*TEXT('Měsíční rekapitulace'!$Q$3:$Q$999,\"0,0;0;0;\\0\")))","v":0},{"$f":"IF($A72=\"\",,SUMPRODUCT((LOOKUP(ROW(G$1:G$997),ROW(G$1:G$997)/ISNUMBER('Měsíční rekapitulace'!$L$1:$L$997),'Měsíční rekapitulace'!$L$1:$L$997)=G$4)*('Měsíční rekapitulace'!$A$3:$A$999=$A72)*TEXT('Měsíční rekapitulace'!$Q$3:$Q$999,\"0,0;0;0;\\0\")))","v":0},{"$f":"IF($A72=\"\",,SUMPRODUCT((LOOKUP(ROW(H$1:H$997),ROW(H$1:H$997)/ISNUMBER('Měsíční rekapitulace'!$L$1:$L$997),'Měsíční rekapitulace'!$L$1:$L$997)=H$4)*('Měsíční rekapitulace'!$A$3:$A$999=$A72)*TEXT('Měsíční rekapitulace'!$Q$3:$Q$999,\"0,0;0;0;\\0\")))","v":0},{"$f":"IF($A72=\"\",,SUMPRODUCT((LOOKUP(ROW(I$1:I$997),ROW(I$1:I$997)/ISNUMBER('Měsíční rekapitulace'!$L$1:$L$997),'Měsíční rekapitulace'!$L$1:$L$997)=I$4)*('Měsíční rekapitulace'!$A$3:$A$999=$A72)*TEXT('Měsíční rekapitulace'!$Q$3:$Q$999,\"0,0;0;0;\\0\")))","v":0},{"$f":"IF($A72=\"\",,SUMPRODUCT((LOOKUP(ROW(J$1:J$997),ROW(J$1:J$997)/ISNUMBER('Měsíční rekapitulace'!$L$1:$L$997),'Měsíční rekapitulace'!$L$1:$L$997)=J$4)*('Měsíční rekapitulace'!$A$3:$A$999=$A72)*TEXT('Měsíční rekapitulace'!$Q$3:$Q$999,\"0,0;0;0;\\0\")))","v":0},{"$f":"IF($A72=\"\",,SUMPRODUCT((LOOKUP(ROW(K$1:K$997),ROW(K$1:K$997)/ISNUMBER('Měsíční rekapitulace'!$L$1:$L$997),'Měsíční rekapitulace'!$L$1:$L$997)=K$4)*('Měsíční rekapitulace'!$A$3:$A$999=$A72)*TEXT('Měsíční rekapitulace'!$Q$3:$Q$999,\"0,0;0;0;\\0\")))","v":0},{"$f":"IF($A72=\"\",,SUMPRODUCT((LOOKUP(ROW(L$1:L$997),ROW(L$1:L$997)/ISNUMBER('Měsíční rekapitulace'!$L$1:$L$997),'Měsíční rekapitulace'!$L$1:$L$997)=L$4)*('Měsíční rekapitulace'!$A$3:$A$999=$A72)*TEXT('Měsíční rekapitulace'!$Q$3:$Q$999,\"0,0;0;0;\\0\")))","v":0},{"$f":"IF($A72=\"\",,SUMPRODUCT((LOOKUP(ROW(M$1:M$997),ROW(M$1:M$997)/ISNUMBER('Měsíční rekapitulace'!$L$1:$L$997),'Měsíční rekapitulace'!$L$1:$L$997)=M$4)*('Měsíční rekapitulace'!$A$3:$A$999=$A72)*TEXT('Měsíční rekapitulace'!$Q$3:$Q$999,\"0,0;0;0;\\0\")))","v":0},{"$f":"IF($A72=\"\",,SUMPRODUCT((LOOKUP(ROW(N$1:N$997),ROW(N$1:N$997)/ISNUMBER('Měsíční rekapitulace'!$L$1:$L$997),'Měsíční rekapitulace'!$L$1:$L$997)=N$4)*('Měsíční rekapitulace'!$A$3:$A$999=$A72)*TEXT('Měsíční rekapitulace'!$Q$3:$Q$999,\"0,0;0;0;\\0\")))","v":0},{"$f":"IF($A72=\"\",,SUMPRODUCT((LOOKUP(ROW(O$1:O$997),ROW(O$1:O$997)/ISNUMBER('Měsíční rekapitulace'!$L$1:$L$997),'Měsíční rekapitulace'!$L$1:$L$997)=O$4)*('Měsíční rekapitulace'!$A$3:$A$999=$A72)*TEXT('Měsíční rekapitulace'!$Q$3:$Q$999,\"0,0;0;0;\\0\")))","v":0},0]
[{"$f":"IFERROR(INDEX('Měsíční rekapitulace'!A$3:A$999,SMALL(IF(('Měsíční rekapitulace'!A$3:A$999<>\"\")*('Měsíční rekapitulace'!A$3:A$999<>'Měsíční rekapitulace'!$A$2)*(COUNTIF(A$5:A72,'Měsíční rekapitulace'!A$3:A$999)=0),ROW('Měsíční rekapitulace'!A$3:A$999)-2),1)),\"\")","v":""},{"$f":"IFERROR(INDEX('Měsíční rekapitulace'!E$3:E$999,MATCH(A73,'Měsíční rekapitulace'!A$3:A$999,)),\"\")","v":""},null,{"$f":"IF($A73=\"\",,SUMPRODUCT((LOOKUP(ROW(D$1:D$997),ROW(D$1:D$997)/ISNUMBER('Měsíční rekapitulace'!$L$1:$L$997),'Měsíční rekapitulace'!$L$1:$L$997)=D$4)*('Měsíční rekapitulace'!$A$3:$A$999=$A73)*TEXT('Měsíční rekapitulace'!$Q$3:$Q$999,\"0,0;0;0;\\0\")))","v":0},{"$f":"IF($A73=\"\",,SUMPRODUCT((LOOKUP(ROW(E$1:E$997),ROW(E$1:E$997)/ISNUMBER('Měsíční rekapitulace'!$L$1:$L$997),'Měsíční rekapitulace'!$L$1:$L$997)=E$4)*('Měsíční rekapitulace'!$A$3:$A$999=$A73)*TEXT('Měsíční rekapitulace'!$Q$3:$Q$999,\"0,0;0;0;\\0\")))","v":0},{"$f":"IF($A73=\"\",,SUMPRODUCT((LOOKUP(ROW(F$1:F$997),ROW(F$1:F$997)/ISNUMBER('Měsíční rekapitulace'!$L$1:$L$997),'Měsíční rekapitulace'!$L$1:$L$997)=F$4)*('Měsíční rekapitulace'!$A$3:$A$999=$A73)*TEXT('Měsíční rekapitulace'!$Q$3:$Q$999,\"0,0;0;0;\\0\")))","v":0},{"$f":"IF($A73=\"\",,SUMPRODUCT((LOOKUP(ROW(G$1:G$997),ROW(G$1:G$997)/ISNUMBER('Měsíční rekapitulace'!$L$1:$L$997),'Měsíční rekapitulace'!$L$1:$L$997)=G$4)*('Měsíční rekapitulace'!$A$3:$A$999=$A73)*TEXT('Měsíční rekapitulace'!$Q$3:$Q$999,\"0,0;0;0;\\0\")))","v":0},{"$f":"IF($A73=\"\",,SUMPRODUCT((LOOKUP(ROW(H$1:H$997),ROW(H$1:H$997)/ISNUMBER('Měsíční rekapitulace'!$L$1:$L$997),'Měsíční rekapitulace'!$L$1:$L$997)=H$4)*('Měsíční rekapitulace'!$A$3:$A$999=$A73)*TEXT('Měsíční rekapitulace'!$Q$3:$Q$999,\"0,0;0;0;\\0\")))","v":0},{"$f":"IF($A73=\"\",,SUMPRODUCT((LOOKUP(ROW(I$1:I$997),ROW(I$1:I$997)/ISNUMBER('Měsíční rekapitulace'!$L$1:$L$997),'Měsíční rekapitulace'!$L$1:$L$997)=I$4)*('Měsíční rekapitulace'!$A$3:$A$999=$A73)*TEXT('Měsíční rekapitulace'!$Q$3:$Q$999,\"0,0;0;0;\\0\")))","v":0},{"$f":"IF($A73=\"\",,SUMPRODUCT((LOOKUP(ROW(J$1:J$997),ROW(J$1:J$997)/ISNUMBER('Měsíční rekapitulace'!$L$1:$L$997),'Měsíční rekapitulace'!$L$1:$L$997)=J$4)*('Měsíční rekapitulace'!$A$3:$A$999=$A73)*TEXT('Měsíční rekapitulace'!$Q$3:$Q$999,\"0,0;0;0;\\0\")))","v":0},{"$f":"IF($A73=\"\",,SUMPRODUCT((LOOKUP(ROW(K$1:K$997),ROW(K$1:K$997)/ISNUMBER('Měsíční rekapitulace'!$L$1:$L$997),'Měsíční rekapitulace'!$L$1:$L$997)=K$4)*('Měsíční rekapitulace'!$A$3:$A$999=$A73)*TEXT('Měsíční rekapitulace'!$Q$3:$Q$999,\"0,0;0;0;\\0\")))","v":0},{"$f":"IF($A73=\"\",,SUMPRODUCT((LOOKUP(ROW(L$1:L$997),ROW(L$1:L$997)/ISNUMBER('Měsíční rekapitulace'!$L$1:$L$997),'Měsíční rekapitulace'!$L$1:$L$997)=L$4)*('Měsíční rekapitulace'!$A$3:$A$999=$A73)*TEXT('Měsíční rekapitulace'!$Q$3:$Q$999,\"0,0;0;0;\\0\")))","v":0},{"$f":"IF($A73=\"\",,SUMPRODUCT((LOOKUP(ROW(M$1:M$997),ROW(M$1:M$997)/ISNUMBER('Měsíční rekapitulace'!$L$1:$L$997),'Měsíční rekapitulace'!$L$1:$L$997)=M$4)*('Měsíční rekapitulace'!$A$3:$A$999=$A73)*TEXT('Měsíční rekapitulace'!$Q$3:$Q$999,\"0,0;0;0;\\0\")))","v":0},{"$f":"IF($A73=\"\",,SUMPRODUCT((LOOKUP(ROW(N$1:N$997),ROW(N$1:N$997)/ISNUMBER('Měsíční rekapitulace'!$L$1:$L$997),'Měsíční rekapitulace'!$L$1:$L$997)=N$4)*('Měsíční rekapitulace'!$A$3:$A$999=$A73)*TEXT('Měsíční rekapitulace'!$Q$3:$Q$999,\"0,0;0;0;\\0\")))","v":0},{"$f":"IF($A73=\"\",,SUMPRODUCT((LOOKUP(ROW(O$1:O$997),ROW(O$1:O$997)/ISNUMBER('Měsíční rekapitulace'!$L$1:$L$997),'Měsíční rekapitulace'!$L$1:$L$997)=O$4)*('Měsíční rekapitulace'!$A$3:$A$999=$A73)*TEXT('Měsíční rekapitulace'!$Q$3:$Q$999,\"0,0;0;0;\\0\")))","v":0},0]
[{"$f":"IFERROR(INDEX('Měsíční rekapitulace'!A$3:A$999,SMALL(IF(('Měsíční rekapitulace'!A$3:A$999<>\"\")*('Měsíční rekapitulace'!A$3:A$999<>'Měsíční rekapitulace'!$A$2)*(COUNTIF(A$5:A73,'Měsíční rekapitulace'!A$3:A$999)=0),ROW('Měsíční rekapitulace'!A$3:A$999)-2),1)),\"\")","v":""},{"$f":"IFERROR(INDEX('Měsíční rekapitulace'!E$3:E$999,MATCH(A74,'Měsíční rekapitulace'!A$3:A$999,)),\"\")","v":""},null,{"$f":"IF($A74=\"\",,SUMPRODUCT((LOOKUP(ROW(D$1:D$997),ROW(D$1:D$997)/ISNUMBER('Měsíční rekapitulace'!$L$1:$L$997),'Měsíční rekapitulace'!$L$1:$L$997)=D$4)*('Měsíční rekapitulace'!$A$3:$A$999=$A74)*TEXT('Měsíční rekapitulace'!$Q$3:$Q$999,\"0,0;0;0;\\0\")))","v":0},{"$f":"IF($A74=\"\",,SUMPRODUCT((LOOKUP(ROW(E$1:E$997),ROW(E$1:E$997)/ISNUMBER('Měsíční rekapitulace'!$L$1:$L$997),'Měsíční rekapitulace'!$L$1:$L$997)=E$4)*('Měsíční rekapitulace'!$A$3:$A$999=$A74)*TEXT('Měsíční rekapitulace'!$Q$3:$Q$999,\"0,0;0;0;\\0\")))","v":0},{"$f":"IF($A74=\"\",,SUMPRODUCT((LOOKUP(ROW(F$1:F$997),ROW(F$1:F$997)/ISNUMBER('Měsíční rekapitulace'!$L$1:$L$997),'Měsíční rekapitulace'!$L$1:$L$997)=F$4)*('Měsíční rekapitulace'!$A$3:$A$999=$A74)*TEXT('Měsíční rekapitulace'!$Q$3:$Q$999,\"0,0;0;0;\\0\")))","v":0},{"$f":"IF($A74=\"\",,SUMPRODUCT((LOOKUP(ROW(G$1:G$997),ROW(G$1:G$997)/ISNUMBER('Měsíční rekapitulace'!$L$1:$L$997),'Měsíční rekapitulace'!$L$1:$L$997)=G$4)*('Měsíční rekapitulace'!$A$3:$A$999=$A74)*TEXT('Měsíční rekapitulace'!$Q$3:$Q$999,\"0,0;0;0;\\0\")))","v":0},{"$f":"IF($A74=\"\",,SUMPRODUCT((LOOKUP(ROW(H$1:H$997),ROW(H$1:H$997)/ISNUMBER('Měsíční rekapitulace'!$L$1:$L$997),'Měsíční rekapitulace'!$L$1:$L$997)=H$4)*('Měsíční rekapitulace'!$A$3:$A$999=$A74)*TEXT('Měsíční rekapitulace'!$Q$3:$Q$999,\"0,0;0;0;\\0\")))","v":0},{"$f":"IF($A74=\"\",,SUMPRODUCT((LOOKUP(ROW(I$1:I$997),ROW(I$1:I$997)/ISNUMBER('Měsíční rekapitulace'!$L$1:$L$997),'Měsíční rekapitulace'!$L$1:$L$997)=I$4)*('Měsíční rekapitulace'!$A$3:$A$999=$A74)*TEXT('Měsíční rekapitulace'!$Q$3:$Q$999,\"0,0;0;0;\\0\")))","v":0},{"$f":"IF($A74=\"\",,SUMPRODUCT((LOOKUP(ROW(J$1:J$997),ROW(J$1:J$997)/ISNUMBER('Měsíční rekapitulace'!$L$1:$L$997),'Měsíční rekapitulace'!$L$1:$L$997)=J$4)*('Měsíční rekapitulace'!$A$3:$A$999=$A74)*TEXT('Měsíční rekapitulace'!$Q$3:$Q$999,\"0,0;0;0;\\0\")))","v":0},{"$f":"IF($A74=\"\",,SUMPRODUCT((LOOKUP(ROW(K$1:K$997),ROW(K$1:K$997)/ISNUMBER('Měsíční rekapitulace'!$L$1:$L$997),'Měsíční rekapitulace'!$L$1:$L$997)=K$4)*('Měsíční rekapitulace'!$A$3:$A$999=$A74)*TEXT('Měsíční rekapitulace'!$Q$3:$Q$999,\"0,0;0;0;\\0\")))","v":0},{"$f":"IF($A74=\"\",,SUMPRODUCT((LOOKUP(ROW(L$1:L$997),ROW(L$1:L$997)/ISNUMBER('Měsíční rekapitulace'!$L$1:$L$997),'Měsíční rekapitulace'!$L$1:$L$997)=L$4)*('Měsíční rekapitulace'!$A$3:$A$999=$A74)*TEXT('Měsíční rekapitulace'!$Q$3:$Q$999,\"0,0;0;0;\\0\")))","v":0},{"$f":"IF($A74=\"\",,SUMPRODUCT((LOOKUP(ROW(M$1:M$997),ROW(M$1:M$997)/ISNUMBER('Měsíční rekapitulace'!$L$1:$L$997),'Měsíční rekapitulace'!$L$1:$L$997)=M$4)*('Měsíční rekapitulace'!$A$3:$A$999=$A74)*TEXT('Měsíční rekapitulace'!$Q$3:$Q$999,\"0,0;0;0;\\0\")))","v":0},{"$f":"IF($A74=\"\",,SUMPRODUCT((LOOKUP(ROW(N$1:N$997),ROW(N$1:N$997)/ISNUMBER('Měsíční rekapitulace'!$L$1:$L$997),'Měsíční rekapitulace'!$L$1:$L$997)=N$4)*('Měsíční rekapitulace'!$A$3:$A$999=$A74)*TEXT('Měsíční rekapitulace'!$Q$3:$Q$999,\"0,0;0;0;\\0\")))","v":0},{"$f":"IF($A74=\"\",,SUMPRODUCT((LOOKUP(ROW(O$1:O$997),ROW(O$1:O$997)/ISNUMBER('Měsíční rekapitulace'!$L$1:$L$997),'Měsíční rekapitulace'!$L$1:$L$997)=O$4)*('Měsíční rekapitulace'!$A$3:$A$999=$A74)*TEXT('Měsíční rekapitulace'!$Q$3:$Q$999,\"0,0;0;0;\\0\")))","v":0},0]
[{"$f":"IFERROR(INDEX('Měsíční rekapitulace'!A$3:A$999,SMALL(IF(('Měsíční rekapitulace'!A$3:A$999<>\"\")*('Měsíční rekapitulace'!A$3:A$999<>'Měsíční rekapitulace'!$A$2)*(COUNTIF(A$5:A74,'Měsíční rekapitulace'!A$3:A$999)=0),ROW('Měsíční rekapitulace'!A$3:A$999)-2),1)),\"\")","v":""},{"$f":"IFERROR(INDEX('Měsíční rekapitulace'!E$3:E$999,MATCH(A75,'Měsíční rekapitulace'!A$3:A$999,)),\"\")","v":""},null,{"$f":"IF($A75=\"\",,SUMPRODUCT((LOOKUP(ROW(D$1:D$997),ROW(D$1:D$997)/ISNUMBER('Měsíční rekapitulace'!$L$1:$L$997),'Měsíční rekapitulace'!$L$1:$L$997)=D$4)*('Měsíční rekapitulace'!$A$3:$A$999=$A75)*TEXT('Měsíční rekapitulace'!$Q$3:$Q$999,\"0,0;0;0;\\0\")))","v":0},{"$f":"IF($A75=\"\",,SUMPRODUCT((LOOKUP(ROW(E$1:E$997),ROW(E$1:E$997)/ISNUMBER('Měsíční rekapitulace'!$L$1:$L$997),'Měsíční rekapitulace'!$L$1:$L$997)=E$4)*('Měsíční rekapitulace'!$A$3:$A$999=$A75)*TEXT('Měsíční rekapitulace'!$Q$3:$Q$999,\"0,0;0;0;\\0\")))","v":0},{"$f":"IF($A75=\"\",,SUMPRODUCT((LOOKUP(ROW(F$1:F$997),ROW(F$1:F$997)/ISNUMBER('Měsíční rekapitulace'!$L$1:$L$997),'Měsíční rekapitulace'!$L$1:$L$997)=F$4)*('Měsíční rekapitulace'!$A$3:$A$999=$A75)*TEXT('Měsíční rekapitulace'!$Q$3:$Q$999,\"0,0;0;0;\\0\")))","v":0},{"$f":"IF($A75=\"\",,SUMPRODUCT((LOOKUP(ROW(G$1:G$997),ROW(G$1:G$997)/ISNUMBER('Měsíční rekapitulace'!$L$1:$L$997),'Měsíční rekapitulace'!$L$1:$L$997)=G$4)*('Měsíční rekapitulace'!$A$3:$A$999=$A75)*TEXT('Měsíční rekapitulace'!$Q$3:$Q$999,\"0,0;0;0;\\0\")))","v":0},{"$f":"IF($A75=\"\",,SUMPRODUCT((LOOKUP(ROW(H$1:H$997),ROW(H$1:H$997)/ISNUMBER('Měsíční rekapitulace'!$L$1:$L$997),'Měsíční rekapitulace'!$L$1:$L$997)=H$4)*('Měsíční rekapitulace'!$A$3:$A$999=$A75)*TEXT('Měsíční rekapitulace'!$Q$3:$Q$999,\"0,0;0;0;\\0\")))","v":0},{"$f":"IF($A75=\"\",,SUMPRODUCT((LOOKUP(ROW(I$1:I$997),ROW(I$1:I$997)/ISNUMBER('Měsíční rekapitulace'!$L$1:$L$997),'Měsíční rekapitulace'!$L$1:$L$997)=I$4)*('Měsíční rekapitulace'!$A$3:$A$999=$A75)*TEXT('Měsíční rekapitulace'!$Q$3:$Q$999,\"0,0;0;0;\\0\")))","v":0},{"$f":"IF($A75=\"\",,SUMPRODUCT((LOOKUP(ROW(J$1:J$997),ROW(J$1:J$997)/ISNUMBER('Měsíční rekapitulace'!$L$1:$L$997),'Měsíční rekapitulace'!$L$1:$L$997)=J$4)*('Měsíční rekapitulace'!$A$3:$A$999=$A75)*TEXT('Měsíční rekapitulace'!$Q$3:$Q$999,\"0,0;0;0;\\0\")))","v":0},{"$f":"IF($A75=\"\",,SUMPRODUCT((LOOKUP(ROW(K$1:K$997),ROW(K$1:K$997)/ISNUMBER('Měsíční rekapitulace'!$L$1:$L$997),'Měsíční rekapitulace'!$L$1:$L$997)=K$4)*('Měsíční rekapitulace'!$A$3:$A$999=$A75)*TEXT('Měsíční rekapitulace'!$Q$3:$Q$999,\"0,0;0;0;\\0\")))","v":0},{"$f":"IF($A75=\"\",,SUMPRODUCT((LOOKUP(ROW(L$1:L$997),ROW(L$1:L$997)/ISNUMBER('Měsíční rekapitulace'!$L$1:$L$997),'Měsíční rekapitulace'!$L$1:$L$997)=L$4)*('Měsíční rekapitulace'!$A$3:$A$999=$A75)*TEXT('Měsíční rekapitulace'!$Q$3:$Q$999,\"0,0;0;0;\\0\")))","v":0},{"$f":"IF($A75=\"\",,SUMPRODUCT((LOOKUP(ROW(M$1:M$997),ROW(M$1:M$997)/ISNUMBER('Měsíční rekapitulace'!$L$1:$L$997),'Měsíční rekapitulace'!$L$1:$L$997)=M$4)*('Měsíční rekapitulace'!$A$3:$A$999=$A75)*TEXT('Měsíční rekapitulace'!$Q$3:$Q$999,\"0,0;0;0;\\0\")))","v":0},{"$f":"IF($A75=\"\",,SUMPRODUCT((LOOKUP(ROW(N$1:N$997),ROW(N$1:N$997)/ISNUMBER('Měsíční rekapitulace'!$L$1:$L$997),'Měsíční rekapitulace'!$L$1:$L$997)=N$4)*('Měsíční rekapitulace'!$A$3:$A$999=$A75)*TEXT('Měsíční rekapitulace'!$Q$3:$Q$999,\"0,0;0;0;\\0\")))","v":0},{"$f":"IF($A75=\"\",,SUMPRODUCT((LOOKUP(ROW(O$1:O$997),ROW(O$1:O$997)/ISNUMBER('Měsíční rekapitulace'!$L$1:$L$997),'Měsíční rekapitulace'!$L$1:$L$997)=O$4)*('Měsíční rekapitulace'!$A$3:$A$999=$A75)*TEXT('Měsíční rekapitulace'!$Q$3:$Q$999,\"0,0;0;0;\\0\")))","v":0},0]
[{"$f":"IFERROR(INDEX('Měsíční rekapitulace'!A$3:A$999,SMALL(IF(('Měsíční rekapitulace'!A$3:A$999<>\"\")*('Měsíční rekapitulace'!A$3:A$999<>'Měsíční rekapitulace'!$A$2)*(COUNTIF(A$5:A75,'Měsíční rekapitulace'!A$3:A$999)=0),ROW('Měsíční rekapitulace'!A$3:A$999)-2),1)),\"\")","v":""},{"$f":"IFERROR(INDEX('Měsíční rekapitulace'!E$3:E$999,MATCH(A76,'Měsíční rekapitulace'!A$3:A$999,)),\"\")","v":""},null,{"$f":"IF($A76=\"\",,SUMPRODUCT((LOOKUP(ROW(D$1:D$997),ROW(D$1:D$997)/ISNUMBER('Měsíční rekapitulace'!$L$1:$L$997),'Měsíční rekapitulace'!$L$1:$L$997)=D$4)*('Měsíční rekapitulace'!$A$3:$A$999=$A76)*TEXT('Měsíční rekapitulace'!$Q$3:$Q$999,\"0,0;0;0;\\0\")))","v":0},{"$f":"IF($A76=\"\",,SUMPRODUCT((LOOKUP(ROW(E$1:E$997),ROW(E$1:E$997)/ISNUMBER('Měsíční rekapitulace'!$L$1:$L$997),'Měsíční rekapitulace'!$L$1:$L$997)=E$4)*('Měsíční rekapitulace'!$A$3:$A$999=$A76)*TEXT('Měsíční rekapitulace'!$Q$3:$Q$999,\"0,0;0;0;\\0\")))","v":0},{"$f":"IF($A76=\"\",,SUMPRODUCT((LOOKUP(ROW(F$1:F$997),ROW(F$1:F$997)/ISNUMBER('Měsíční rekapitulace'!$L$1:$L$997),'Měsíční rekapitulace'!$L$1:$L$997)=F$4)*('Měsíční rekapitulace'!$A$3:$A$999=$A76)*TEXT('Měsíční rekapitulace'!$Q$3:$Q$999,\"0,0;0;0;\\0\")))","v":0},{"$f":"IF($A76=\"\",,SUMPRODUCT((LOOKUP(ROW(G$1:G$997),ROW(G$1:G$997)/ISNUMBER('Měsíční rekapitulace'!$L$1:$L$997),'Měsíční rekapitulace'!$L$1:$L$997)=G$4)*('Měsíční rekapitulace'!$A$3:$A$999=$A76)*TEXT('Měsíční rekapitulace'!$Q$3:$Q$999,\"0,0;0;0;\\0\")))","v":0},{"$f":"IF($A76=\"\",,SUMPRODUCT((LOOKUP(ROW(H$1:H$997),ROW(H$1:H$997)/ISNUMBER('Měsíční rekapitulace'!$L$1:$L$997),'Měsíční rekapitulace'!$L$1:$L$997)=H$4)*('Měsíční rekapitulace'!$A$3:$A$999=$A76)*TEXT('Měsíční rekapitulace'!$Q$3:$Q$999,\"0,0;0;0;\\0\")))","v":0},{"$f":"IF($A76=\"\",,SUMPRODUCT((LOOKUP(ROW(I$1:I$997),ROW(I$1:I$997)/ISNUMBER('Měsíční rekapitulace'!$L$1:$L$997),'Měsíční rekapitulace'!$L$1:$L$997)=I$4)*('Měsíční rekapitulace'!$A$3:$A$999=$A76)*TEXT('Měsíční rekapitulace'!$Q$3:$Q$999,\"0,0;0;0;\\0\")))","v":0},{"$f":"IF($A76=\"\",,SUMPRODUCT((LOOKUP(ROW(J$1:J$997),ROW(J$1:J$997)/ISNUMBER('Měsíční rekapitulace'!$L$1:$L$997),'Měsíční rekapitulace'!$L$1:$L$997)=J$4)*('Měsíční rekapitulace'!$A$3:$A$999=$A76)*TEXT('Měsíční rekapitulace'!$Q$3:$Q$999,\"0,0;0;0;\\0\")))","v":0},{"$f":"IF($A76=\"\",,SUMPRODUCT((LOOKUP(ROW(K$1:K$997),ROW(K$1:K$997)/ISNUMBER('Měsíční rekapitulace'!$L$1:$L$997),'Měsíční rekapitulace'!$L$1:$L$997)=K$4)*('Měsíční rekapitulace'!$A$3:$A$999=$A76)*TEXT('Měsíční rekapitulace'!$Q$3:$Q$999,\"0,0;0;0;\\0\")))","v":0},{"$f":"IF($A76=\"\",,SUMPRODUCT((LOOKUP(ROW(L$1:L$997),ROW(L$1:L$997)/ISNUMBER('Měsíční rekapitulace'!$L$1:$L$997),'Měsíční rekapitulace'!$L$1:$L$997)=L$4)*('Měsíční rekapitulace'!$A$3:$A$999=$A76)*TEXT('Měsíční rekapitulace'!$Q$3:$Q$999,\"0,0;0;0;\\0\")))","v":0},{"$f":"IF($A76=\"\",,SUMPRODUCT((LOOKUP(ROW(M$1:M$997),ROW(M$1:M$997)/ISNUMBER('Měsíční rekapitulace'!$L$1:$L$997),'Měsíční rekapitulace'!$L$1:$L$997)=M$4)*('Měsíční rekapitulace'!$A$3:$A$999=$A76)*TEXT('Měsíční rekapitulace'!$Q$3:$Q$999,\"0,0;0;0;\\0\")))","v":0},{"$f":"IF($A76=\"\",,SUMPRODUCT((LOOKUP(ROW(N$1:N$997),ROW(N$1:N$997)/ISNUMBER('Měsíční rekapitulace'!$L$1:$L$997),'Měsíční rekapitulace'!$L$1:$L$997)=N$4)*('Měsíční rekapitulace'!$A$3:$A$999=$A76)*TEXT('Měsíční rekapitulace'!$Q$3:$Q$999,\"0,0;0;0;\\0\")))","v":0},{"$f":"IF($A76=\"\",,SUMPRODUCT((LOOKUP(ROW(O$1:O$997),ROW(O$1:O$997)/ISNUMBER('Měsíční rekapitulace'!$L$1:$L$997),'Měsíční rekapitulace'!$L$1:$L$997)=O$4)*('Měsíční rekapitulace'!$A$3:$A$999=$A76)*TEXT('Měsíční rekapitulace'!$Q$3:$Q$999,\"0,0;0;0;\\0\")))","v":0},0]
[{"$f":"IFERROR(INDEX('Měsíční rekapitulace'!A$3:A$999,SMALL(IF(('Měsíční rekapitulace'!A$3:A$999<>\"\")*('Měsíční rekapitulace'!A$3:A$999<>'Měsíční rekapitulace'!$A$2)*(COUNTIF(A$5:A76,'Měsíční rekapitulace'!A$3:A$999)=0),ROW('Měsíční rekapitulace'!A$3:A$999)-2),1)),\"\")","v":""},{"$f":"IFERROR(INDEX('Měsíční rekapitulace'!E$3:E$999,MATCH(A77,'Měsíční rekapitulace'!A$3:A$999,)),\"\")","v":""},null,{"$f":"IF($A77=\"\",,SUMPRODUCT((LOOKUP(ROW(D$1:D$997),ROW(D$1:D$997)/ISNUMBER('Měsíční rekapitulace'!$L$1:$L$997),'Měsíční rekapitulace'!$L$1:$L$997)=D$4)*('Měsíční rekapitulace'!$A$3:$A$999=$A77)*TEXT('Měsíční rekapitulace'!$Q$3:$Q$999,\"0,0;0;0;\\0\")))","v":0},{"$f":"IF($A77=\"\",,SUMPRODUCT((LOOKUP(ROW(E$1:E$997),ROW(E$1:E$997)/ISNUMBER('Měsíční rekapitulace'!$L$1:$L$997),'Měsíční rekapitulace'!$L$1:$L$997)=E$4)*('Měsíční rekapitulace'!$A$3:$A$999=$A77)*TEXT('Měsíční rekapitulace'!$Q$3:$Q$999,\"0,0;0;0;\\0\")))","v":0},{"$f":"IF($A77=\"\",,SUMPRODUCT((LOOKUP(ROW(F$1:F$997),ROW(F$1:F$997)/ISNUMBER('Měsíční rekapitulace'!$L$1:$L$997),'Měsíční rekapitulace'!$L$1:$L$997)=F$4)*('Měsíční rekapitulace'!$A$3:$A$999=$A77)*TEXT('Měsíční rekapitulace'!$Q$3:$Q$999,\"0,0;0;0;\\0\")))","v":0},{"$f":"IF($A77=\"\",,SUMPRODUCT((LOOKUP(ROW(G$1:G$997),ROW(G$1:G$997)/ISNUMBER('Měsíční rekapitulace'!$L$1:$L$997),'Měsíční rekapitulace'!$L$1:$L$997)=G$4)*('Měsíční rekapitulace'!$A$3:$A$999=$A77)*TEXT('Měsíční rekapitulace'!$Q$3:$Q$999,\"0,0;0;0;\\0\")))","v":0},{"$f":"IF($A77=\"\",,SUMPRODUCT((LOOKUP(ROW(H$1:H$997),ROW(H$1:H$997)/ISNUMBER('Měsíční rekapitulace'!$L$1:$L$997),'Měsíční rekapitulace'!$L$1:$L$997)=H$4)*('Měsíční rekapitulace'!$A$3:$A$999=$A77)*TEXT('Měsíční rekapitulace'!$Q$3:$Q$999,\"0,0;0;0;\\0\")))","v":0},{"$f":"IF($A77=\"\",,SUMPRODUCT((LOOKUP(ROW(I$1:I$997),ROW(I$1:I$997)/ISNUMBER('Měsíční rekapitulace'!$L$1:$L$997),'Měsíční rekapitulace'!$L$1:$L$997)=I$4)*('Měsíční rekapitulace'!$A$3:$A$999=$A77)*TEXT('Měsíční rekapitulace'!$Q$3:$Q$999,\"0,0;0;0;\\0\")))","v":0},{"$f":"IF($A77=\"\",,SUMPRODUCT((LOOKUP(ROW(J$1:J$997),ROW(J$1:J$997)/ISNUMBER('Měsíční rekapitulace'!$L$1:$L$997),'Měsíční rekapitulace'!$L$1:$L$997)=J$4)*('Měsíční rekapitulace'!$A$3:$A$999=$A77)*TEXT('Měsíční rekapitulace'!$Q$3:$Q$999,\"0,0;0;0;\\0\")))","v":0},{"$f":"IF($A77=\"\",,SUMPRODUCT((LOOKUP(ROW(K$1:K$997),ROW(K$1:K$997)/ISNUMBER('Měsíční rekapitulace'!$L$1:$L$997),'Měsíční rekapitulace'!$L$1:$L$997)=K$4)*('Měsíční rekapitulace'!$A$3:$A$999=$A77)*TEXT('Měsíční rekapitulace'!$Q$3:$Q$999,\"0,0;0;0;\\0\")))","v":0},{"$f":"IF($A77=\"\",,SUMPRODUCT((LOOKUP(ROW(L$1:L$997),ROW(L$1:L$997)/ISNUMBER('Měsíční rekapitulace'!$L$1:$L$997),'Měsíční rekapitulace'!$L$1:$L$997)=L$4)*('Měsíční rekapitulace'!$A$3:$A$999=$A77)*TEXT('Měsíční rekapitulace'!$Q$3:$Q$999,\"0,0;0;0;\\0\")))","v":0},{"$f":"IF($A77=\"\",,SUMPRODUCT((LOOKUP(ROW(M$1:M$997),ROW(M$1:M$997)/ISNUMBER('Měsíční rekapitulace'!$L$1:$L$997),'Měsíční rekapitulace'!$L$1:$L$997)=M$4)*('Měsíční rekapitulace'!$A$3:$A$999=$A77)*TEXT('Měsíční rekapitulace'!$Q$3:$Q$999,\"0,0;0;0;\\0\")))","v":0},{"$f":"IF($A77=\"\",,SUMPRODUCT((LOOKUP(ROW(N$1:N$997),ROW(N$1:N$997)/ISNUMBER('Měsíční rekapitulace'!$L$1:$L$997),'Měsíční rekapitulace'!$L$1:$L$997)=N$4)*('Měsíční rekapitulace'!$A$3:$A$999=$A77)*TEXT('Měsíční rekapitulace'!$Q$3:$Q$999,\"0,0;0;0;\\0\")))","v":0},{"$f":"IF($A77=\"\",,SUMPRODUCT((LOOKUP(ROW(O$1:O$997),ROW(O$1:O$997)/ISNUMBER('Měsíční rekapitulace'!$L$1:$L$997),'Měsíční rekapitulace'!$L$1:$L$997)=O$4)*('Měsíční rekapitulace'!$A$3:$A$999=$A77)*TEXT('Měsíční rekapitulace'!$Q$3:$Q$999,\"0,0;0;0;\\0\")))","v":0},0]
[{"$f":"IFERROR(INDEX('Měsíční rekapitulace'!A$3:A$999,SMALL(IF(('Měsíční rekapitulace'!A$3:A$999<>\"\")*('Měsíční rekapitulace'!A$3:A$999<>'Měsíční rekapitulace'!$A$2)*(COUNTIF(A$5:A77,'Měsíční rekapitulace'!A$3:A$999)=0),ROW('Měsíční rekapitulace'!A$3:A$999)-2),1)),\"\")","v":""},{"$f":"IFERROR(INDEX('Měsíční rekapitulace'!E$3:E$999,MATCH(A78,'Měsíční rekapitulace'!A$3:A$999,)),\"\")","v":""},null,{"$f":"IF($A78=\"\",,SUMPRODUCT((LOOKUP(ROW(D$1:D$997),ROW(D$1:D$997)/ISNUMBER('Měsíční rekapitulace'!$L$1:$L$997),'Měsíční rekapitulace'!$L$1:$L$997)=D$4)*('Měsíční rekapitulace'!$A$3:$A$999=$A78)*TEXT('Měsíční rekapitulace'!$Q$3:$Q$999,\"0,0;0;0;\\0\")))","v":0},{"$f":"IF($A78=\"\",,SUMPRODUCT((LOOKUP(ROW(E$1:E$997),ROW(E$1:E$997)/ISNUMBER('Měsíční rekapitulace'!$L$1:$L$997),'Měsíční rekapitulace'!$L$1:$L$997)=E$4)*('Měsíční rekapitulace'!$A$3:$A$999=$A78)*TEXT('Měsíční rekapitulace'!$Q$3:$Q$999,\"0,0;0;0;\\0\")))","v":0},{"$f":"IF($A78=\"\",,SUMPRODUCT((LOOKUP(ROW(F$1:F$997),ROW(F$1:F$997)/ISNUMBER('Měsíční rekapitulace'!$L$1:$L$997),'Měsíční rekapitulace'!$L$1:$L$997)=F$4)*('Měsíční rekapitulace'!$A$3:$A$999=$A78)*TEXT('Měsíční rekapitulace'!$Q$3:$Q$999,\"0,0;0;0;\\0\")))","v":0},{"$f":"IF($A78=\"\",,SUMPRODUCT((LOOKUP(ROW(G$1:G$997),ROW(G$1:G$997)/ISNUMBER('Měsíční rekapitulace'!$L$1:$L$997),'Měsíční rekapitulace'!$L$1:$L$997)=G$4)*('Měsíční rekapitulace'!$A$3:$A$999=$A78)*TEXT('Měsíční rekapitulace'!$Q$3:$Q$999,\"0,0;0;0;\\0\")))","v":0},{"$f":"IF($A78=\"\",,SUMPRODUCT((LOOKUP(ROW(H$1:H$997),ROW(H$1:H$997)/ISNUMBER('Měsíční rekapitulace'!$L$1:$L$997),'Měsíční rekapitulace'!$L$1:$L$997)=H$4)*('Měsíční rekapitulace'!$A$3:$A$999=$A78)*TEXT('Měsíční rekapitulace'!$Q$3:$Q$999,\"0,0;0;0;\\0\")))","v":0},{"$f":"IF($A78=\"\",,SUMPRODUCT((LOOKUP(ROW(I$1:I$997),ROW(I$1:I$997)/ISNUMBER('Měsíční rekapitulace'!$L$1:$L$997),'Měsíční rekapitulace'!$L$1:$L$997)=I$4)*('Měsíční rekapitulace'!$A$3:$A$999=$A78)*TEXT('Měsíční rekapitulace'!$Q$3:$Q$999,\"0,0;0;0;\\0\")))","v":0},{"$f":"IF($A78=\"\",,SUMPRODUCT((LOOKUP(ROW(J$1:J$997),ROW(J$1:J$997)/ISNUMBER('Měsíční rekapitulace'!$L$1:$L$997),'Měsíční rekapitulace'!$L$1:$L$997)=J$4)*('Měsíční rekapitulace'!$A$3:$A$999=$A78)*TEXT('Měsíční rekapitulace'!$Q$3:$Q$999,\"0,0;0;0;\\0\")))","v":0},{"$f":"IF($A78=\"\",,SUMPRODUCT((LOOKUP(ROW(K$1:K$997),ROW(K$1:K$997)/ISNUMBER('Měsíční rekapitulace'!$L$1:$L$997),'Měsíční rekapitulace'!$L$1:$L$997)=K$4)*('Měsíční rekapitulace'!$A$3:$A$999=$A78)*TEXT('Měsíční rekapitulace'!$Q$3:$Q$999,\"0,0;0;0;\\0\")))","v":0},{"$f":"IF($A78=\"\",,SUMPRODUCT((LOOKUP(ROW(L$1:L$997),ROW(L$1:L$997)/ISNUMBER('Měsíční rekapitulace'!$L$1:$L$997),'Měsíční rekapitulace'!$L$1:$L$997)=L$4)*('Měsíční rekapitulace'!$A$3:$A$999=$A78)*TEXT('Měsíční rekapitulace'!$Q$3:$Q$999,\"0,0;0;0;\\0\")))","v":0},{"$f":"IF($A78=\"\",,SUMPRODUCT((LOOKUP(ROW(M$1:M$997),ROW(M$1:M$997)/ISNUMBER('Měsíční rekapitulace'!$L$1:$L$997),'Měsíční rekapitulace'!$L$1:$L$997)=M$4)*('Měsíční rekapitulace'!$A$3:$A$999=$A78)*TEXT('Měsíční rekapitulace'!$Q$3:$Q$999,\"0,0;0;0;\\0\")))","v":0},{"$f":"IF($A78=\"\",,SUMPRODUCT((LOOKUP(ROW(N$1:N$997),ROW(N$1:N$997)/ISNUMBER('Měsíční rekapitulace'!$L$1:$L$997),'Měsíční rekapitulace'!$L$1:$L$997)=N$4)*('Měsíční rekapitulace'!$A$3:$A$999=$A78)*TEXT('Měsíční rekapitulace'!$Q$3:$Q$999,\"0,0;0;0;\\0\")))","v":0},{"$f":"IF($A78=\"\",,SUMPRODUCT((LOOKUP(ROW(O$1:O$997),ROW(O$1:O$997)/ISNUMBER('Měsíční rekapitulace'!$L$1:$L$997),'Měsíční rekapitulace'!$L$1:$L$997)=O$4)*('Měsíční rekapitulace'!$A$3:$A$999=$A78)*TEXT('Měsíční rekapitulace'!$Q$3:$Q$999,\"0,0;0;0;\\0\")))","v":0},0]
[{"$f":"IFERROR(INDEX('Měsíční rekapitulace'!A$3:A$999,SMALL(IF(('Měsíční rekapitulace'!A$3:A$999<>\"\")*('Měsíční rekapitulace'!A$3:A$999<>'Měsíční rekapitulace'!$A$2)*(COUNTIF(A$5:A78,'Měsíční rekapitulace'!A$3:A$999)=0),ROW('Měsíční rekapitulace'!A$3:A$999)-2),1)),\"\")","v":""},{"$f":"IFERROR(INDEX('Měsíční rekapitulace'!E$3:E$999,MATCH(A79,'Měsíční rekapitulace'!A$3:A$999,)),\"\")","v":""},null,{"$f":"IF($A79=\"\",,SUMPRODUCT((LOOKUP(ROW(D$1:D$997),ROW(D$1:D$997)/ISNUMBER('Měsíční rekapitulace'!$L$1:$L$997),'Měsíční rekapitulace'!$L$1:$L$997)=D$4)*('Měsíční rekapitulace'!$A$3:$A$999=$A79)*TEXT('Měsíční rekapitulace'!$Q$3:$Q$999,\"0,0;0;0;\\0\")))","v":0},{"$f":"IF($A79=\"\",,SUMPRODUCT((LOOKUP(ROW(E$1:E$997),ROW(E$1:E$997)/ISNUMBER('Měsíční rekapitulace'!$L$1:$L$997),'Měsíční rekapitulace'!$L$1:$L$997)=E$4)*('Měsíční rekapitulace'!$A$3:$A$999=$A79)*TEXT('Měsíční rekapitulace'!$Q$3:$Q$999,\"0,0;0;0;\\0\")))","v":0},{"$f":"IF($A79=\"\",,SUMPRODUCT((LOOKUP(ROW(F$1:F$997),ROW(F$1:F$997)/ISNUMBER('Měsíční rekapitulace'!$L$1:$L$997),'Měsíční rekapitulace'!$L$1:$L$997)=F$4)*('Měsíční rekapitulace'!$A$3:$A$999=$A79)*TEXT('Měsíční rekapitulace'!$Q$3:$Q$999,\"0,0;0;0;\\0\")))","v":0},{"$f":"IF($A79=\"\",,SUMPRODUCT((LOOKUP(ROW(G$1:G$997),ROW(G$1:G$997)/ISNUMBER('Měsíční rekapitulace'!$L$1:$L$997),'Měsíční rekapitulace'!$L$1:$L$997)=G$4)*('Měsíční rekapitulace'!$A$3:$A$999=$A79)*TEXT('Měsíční rekapitulace'!$Q$3:$Q$999,\"0,0;0;0;\\0\")))","v":0},{"$f":"IF($A79=\"\",,SUMPRODUCT((LOOKUP(ROW(H$1:H$997),ROW(H$1:H$997)/ISNUMBER('Měsíční rekapitulace'!$L$1:$L$997),'Měsíční rekapitulace'!$L$1:$L$997)=H$4)*('Měsíční rekapitulace'!$A$3:$A$999=$A79)*TEXT('Měsíční rekapitulace'!$Q$3:$Q$999,\"0,0;0;0;\\0\")))","v":0},{"$f":"IF($A79=\"\",,SUMPRODUCT((LOOKUP(ROW(I$1:I$997),ROW(I$1:I$997)/ISNUMBER('Měsíční rekapitulace'!$L$1:$L$997),'Měsíční rekapitulace'!$L$1:$L$997)=I$4)*('Měsíční rekapitulace'!$A$3:$A$999=$A79)*TEXT('Měsíční rekapitulace'!$Q$3:$Q$999,\"0,0;0;0;\\0\")))","v":0},{"$f":"IF($A79=\"\",,SUMPRODUCT((LOOKUP(ROW(J$1:J$997),ROW(J$1:J$997)/ISNUMBER('Měsíční rekapitulace'!$L$1:$L$997),'Měsíční rekapitulace'!$L$1:$L$997)=J$4)*('Měsíční rekapitulace'!$A$3:$A$999=$A79)*TEXT('Měsíční rekapitulace'!$Q$3:$Q$999,\"0,0;0;0;\\0\")))","v":0},{"$f":"IF($A79=\"\",,SUMPRODUCT((LOOKUP(ROW(K$1:K$997),ROW(K$1:K$997)/ISNUMBER('Měsíční rekapitulace'!$L$1:$L$997),'Měsíční rekapitulace'!$L$1:$L$997)=K$4)*('Měsíční rekapitulace'!$A$3:$A$999=$A79)*TEXT('Měsíční rekapitulace'!$Q$3:$Q$999,\"0,0;0;0;\\0\")))","v":0},{"$f":"IF($A79=\"\",,SUMPRODUCT((LOOKUP(ROW(L$1:L$997),ROW(L$1:L$997)/ISNUMBER('Měsíční rekapitulace'!$L$1:$L$997),'Měsíční rekapitulace'!$L$1:$L$997)=L$4)*('Měsíční rekapitulace'!$A$3:$A$999=$A79)*TEXT('Měsíční rekapitulace'!$Q$3:$Q$999,\"0,0;0;0;\\0\")))","v":0},{"$f":"IF($A79=\"\",,SUMPRODUCT((LOOKUP(ROW(M$1:M$997),ROW(M$1:M$997)/ISNUMBER('Měsíční rekapitulace'!$L$1:$L$997),'Měsíční rekapitulace'!$L$1:$L$997)=M$4)*('Měsíční rekapitulace'!$A$3:$A$999=$A79)*TEXT('Měsíční rekapitulace'!$Q$3:$Q$999,\"0,0;0;0;\\0\")))","v":0},{"$f":"IF($A79=\"\",,SUMPRODUCT((LOOKUP(ROW(N$1:N$997),ROW(N$1:N$997)/ISNUMBER('Měsíční rekapitulace'!$L$1:$L$997),'Měsíční rekapitulace'!$L$1:$L$997)=N$4)*('Měsíční rekapitulace'!$A$3:$A$999=$A79)*TEXT('Měsíční rekapitulace'!$Q$3:$Q$999,\"0,0;0;0;\\0\")))","v":0},{"$f":"IF($A79=\"\",,SUMPRODUCT((LOOKUP(ROW(O$1:O$997),ROW(O$1:O$997)/ISNUMBER('Měsíční rekapitulace'!$L$1:$L$997),'Měsíční rekapitulace'!$L$1:$L$997)=O$4)*('Měsíční rekapitulace'!$A$3:$A$999=$A79)*TEXT('Měsíční rekapitulace'!$Q$3:$Q$999,\"0,0;0;0;\\0\")))","v":0},0]
[{"$f":"IFERROR(INDEX('Měsíční rekapitulace'!A$3:A$999,SMALL(IF(('Měsíční rekapitulace'!A$3:A$999<>\"\")*('Měsíční rekapitulace'!A$3:A$999<>'Měsíční rekapitulace'!$A$2)*(COUNTIF(A$5:A79,'Měsíční rekapitulace'!A$3:A$999)=0),ROW('Měsíční rekapitulace'!A$3:A$999)-2),1)),\"\")","v":""},{"$f":"IFERROR(INDEX('Měsíční rekapitulace'!E$3:E$999,MATCH(A80,'Měsíční rekapitulace'!A$3:A$999,)),\"\")","v":""},null,{"$f":"IF($A80=\"\",,SUMPRODUCT((LOOKUP(ROW(D$1:D$997),ROW(D$1:D$997)/ISNUMBER('Měsíční rekapitulace'!$L$1:$L$997),'Měsíční rekapitulace'!$L$1:$L$997)=D$4)*('Měsíční rekapitulace'!$A$3:$A$999=$A80)*TEXT('Měsíční rekapitulace'!$Q$3:$Q$999,\"0,0;0;0;\\0\")))","v":0},{"$f":"IF($A80=\"\",,SUMPRODUCT((LOOKUP(ROW(E$1:E$997),ROW(E$1:E$997)/ISNUMBER('Měsíční rekapitulace'!$L$1:$L$997),'Měsíční rekapitulace'!$L$1:$L$997)=E$4)*('Měsíční rekapitulace'!$A$3:$A$999=$A80)*TEXT('Měsíční rekapitulace'!$Q$3:$Q$999,\"0,0;0;0;\\0\")))","v":0},{"$f":"IF($A80=\"\",,SUMPRODUCT((LOOKUP(ROW(F$1:F$997),ROW(F$1:F$997)/ISNUMBER('Měsíční rekapitulace'!$L$1:$L$997),'Měsíční rekapitulace'!$L$1:$L$997)=F$4)*('Měsíční rekapitulace'!$A$3:$A$999=$A80)*TEXT('Měsíční rekapitulace'!$Q$3:$Q$999,\"0,0;0;0;\\0\")))","v":0},{"$f":"IF($A80=\"\",,SUMPRODUCT((LOOKUP(ROW(G$1:G$997),ROW(G$1:G$997)/ISNUMBER('Měsíční rekapitulace'!$L$1:$L$997),'Měsíční rekapitulace'!$L$1:$L$997)=G$4)*('Měsíční rekapitulace'!$A$3:$A$999=$A80)*TEXT('Měsíční rekapitulace'!$Q$3:$Q$999,\"0,0;0;0;\\0\")))","v":0},{"$f":"IF($A80=\"\",,SUMPRODUCT((LOOKUP(ROW(H$1:H$997),ROW(H$1:H$997)/ISNUMBER('Měsíční rekapitulace'!$L$1:$L$997),'Měsíční rekapitulace'!$L$1:$L$997)=H$4)*('Měsíční rekapitulace'!$A$3:$A$999=$A80)*TEXT('Měsíční rekapitulace'!$Q$3:$Q$999,\"0,0;0;0;\\0\")))","v":0},{"$f":"IF($A80=\"\",,SUMPRODUCT((LOOKUP(ROW(I$1:I$997),ROW(I$1:I$997)/ISNUMBER('Měsíční rekapitulace'!$L$1:$L$997),'Měsíční rekapitulace'!$L$1:$L$997)=I$4)*('Měsíční rekapitulace'!$A$3:$A$999=$A80)*TEXT('Měsíční rekapitulace'!$Q$3:$Q$999,\"0,0;0;0;\\0\")))","v":0},{"$f":"IF($A80=\"\",,SUMPRODUCT((LOOKUP(ROW(J$1:J$997),ROW(J$1:J$997)/ISNUMBER('Měsíční rekapitulace'!$L$1:$L$997),'Měsíční rekapitulace'!$L$1:$L$997)=J$4)*('Měsíční rekapitulace'!$A$3:$A$999=$A80)*TEXT('Měsíční rekapitulace'!$Q$3:$Q$999,\"0,0;0;0;\\0\")))","v":0},{"$f":"IF($A80=\"\",,SUMPRODUCT((LOOKUP(ROW(K$1:K$997),ROW(K$1:K$997)/ISNUMBER('Měsíční rekapitulace'!$L$1:$L$997),'Měsíční rekapitulace'!$L$1:$L$997)=K$4)*('Měsíční rekapitulace'!$A$3:$A$999=$A80)*TEXT('Měsíční rekapitulace'!$Q$3:$Q$999,\"0,0;0;0;\\0\")))","v":0},{"$f":"IF($A80=\"\",,SUMPRODUCT((LOOKUP(ROW(L$1:L$997),ROW(L$1:L$997)/ISNUMBER('Měsíční rekapitulace'!$L$1:$L$997),'Měsíční rekapitulace'!$L$1:$L$997)=L$4)*('Měsíční rekapitulace'!$A$3:$A$999=$A80)*TEXT('Měsíční rekapitulace'!$Q$3:$Q$999,\"0,0;0;0;\\0\")))","v":0},{"$f":"IF($A80=\"\",,SUMPRODUCT((LOOKUP(ROW(M$1:M$997),ROW(M$1:M$997)/ISNUMBER('Měsíční rekapitulace'!$L$1:$L$997),'Měsíční rekapitulace'!$L$1:$L$997)=M$4)*('Měsíční rekapitulace'!$A$3:$A$999=$A80)*TEXT('Měsíční rekapitulace'!$Q$3:$Q$999,\"0,0;0;0;\\0\")))","v":0},{"$f":"IF($A80=\"\",,SUMPRODUCT((LOOKUP(ROW(N$1:N$997),ROW(N$1:N$997)/ISNUMBER('Měsíční rekapitulace'!$L$1:$L$997),'Měsíční rekapitulace'!$L$1:$L$997)=N$4)*('Měsíční rekapitulace'!$A$3:$A$999=$A80)*TEXT('Měsíční rekapitulace'!$Q$3:$Q$999,\"0,0;0;0;\\0\")))","v":0},{"$f":"IF($A80=\"\",,SUMPRODUCT((LOOKUP(ROW(O$1:O$997),ROW(O$1:O$997)/ISNUMBER('Měsíční rekapitulace'!$L$1:$L$997),'Měsíční rekapitulace'!$L$1:$L$997)=O$4)*('Měsíční rekapitulace'!$A$3:$A$999=$A80)*TEXT('Měsíční rekapitulace'!$Q$3:$Q$999,\"0,0;0;0;\\0\")))","v":0},0]
[{"$f":"IFERROR(INDEX('Měsíční rekapitulace'!A$3:A$999,SMALL(IF(('Měsíční rekapitulace'!A$3:A$999<>\"\")*('Měsíční rekapitulace'!A$3:A$999<>'Měsíční rekapitulace'!$A$2)*(COUNTIF(A$5:A80,'Měsíční rekapitulace'!A$3:A$999)=0),ROW('Měsíční rekapitulace'!A$3:A$999)-2),1)),\"\")","v":""},{"$f":"IFERROR(INDEX('Měsíční rekapitulace'!E$3:E$999,MATCH(A81,'Měsíční rekapitulace'!A$3:A$999,)),\"\")","v":""},null,{"$f":"IF($A81=\"\",,SUMPRODUCT((LOOKUP(ROW(D$1:D$997),ROW(D$1:D$997)/ISNUMBER('Měsíční rekapitulace'!$L$1:$L$997),'Měsíční rekapitulace'!$L$1:$L$997)=D$4)*('Měsíční rekapitulace'!$A$3:$A$999=$A81)*TEXT('Měsíční rekapitulace'!$Q$3:$Q$999,\"0,0;0;0;\\0\")))","v":0},{"$f":"IF($A81=\"\",,SUMPRODUCT((LOOKUP(ROW(E$1:E$997),ROW(E$1:E$997)/ISNUMBER('Měsíční rekapitulace'!$L$1:$L$997),'Měsíční rekapitulace'!$L$1:$L$997)=E$4)*('Měsíční rekapitulace'!$A$3:$A$999=$A81)*TEXT('Měsíční rekapitulace'!$Q$3:$Q$999,\"0,0;0;0;\\0\")))","v":0},{"$f":"IF($A81=\"\",,SUMPRODUCT((LOOKUP(ROW(F$1:F$997),ROW(F$1:F$997)/ISNUMBER('Měsíční rekapitulace'!$L$1:$L$997),'Měsíční rekapitulace'!$L$1:$L$997)=F$4)*('Měsíční rekapitulace'!$A$3:$A$999=$A81)*TEXT('Měsíční rekapitulace'!$Q$3:$Q$999,\"0,0;0;0;\\0\")))","v":0},{"$f":"IF($A81=\"\",,SUMPRODUCT((LOOKUP(ROW(G$1:G$997),ROW(G$1:G$997)/ISNUMBER('Měsíční rekapitulace'!$L$1:$L$997),'Měsíční rekapitulace'!$L$1:$L$997)=G$4)*('Měsíční rekapitulace'!$A$3:$A$999=$A81)*TEXT('Měsíční rekapitulace'!$Q$3:$Q$999,\"0,0;0;0;\\0\")))","v":0},{"$f":"IF($A81=\"\",,SUMPRODUCT((LOOKUP(ROW(H$1:H$997),ROW(H$1:H$997)/ISNUMBER('Měsíční rekapitulace'!$L$1:$L$997),'Měsíční rekapitulace'!$L$1:$L$997)=H$4)*('Měsíční rekapitulace'!$A$3:$A$999=$A81)*TEXT('Měsíční rekapitulace'!$Q$3:$Q$999,\"0,0;0;0;\\0\")))","v":0},{"$f":"IF($A81=\"\",,SUMPRODUCT((LOOKUP(ROW(I$1:I$997),ROW(I$1:I$997)/ISNUMBER('Měsíční rekapitulace'!$L$1:$L$997),'Měsíční rekapitulace'!$L$1:$L$997)=I$4)*('Měsíční rekapitulace'!$A$3:$A$999=$A81)*TEXT('Měsíční rekapitulace'!$Q$3:$Q$999,\"0,0;0;0;\\0\")))","v":0},{"$f":"IF($A81=\"\",,SUMPRODUCT((LOOKUP(ROW(J$1:J$997),ROW(J$1:J$997)/ISNUMBER('Měsíční rekapitulace'!$L$1:$L$997),'Měsíční rekapitulace'!$L$1:$L$997)=J$4)*('Měsíční rekapitulace'!$A$3:$A$999=$A81)*TEXT('Měsíční rekapitulace'!$Q$3:$Q$999,\"0,0;0;0;\\0\")))","v":0},{"$f":"IF($A81=\"\",,SUMPRODUCT((LOOKUP(ROW(K$1:K$997),ROW(K$1:K$997)/ISNUMBER('Měsíční rekapitulace'!$L$1:$L$997),'Měsíční rekapitulace'!$L$1:$L$997)=K$4)*('Měsíční rekapitulace'!$A$3:$A$999=$A81)*TEXT('Měsíční rekapitulace'!$Q$3:$Q$999,\"0,0;0;0;\\0\")))","v":0},{"$f":"IF($A81=\"\",,SUMPRODUCT((LOOKUP(ROW(L$1:L$997),ROW(L$1:L$997)/ISNUMBER('Měsíční rekapitulace'!$L$1:$L$997),'Měsíční rekapitulace'!$L$1:$L$997)=L$4)*('Měsíční rekapitulace'!$A$3:$A$999=$A81)*TEXT('Měsíční rekapitulace'!$Q$3:$Q$999,\"0,0;0;0;\\0\")))","v":0},{"$f":"IF($A81=\"\",,SUMPRODUCT((LOOKUP(ROW(M$1:M$997),ROW(M$1:M$997)/ISNUMBER('Měsíční rekapitulace'!$L$1:$L$997),'Měsíční rekapitulace'!$L$1:$L$997)=M$4)*('Měsíční rekapitulace'!$A$3:$A$999=$A81)*TEXT('Měsíční rekapitulace'!$Q$3:$Q$999,\"0,0;0;0;\\0\")))","v":0},{"$f":"IF($A81=\"\",,SUMPRODUCT((LOOKUP(ROW(N$1:N$997),ROW(N$1:N$997)/ISNUMBER('Měsíční rekapitulace'!$L$1:$L$997),'Měsíční rekapitulace'!$L$1:$L$997)=N$4)*('Měsíční rekapitulace'!$A$3:$A$999=$A81)*TEXT('Měsíční rekapitulace'!$Q$3:$Q$999,\"0,0;0;0;\\0\")))","v":0},{"$f":"IF($A81=\"\",,SUMPRODUCT((LOOKUP(ROW(O$1:O$997),ROW(O$1:O$997)/ISNUMBER('Měsíční rekapitulace'!$L$1:$L$997),'Měsíční rekapitulace'!$L$1:$L$997)=O$4)*('Měsíční rekapitulace'!$A$3:$A$999=$A81)*TEXT('Měsíční rekapitulace'!$Q$3:$Q$999,\"0,0;0;0;\\0\")))","v":0},0]
[{"$f":"IFERROR(INDEX('Měsíční rekapitulace'!A$3:A$999,SMALL(IF(('Měsíční rekapitulace'!A$3:A$999<>\"\")*('Měsíční rekapitulace'!A$3:A$999<>'Měsíční rekapitulace'!$A$2)*(COUNTIF(A$5:A81,'Měsíční rekapitulace'!A$3:A$999)=0),ROW('Měsíční rekapitulace'!A$3:A$999)-2),1)),\"\")","v":""},{"$f":"IFERROR(INDEX('Měsíční rekapitulace'!E$3:E$999,MATCH(A82,'Měsíční rekapitulace'!A$3:A$999,)),\"\")","v":""},null,{"$f":"IF($A82=\"\",,SUMPRODUCT((LOOKUP(ROW(D$1:D$997),ROW(D$1:D$997)/ISNUMBER('Měsíční rekapitulace'!$L$1:$L$997),'Měsíční rekapitulace'!$L$1:$L$997)=D$4)*('Měsíční rekapitulace'!$A$3:$A$999=$A82)*TEXT('Měsíční rekapitulace'!$Q$3:$Q$999,\"0,0;0;0;\\0\")))","v":0},{"$f":"IF($A82=\"\",,SUMPRODUCT((LOOKUP(ROW(E$1:E$997),ROW(E$1:E$997)/ISNUMBER('Měsíční rekapitulace'!$L$1:$L$997),'Měsíční rekapitulace'!$L$1:$L$997)=E$4)*('Měsíční rekapitulace'!$A$3:$A$999=$A82)*TEXT('Měsíční rekapitulace'!$Q$3:$Q$999,\"0,0;0;0;\\0\")))","v":0},{"$f":"IF($A82=\"\",,SUMPRODUCT((LOOKUP(ROW(F$1:F$997),ROW(F$1:F$997)/ISNUMBER('Měsíční rekapitulace'!$L$1:$L$997),'Měsíční rekapitulace'!$L$1:$L$997)=F$4)*('Měsíční rekapitulace'!$A$3:$A$999=$A82)*TEXT('Měsíční rekapitulace'!$Q$3:$Q$999,\"0,0;0;0;\\0\")))","v":0},{"$f":"IF($A82=\"\",,SUMPRODUCT((LOOKUP(ROW(G$1:G$997),ROW(G$1:G$997)/ISNUMBER('Měsíční rekapitulace'!$L$1:$L$997),'Měsíční rekapitulace'!$L$1:$L$997)=G$4)*('Měsíční rekapitulace'!$A$3:$A$999=$A82)*TEXT('Měsíční rekapitulace'!$Q$3:$Q$999,\"0,0;0;0;\\0\")))","v":0},{"$f":"IF($A82=\"\",,SUMPRODUCT((LOOKUP(ROW(H$1:H$997),ROW(H$1:H$997)/ISNUMBER('Měsíční rekapitulace'!$L$1:$L$997),'Měsíční rekapitulace'!$L$1:$L$997)=H$4)*('Měsíční rekapitulace'!$A$3:$A$999=$A82)*TEXT('Měsíční rekapitulace'!$Q$3:$Q$999,\"0,0;0;0;\\0\")))","v":0},{"$f":"IF($A82=\"\",,SUMPRODUCT((LOOKUP(ROW(I$1:I$997),ROW(I$1:I$997)/ISNUMBER('Měsíční rekapitulace'!$L$1:$L$997),'Měsíční rekapitulace'!$L$1:$L$997)=I$4)*('Měsíční rekapitulace'!$A$3:$A$999=$A82)*TEXT('Měsíční rekapitulace'!$Q$3:$Q$999,\"0,0;0;0;\\0\")))","v":0},{"$f":"IF($A82=\"\",,SUMPRODUCT((LOOKUP(ROW(J$1:J$997),ROW(J$1:J$997)/ISNUMBER('Měsíční rekapitulace'!$L$1:$L$997),'Měsíční rekapitulace'!$L$1:$L$997)=J$4)*('Měsíční rekapitulace'!$A$3:$A$999=$A82)*TEXT('Měsíční rekapitulace'!$Q$3:$Q$999,\"0,0;0;0;\\0\")))","v":0},{"$f":"IF($A82=\"\",,SUMPRODUCT((LOOKUP(ROW(K$1:K$997),ROW(K$1:K$997)/ISNUMBER('Měsíční rekapitulace'!$L$1:$L$997),'Měsíční rekapitulace'!$L$1:$L$997)=K$4)*('Měsíční rekapitulace'!$A$3:$A$999=$A82)*TEXT('Měsíční rekapitulace'!$Q$3:$Q$999,\"0,0;0;0;\\0\")))","v":0},{"$f":"IF($A82=\"\",,SUMPRODUCT((LOOKUP(ROW(L$1:L$997),ROW(L$1:L$997)/ISNUMBER('Měsíční rekapitulace'!$L$1:$L$997),'Měsíční rekapitulace'!$L$1:$L$997)=L$4)*('Měsíční rekapitulace'!$A$3:$A$999=$A82)*TEXT('Měsíční rekapitulace'!$Q$3:$Q$999,\"0,0;0;0;\\0\")))","v":0},{"$f":"IF($A82=\"\",,SUMPRODUCT((LOOKUP(ROW(M$1:M$997),ROW(M$1:M$997)/ISNUMBER('Měsíční rekapitulace'!$L$1:$L$997),'Měsíční rekapitulace'!$L$1:$L$997)=M$4)*('Měsíční rekapitulace'!$A$3:$A$999=$A82)*TEXT('Měsíční rekapitulace'!$Q$3:$Q$999,\"0,0;0;0;\\0\")))","v":0},{"$f":"IF($A82=\"\",,SUMPRODUCT((LOOKUP(ROW(N$1:N$997),ROW(N$1:N$997)/ISNUMBER('Měsíční rekapitulace'!$L$1:$L$997),'Měsíční rekapitulace'!$L$1:$L$997)=N$4)*('Měsíční rekapitulace'!$A$3:$A$999=$A82)*TEXT('Měsíční rekapitulace'!$Q$3:$Q$999,\"0,0;0;0;\\0\")))","v":0},{"$f":"IF($A82=\"\",,SUMPRODUCT((LOOKUP(ROW(O$1:O$997),ROW(O$1:O$997)/ISNUMBER('Měsíční rekapitulace'!$L$1:$L$997),'Měsíční rekapitulace'!$L$1:$L$997)=O$4)*('Měsíční rekapitulace'!$A$3:$A$999=$A82)*TEXT('Měsíční rekapitulace'!$Q$3:$Q$999,\"0,0;0;0;\\0\")))","v":0},0]
[{"$f":"IFERROR(INDEX('Měsíční rekapitulace'!A$3:A$999,SMALL(IF(('Měsíční rekapitulace'!A$3:A$999<>\"\")*('Měsíční rekapitulace'!A$3:A$999<>'Měsíční rekapitulace'!$A$2)*(COUNTIF(A$5:A82,'Měsíční rekapitulace'!A$3:A$999)=0),ROW('Měsíční rekapitulace'!A$3:A$999)-2),1)),\"\")","v":""},{"$f":"IFERROR(INDEX('Měsíční rekapitulace'!E$3:E$999,MATCH(A83,'Měsíční rekapitulace'!A$3:A$999,)),\"\")","v":""},null,{"$f":"IF($A83=\"\",,SUMPRODUCT((LOOKUP(ROW(D$1:D$997),ROW(D$1:D$997)/ISNUMBER('Měsíční rekapitulace'!$L$1:$L$997),'Měsíční rekapitulace'!$L$1:$L$997)=D$4)*('Měsíční rekapitulace'!$A$3:$A$999=$A83)*TEXT('Měsíční rekapitulace'!$Q$3:$Q$999,\"0,0;0;0;\\0\")))","v":0},{"$f":"IF($A83=\"\",,SUMPRODUCT((LOOKUP(ROW(E$1:E$997),ROW(E$1:E$997)/ISNUMBER('Měsíční rekapitulace'!$L$1:$L$997),'Měsíční rekapitulace'!$L$1:$L$997)=E$4)*('Měsíční rekapitulace'!$A$3:$A$999=$A83)*TEXT('Měsíční rekapitulace'!$Q$3:$Q$999,\"0,0;0;0;\\0\")))","v":0},{"$f":"IF($A83=\"\",,SUMPRODUCT((LOOKUP(ROW(F$1:F$997),ROW(F$1:F$997)/ISNUMBER('Měsíční rekapitulace'!$L$1:$L$997),'Měsíční rekapitulace'!$L$1:$L$997)=F$4)*('Měsíční rekapitulace'!$A$3:$A$999=$A83)*TEXT('Měsíční rekapitulace'!$Q$3:$Q$999,\"0,0;0;0;\\0\")))","v":0},{"$f":"IF($A83=\"\",,SUMPRODUCT((LOOKUP(ROW(G$1:G$997),ROW(G$1:G$997)/ISNUMBER('Měsíční rekapitulace'!$L$1:$L$997),'Měsíční rekapitulace'!$L$1:$L$997)=G$4)*('Měsíční rekapitulace'!$A$3:$A$999=$A83)*TEXT('Měsíční rekapitulace'!$Q$3:$Q$999,\"0,0;0;0;\\0\")))","v":0},{"$f":"IF($A83=\"\",,SUMPRODUCT((LOOKUP(ROW(H$1:H$997),ROW(H$1:H$997)/ISNUMBER('Měsíční rekapitulace'!$L$1:$L$997),'Měsíční rekapitulace'!$L$1:$L$997)=H$4)*('Měsíční rekapitulace'!$A$3:$A$999=$A83)*TEXT('Měsíční rekapitulace'!$Q$3:$Q$999,\"0,0;0;0;\\0\")))","v":0},{"$f":"IF($A83=\"\",,SUMPRODUCT((LOOKUP(ROW(I$1:I$997),ROW(I$1:I$997)/ISNUMBER('Měsíční rekapitulace'!$L$1:$L$997),'Měsíční rekapitulace'!$L$1:$L$997)=I$4)*('Měsíční rekapitulace'!$A$3:$A$999=$A83)*TEXT('Měsíční rekapitulace'!$Q$3:$Q$999,\"0,0;0;0;\\0\")))","v":0},{"$f":"IF($A83=\"\",,SUMPRODUCT((LOOKUP(ROW(J$1:J$997),ROW(J$1:J$997)/ISNUMBER('Měsíční rekapitulace'!$L$1:$L$997),'Měsíční rekapitulace'!$L$1:$L$997)=J$4)*('Měsíční rekapitulace'!$A$3:$A$999=$A83)*TEXT('Měsíční rekapitulace'!$Q$3:$Q$999,\"0,0;0;0;\\0\")))","v":0},{"$f":"IF($A83=\"\",,SUMPRODUCT((LOOKUP(ROW(K$1:K$997),ROW(K$1:K$997)/ISNUMBER('Měsíční rekapitulace'!$L$1:$L$997),'Měsíční rekapitulace'!$L$1:$L$997)=K$4)*('Měsíční rekapitulace'!$A$3:$A$999=$A83)*TEXT('Měsíční rekapitulace'!$Q$3:$Q$999,\"0,0;0;0;\\0\")))","v":0},{"$f":"IF($A83=\"\",,SUMPRODUCT((LOOKUP(ROW(L$1:L$997),ROW(L$1:L$997)/ISNUMBER('Měsíční rekapitulace'!$L$1:$L$997),'Měsíční rekapitulace'!$L$1:$L$997)=L$4)*('Měsíční rekapitulace'!$A$3:$A$999=$A83)*TEXT('Měsíční rekapitulace'!$Q$3:$Q$999,\"0,0;0;0;\\0\")))","v":0},{"$f":"IF($A83=\"\",,SUMPRODUCT((LOOKUP(ROW(M$1:M$997),ROW(M$1:M$997)/ISNUMBER('Měsíční rekapitulace'!$L$1:$L$997),'Měsíční rekapitulace'!$L$1:$L$997)=M$4)*('Měsíční rekapitulace'!$A$3:$A$999=$A83)*TEXT('Měsíční rekapitulace'!$Q$3:$Q$999,\"0,0;0;0;\\0\")))","v":0},{"$f":"IF($A83=\"\",,SUMPRODUCT((LOOKUP(ROW(N$1:N$997),ROW(N$1:N$997)/ISNUMBER('Měsíční rekapitulace'!$L$1:$L$997),'Měsíční rekapitulace'!$L$1:$L$997)=N$4)*('Měsíční rekapitulace'!$A$3:$A$999=$A83)*TEXT('Měsíční rekapitulace'!$Q$3:$Q$999,\"0,0;0;0;\\0\")))","v":0},{"$f":"IF($A83=\"\",,SUMPRODUCT((LOOKUP(ROW(O$1:O$997),ROW(O$1:O$997)/ISNUMBER('Měsíční rekapitulace'!$L$1:$L$997),'Měsíční rekapitulace'!$L$1:$L$997)=O$4)*('Měsíční rekapitulace'!$A$3:$A$999=$A83)*TEXT('Měsíční rekapitulace'!$Q$3:$Q$999,\"0,0;0;0;\\0\")))","v":0},0]
[{"$f":"IFERROR(INDEX('Měsíční rekapitulace'!A$3:A$999,SMALL(IF(('Měsíční rekapitulace'!A$3:A$999<>\"\")*('Měsíční rekapitulace'!A$3:A$999<>'Měsíční rekapitulace'!$A$2)*(COUNTIF(A$5:A83,'Měsíční rekapitulace'!A$3:A$999)=0),ROW('Měsíční rekapitulace'!A$3:A$999)-2),1)),\"\")","v":""},{"$f":"IFERROR(INDEX('Měsíční rekapitulace'!E$3:E$999,MATCH(A84,'Měsíční rekapitulace'!A$3:A$999,)),\"\")","v":""},null,{"$f":"IF($A84=\"\",,SUMPRODUCT((LOOKUP(ROW(D$1:D$997),ROW(D$1:D$997)/ISNUMBER('Měsíční rekapitulace'!$L$1:$L$997),'Měsíční rekapitulace'!$L$1:$L$997)=D$4)*('Měsíční rekapitulace'!$A$3:$A$999=$A84)*TEXT('Měsíční rekapitulace'!$Q$3:$Q$999,\"0,0;0;0;\\0\")))","v":0},{"$f":"IF($A84=\"\",,SUMPRODUCT((LOOKUP(ROW(E$1:E$997),ROW(E$1:E$997)/ISNUMBER('Měsíční rekapitulace'!$L$1:$L$997),'Měsíční rekapitulace'!$L$1:$L$997)=E$4)*('Měsíční rekapitulace'!$A$3:$A$999=$A84)*TEXT('Měsíční rekapitulace'!$Q$3:$Q$999,\"0,0;0;0;\\0\")))","v":0},{"$f":"IF($A84=\"\",,SUMPRODUCT((LOOKUP(ROW(F$1:F$997),ROW(F$1:F$997)/ISNUMBER('Měsíční rekapitulace'!$L$1:$L$997),'Měsíční rekapitulace'!$L$1:$L$997)=F$4)*('Měsíční rekapitulace'!$A$3:$A$999=$A84)*TEXT('Měsíční rekapitulace'!$Q$3:$Q$999,\"0,0;0;0;\\0\")))","v":0},{"$f":"IF($A84=\"\",,SUMPRODUCT((LOOKUP(ROW(G$1:G$997),ROW(G$1:G$997)/ISNUMBER('Měsíční rekapitulace'!$L$1:$L$997),'Měsíční rekapitulace'!$L$1:$L$997)=G$4)*('Měsíční rekapitulace'!$A$3:$A$999=$A84)*TEXT('Měsíční rekapitulace'!$Q$3:$Q$999,\"0,0;0;0;\\0\")))","v":0},{"$f":"IF($A84=\"\",,SUMPRODUCT((LOOKUP(ROW(H$1:H$997),ROW(H$1:H$997)/ISNUMBER('Měsíční rekapitulace'!$L$1:$L$997),'Měsíční rekapitulace'!$L$1:$L$997)=H$4)*('Měsíční rekapitulace'!$A$3:$A$999=$A84)*TEXT('Měsíční rekapitulace'!$Q$3:$Q$999,\"0,0;0;0;\\0\")))","v":0},{"$f":"IF($A84=\"\",,SUMPRODUCT((LOOKUP(ROW(I$1:I$997),ROW(I$1:I$997)/ISNUMBER('Měsíční rekapitulace'!$L$1:$L$997),'Měsíční rekapitulace'!$L$1:$L$997)=I$4)*('Měsíční rekapitulace'!$A$3:$A$999=$A84)*TEXT('Měsíční rekapitulace'!$Q$3:$Q$999,\"0,0;0;0;\\0\")))","v":0},{"$f":"IF($A84=\"\",,SUMPRODUCT((LOOKUP(ROW(J$1:J$997),ROW(J$1:J$997)/ISNUMBER('Měsíční rekapitulace'!$L$1:$L$997),'Měsíční rekapitulace'!$L$1:$L$997)=J$4)*('Měsíční rekapitulace'!$A$3:$A$999=$A84)*TEXT('Měsíční rekapitulace'!$Q$3:$Q$999,\"0,0;0;0;\\0\")))","v":0},{"$f":"IF($A84=\"\",,SUMPRODUCT((LOOKUP(ROW(K$1:K$997),ROW(K$1:K$997)/ISNUMBER('Měsíční rekapitulace'!$L$1:$L$997),'Měsíční rekapitulace'!$L$1:$L$997)=K$4)*('Měsíční rekapitulace'!$A$3:$A$999=$A84)*TEXT('Měsíční rekapitulace'!$Q$3:$Q$999,\"0,0;0;0;\\0\")))","v":0},{"$f":"IF($A84=\"\",,SUMPRODUCT((LOOKUP(ROW(L$1:L$997),ROW(L$1:L$997)/ISNUMBER('Měsíční rekapitulace'!$L$1:$L$997),'Měsíční rekapitulace'!$L$1:$L$997)=L$4)*('Měsíční rekapitulace'!$A$3:$A$999=$A84)*TEXT('Měsíční rekapitulace'!$Q$3:$Q$999,\"0,0;0;0;\\0\")))","v":0},{"$f":"IF($A84=\"\",,SUMPRODUCT((LOOKUP(ROW(M$1:M$997),ROW(M$1:M$997)/ISNUMBER('Měsíční rekapitulace'!$L$1:$L$997),'Měsíční rekapitulace'!$L$1:$L$997)=M$4)*('Měsíční rekapitulace'!$A$3:$A$999=$A84)*TEXT('Měsíční rekapitulace'!$Q$3:$Q$999,\"0,0;0;0;\\0\")))","v":0},{"$f":"IF($A84=\"\",,SUMPRODUCT((LOOKUP(ROW(N$1:N$997),ROW(N$1:N$997)/ISNUMBER('Měsíční rekapitulace'!$L$1:$L$997),'Měsíční rekapitulace'!$L$1:$L$997)=N$4)*('Měsíční rekapitulace'!$A$3:$A$999=$A84)*TEXT('Měsíční rekapitulace'!$Q$3:$Q$999,\"0,0;0;0;\\0\")))","v":0},{"$f":"IF($A84=\"\",,SUMPRODUCT((LOOKUP(ROW(O$1:O$997),ROW(O$1:O$997)/ISNUMBER('Měsíční rekapitulace'!$L$1:$L$997),'Měsíční rekapitulace'!$L$1:$L$997)=O$4)*('Měsíční rekapitulace'!$A$3:$A$999=$A84)*TEXT('Měsíční rekapitulace'!$Q$3:$Q$999,\"0,0;0;0;\\0\")))","v":0},0]
[{"$f":"IFERROR(INDEX('Měsíční rekapitulace'!A$3:A$999,SMALL(IF(('Měsíční rekapitulace'!A$3:A$999<>\"\")*('Měsíční rekapitulace'!A$3:A$999<>'Měsíční rekapitulace'!$A$2)*(COUNTIF(A$5:A84,'Měsíční rekapitulace'!A$3:A$999)=0),ROW('Měsíční rekapitulace'!A$3:A$999)-2),1)),\"\")","v":""},{"$f":"IFERROR(INDEX('Měsíční rekapitulace'!E$3:E$999,MATCH(A85,'Měsíční rekapitulace'!A$3:A$999,)),\"\")","v":""},null,{"$f":"IF($A85=\"\",,SUMPRODUCT((LOOKUP(ROW(D$1:D$997),ROW(D$1:D$997)/ISNUMBER('Měsíční rekapitulace'!$L$1:$L$997),'Měsíční rekapitulace'!$L$1:$L$997)=D$4)*('Měsíční rekapitulace'!$A$3:$A$999=$A85)*TEXT('Měsíční rekapitulace'!$Q$3:$Q$999,\"0,0;0;0;\\0\")))","v":0},{"$f":"IF($A85=\"\",,SUMPRODUCT((LOOKUP(ROW(E$1:E$997),ROW(E$1:E$997)/ISNUMBER('Měsíční rekapitulace'!$L$1:$L$997),'Měsíční rekapitulace'!$L$1:$L$997)=E$4)*('Měsíční rekapitulace'!$A$3:$A$999=$A85)*TEXT('Měsíční rekapitulace'!$Q$3:$Q$999,\"0,0;0;0;\\0\")))","v":0},{"$f":"IF($A85=\"\",,SUMPRODUCT((LOOKUP(ROW(F$1:F$997),ROW(F$1:F$997)/ISNUMBER('Měsíční rekapitulace'!$L$1:$L$997),'Měsíční rekapitulace'!$L$1:$L$997)=F$4)*('Měsíční rekapitulace'!$A$3:$A$999=$A85)*TEXT('Měsíční rekapitulace'!$Q$3:$Q$999,\"0,0;0;0;\\0\")))","v":0},{"$f":"IF($A85=\"\",,SUMPRODUCT((LOOKUP(ROW(G$1:G$997),ROW(G$1:G$997)/ISNUMBER('Měsíční rekapitulace'!$L$1:$L$997),'Měsíční rekapitulace'!$L$1:$L$997)=G$4)*('Měsíční rekapitulace'!$A$3:$A$999=$A85)*TEXT('Měsíční rekapitulace'!$Q$3:$Q$999,\"0,0;0;0;\\0\")))","v":0},{"$f":"IF($A85=\"\",,SUMPRODUCT((LOOKUP(ROW(H$1:H$997),ROW(H$1:H$997)/ISNUMBER('Měsíční rekapitulace'!$L$1:$L$997),'Měsíční rekapitulace'!$L$1:$L$997)=H$4)*('Měsíční rekapitulace'!$A$3:$A$999=$A85)*TEXT('Měsíční rekapitulace'!$Q$3:$Q$999,\"0,0;0;0;\\0\")))","v":0},{"$f":"IF($A85=\"\",,SUMPRODUCT((LOOKUP(ROW(I$1:I$997),ROW(I$1:I$997)/ISNUMBER('Měsíční rekapitulace'!$L$1:$L$997),'Měsíční rekapitulace'!$L$1:$L$997)=I$4)*('Měsíční rekapitulace'!$A$3:$A$999=$A85)*TEXT('Měsíční rekapitulace'!$Q$3:$Q$999,\"0,0;0;0;\\0\")))","v":0},{"$f":"IF($A85=\"\",,SUMPRODUCT((LOOKUP(ROW(J$1:J$997),ROW(J$1:J$997)/ISNUMBER('Měsíční rekapitulace'!$L$1:$L$997),'Měsíční rekapitulace'!$L$1:$L$997)=J$4)*('Měsíční rekapitulace'!$A$3:$A$999=$A85)*TEXT('Měsíční rekapitulace'!$Q$3:$Q$999,\"0,0;0;0;\\0\")))","v":0},{"$f":"IF($A85=\"\",,SUMPRODUCT((LOOKUP(ROW(K$1:K$997),ROW(K$1:K$997)/ISNUMBER('Měsíční rekapitulace'!$L$1:$L$997),'Měsíční rekapitulace'!$L$1:$L$997)=K$4)*('Měsíční rekapitulace'!$A$3:$A$999=$A85)*TEXT('Měsíční rekapitulace'!$Q$3:$Q$999,\"0,0;0;0;\\0\")))","v":0},{"$f":"IF($A85=\"\",,SUMPRODUCT((LOOKUP(ROW(L$1:L$997),ROW(L$1:L$997)/ISNUMBER('Měsíční rekapitulace'!$L$1:$L$997),'Měsíční rekapitulace'!$L$1:$L$997)=L$4)*('Měsíční rekapitulace'!$A$3:$A$999=$A85)*TEXT('Měsíční rekapitulace'!$Q$3:$Q$999,\"0,0;0;0;\\0\")))","v":0},{"$f":"IF($A85=\"\",,SUMPRODUCT((LOOKUP(ROW(M$1:M$997),ROW(M$1:M$997)/ISNUMBER('Měsíční rekapitulace'!$L$1:$L$997),'Měsíční rekapitulace'!$L$1:$L$997)=M$4)*('Měsíční rekapitulace'!$A$3:$A$999=$A85)*TEXT('Měsíční rekapitulace'!$Q$3:$Q$999,\"0,0;0;0;\\0\")))","v":0},{"$f":"IF($A85=\"\",,SUMPRODUCT((LOOKUP(ROW(N$1:N$997),ROW(N$1:N$997)/ISNUMBER('Měsíční rekapitulace'!$L$1:$L$997),'Měsíční rekapitulace'!$L$1:$L$997)=N$4)*('Měsíční rekapitulace'!$A$3:$A$999=$A85)*TEXT('Měsíční rekapitulace'!$Q$3:$Q$999,\"0,0;0;0;\\0\")))","v":0},{"$f":"IF($A85=\"\",,SUMPRODUCT((LOOKUP(ROW(O$1:O$997),ROW(O$1:O$997)/ISNUMBER('Měsíční rekapitulace'!$L$1:$L$997),'Měsíční rekapitulace'!$L$1:$L$997)=O$4)*('Měsíční rekapitulace'!$A$3:$A$999=$A85)*TEXT('Měsíční rekapitulace'!$Q$3:$Q$999,\"0,0;0;0;\\0\")))","v":0},0]
[{"$f":"IFERROR(INDEX('Měsíční rekapitulace'!A$3:A$999,SMALL(IF(('Měsíční rekapitulace'!A$3:A$999<>\"\")*('Měsíční rekapitulace'!A$3:A$999<>'Měsíční rekapitulace'!$A$2)*(COUNTIF(A$5:A85,'Měsíční rekapitulace'!A$3:A$999)=0),ROW('Měsíční rekapitulace'!A$3:A$999)-2),1)),\"\")","v":""},{"$f":"IFERROR(INDEX('Měsíční rekapitulace'!E$3:E$999,MATCH(A86,'Měsíční rekapitulace'!A$3:A$999,)),\"\")","v":""},null,{"$f":"IF($A86=\"\",,SUMPRODUCT((LOOKUP(ROW(D$1:D$997),ROW(D$1:D$997)/ISNUMBER('Měsíční rekapitulace'!$L$1:$L$997),'Měsíční rekapitulace'!$L$1:$L$997)=D$4)*('Měsíční rekapitulace'!$A$3:$A$999=$A86)*TEXT('Měsíční rekapitulace'!$Q$3:$Q$999,\"0,0;0;0;\\0\")))","v":0},{"$f":"IF($A86=\"\",,SUMPRODUCT((LOOKUP(ROW(E$1:E$997),ROW(E$1:E$997)/ISNUMBER('Měsíční rekapitulace'!$L$1:$L$997),'Měsíční rekapitulace'!$L$1:$L$997)=E$4)*('Měsíční rekapitulace'!$A$3:$A$999=$A86)*TEXT('Měsíční rekapitulace'!$Q$3:$Q$999,\"0,0;0;0;\\0\")))","v":0},{"$f":"IF($A86=\"\",,SUMPRODUCT((LOOKUP(ROW(F$1:F$997),ROW(F$1:F$997)/ISNUMBER('Měsíční rekapitulace'!$L$1:$L$997),'Měsíční rekapitulace'!$L$1:$L$997)=F$4)*('Měsíční rekapitulace'!$A$3:$A$999=$A86)*TEXT('Měsíční rekapitulace'!$Q$3:$Q$999,\"0,0;0;0;\\0\")))","v":0},{"$f":"IF($A86=\"\",,SUMPRODUCT((LOOKUP(ROW(G$1:G$997),ROW(G$1:G$997)/ISNUMBER('Měsíční rekapitulace'!$L$1:$L$997),'Měsíční rekapitulace'!$L$1:$L$997)=G$4)*('Měsíční rekapitulace'!$A$3:$A$999=$A86)*TEXT('Měsíční rekapitulace'!$Q$3:$Q$999,\"0,0;0;0;\\0\")))","v":0},{"$f":"IF($A86=\"\",,SUMPRODUCT((LOOKUP(ROW(H$1:H$997),ROW(H$1:H$997)/ISNUMBER('Měsíční rekapitulace'!$L$1:$L$997),'Měsíční rekapitulace'!$L$1:$L$997)=H$4)*('Měsíční rekapitulace'!$A$3:$A$999=$A86)*TEXT('Měsíční rekapitulace'!$Q$3:$Q$999,\"0,0;0;0;\\0\")))","v":0},{"$f":"IF($A86=\"\",,SUMPRODUCT((LOOKUP(ROW(I$1:I$997),ROW(I$1:I$997)/ISNUMBER('Měsíční rekapitulace'!$L$1:$L$997),'Měsíční rekapitulace'!$L$1:$L$997)=I$4)*('Měsíční rekapitulace'!$A$3:$A$999=$A86)*TEXT('Měsíční rekapitulace'!$Q$3:$Q$999,\"0,0;0;0;\\0\")))","v":0},{"$f":"IF($A86=\"\",,SUMPRODUCT((LOOKUP(ROW(J$1:J$997),ROW(J$1:J$997)/ISNUMBER('Měsíční rekapitulace'!$L$1:$L$997),'Měsíční rekapitulace'!$L$1:$L$997)=J$4)*('Měsíční rekapitulace'!$A$3:$A$999=$A86)*TEXT('Měsíční rekapitulace'!$Q$3:$Q$999,\"0,0;0;0;\\0\")))","v":0},{"$f":"IF($A86=\"\",,SUMPRODUCT((LOOKUP(ROW(K$1:K$997),ROW(K$1:K$997)/ISNUMBER('Měsíční rekapitulace'!$L$1:$L$997),'Měsíční rekapitulace'!$L$1:$L$997)=K$4)*('Měsíční rekapitulace'!$A$3:$A$999=$A86)*TEXT('Měsíční rekapitulace'!$Q$3:$Q$999,\"0,0;0;0;\\0\")))","v":0},{"$f":"IF($A86=\"\",,SUMPRODUCT((LOOKUP(ROW(L$1:L$997),ROW(L$1:L$997)/ISNUMBER('Měsíční rekapitulace'!$L$1:$L$997),'Měsíční rekapitulace'!$L$1:$L$997)=L$4)*('Měsíční rekapitulace'!$A$3:$A$999=$A86)*TEXT('Měsíční rekapitulace'!$Q$3:$Q$999,\"0,0;0;0;\\0\")))","v":0},{"$f":"IF($A86=\"\",,SUMPRODUCT((LOOKUP(ROW(M$1:M$997),ROW(M$1:M$997)/ISNUMBER('Měsíční rekapitulace'!$L$1:$L$997),'Měsíční rekapitulace'!$L$1:$L$997)=M$4)*('Měsíční rekapitulace'!$A$3:$A$999=$A86)*TEXT('Měsíční rekapitulace'!$Q$3:$Q$999,\"0,0;0;0;\\0\")))","v":0},{"$f":"IF($A86=\"\",,SUMPRODUCT((LOOKUP(ROW(N$1:N$997),ROW(N$1:N$997)/ISNUMBER('Měsíční rekapitulace'!$L$1:$L$997),'Měsíční rekapitulace'!$L$1:$L$997)=N$4)*('Měsíční rekapitulace'!$A$3:$A$999=$A86)*TEXT('Měsíční rekapitulace'!$Q$3:$Q$999,\"0,0;0;0;\\0\")))","v":0},{"$f":"IF($A86=\"\",,SUMPRODUCT((LOOKUP(ROW(O$1:O$997),ROW(O$1:O$997)/ISNUMBER('Měsíční rekapitulace'!$L$1:$L$997),'Měsíční rekapitulace'!$L$1:$L$997)=O$4)*('Měsíční rekapitulace'!$A$3:$A$999=$A86)*TEXT('Měsíční rekapitulace'!$Q$3:$Q$999,\"0,0;0;0;\\0\")))","v":0},0]
[{"$f":"IFERROR(INDEX('Měsíční rekapitulace'!A$3:A$999,SMALL(IF(('Měsíční rekapitulace'!A$3:A$999<>\"\")*('Měsíční rekapitulace'!A$3:A$999<>'Měsíční rekapitulace'!$A$2)*(COUNTIF(A$5:A86,'Měsíční rekapitulace'!A$3:A$999)=0),ROW('Měsíční rekapitulace'!A$3:A$999)-2),1)),\"\")","v":""},{"$f":"IFERROR(INDEX('Měsíční rekapitulace'!E$3:E$999,MATCH(A87,'Měsíční rekapitulace'!A$3:A$999,)),\"\")","v":""},null,{"$f":"IF($A87=\"\",,SUMPRODUCT((LOOKUP(ROW(D$1:D$997),ROW(D$1:D$997)/ISNUMBER('Měsíční rekapitulace'!$L$1:$L$997),'Měsíční rekapitulace'!$L$1:$L$997)=D$4)*('Měsíční rekapitulace'!$A$3:$A$999=$A87)*TEXT('Měsíční rekapitulace'!$Q$3:$Q$999,\"0,0;0;0;\\0\")))","v":0},{"$f":"IF($A87=\"\",,SUMPRODUCT((LOOKUP(ROW(E$1:E$997),ROW(E$1:E$997)/ISNUMBER('Měsíční rekapitulace'!$L$1:$L$997),'Měsíční rekapitulace'!$L$1:$L$997)=E$4)*('Měsíční rekapitulace'!$A$3:$A$999=$A87)*TEXT('Měsíční rekapitulace'!$Q$3:$Q$999,\"0,0;0;0;\\0\")))","v":0},{"$f":"IF($A87=\"\",,SUMPRODUCT((LOOKUP(ROW(F$1:F$997),ROW(F$1:F$997)/ISNUMBER('Měsíční rekapitulace'!$L$1:$L$997),'Měsíční rekapitulace'!$L$1:$L$997)=F$4)*('Měsíční rekapitulace'!$A$3:$A$999=$A87)*TEXT('Měsíční rekapitulace'!$Q$3:$Q$999,\"0,0;0;0;\\0\")))","v":0},{"$f":"IF($A87=\"\",,SUMPRODUCT((LOOKUP(ROW(G$1:G$997),ROW(G$1:G$997)/ISNUMBER('Měsíční rekapitulace'!$L$1:$L$997),'Měsíční rekapitulace'!$L$1:$L$997)=G$4)*('Měsíční rekapitulace'!$A$3:$A$999=$A87)*TEXT('Měsíční rekapitulace'!$Q$3:$Q$999,\"0,0;0;0;\\0\")))","v":0},{"$f":"IF($A87=\"\",,SUMPRODUCT((LOOKUP(ROW(H$1:H$997),ROW(H$1:H$997)/ISNUMBER('Měsíční rekapitulace'!$L$1:$L$997),'Měsíční rekapitulace'!$L$1:$L$997)=H$4)*('Měsíční rekapitulace'!$A$3:$A$999=$A87)*TEXT('Měsíční rekapitulace'!$Q$3:$Q$999,\"0,0;0;0;\\0\")))","v":0},{"$f":"IF($A87=\"\",,SUMPRODUCT((LOOKUP(ROW(I$1:I$997),ROW(I$1:I$997)/ISNUMBER('Měsíční rekapitulace'!$L$1:$L$997),'Měsíční rekapitulace'!$L$1:$L$997)=I$4)*('Měsíční rekapitulace'!$A$3:$A$999=$A87)*TEXT('Měsíční rekapitulace'!$Q$3:$Q$999,\"0,0;0;0;\\0\")))","v":0},{"$f":"IF($A87=\"\",,SUMPRODUCT((LOOKUP(ROW(J$1:J$997),ROW(J$1:J$997)/ISNUMBER('Měsíční rekapitulace'!$L$1:$L$997),'Měsíční rekapitulace'!$L$1:$L$997)=J$4)*('Měsíční rekapitulace'!$A$3:$A$999=$A87)*TEXT('Měsíční rekapitulace'!$Q$3:$Q$999,\"0,0;0;0;\\0\")))","v":0},{"$f":"IF($A87=\"\",,SUMPRODUCT((LOOKUP(ROW(K$1:K$997),ROW(K$1:K$997)/ISNUMBER('Měsíční rekapitulace'!$L$1:$L$997),'Měsíční rekapitulace'!$L$1:$L$997)=K$4)*('Měsíční rekapitulace'!$A$3:$A$999=$A87)*TEXT('Měsíční rekapitulace'!$Q$3:$Q$999,\"0,0;0;0;\\0\")))","v":0},{"$f":"IF($A87=\"\",,SUMPRODUCT((LOOKUP(ROW(L$1:L$997),ROW(L$1:L$997)/ISNUMBER('Měsíční rekapitulace'!$L$1:$L$997),'Měsíční rekapitulace'!$L$1:$L$997)=L$4)*('Měsíční rekapitulace'!$A$3:$A$999=$A87)*TEXT('Měsíční rekapitulace'!$Q$3:$Q$999,\"0,0;0;0;\\0\")))","v":0},{"$f":"IF($A87=\"\",,SUMPRODUCT((LOOKUP(ROW(M$1:M$997),ROW(M$1:M$997)/ISNUMBER('Měsíční rekapitulace'!$L$1:$L$997),'Měsíční rekapitulace'!$L$1:$L$997)=M$4)*('Měsíční rekapitulace'!$A$3:$A$999=$A87)*TEXT('Měsíční rekapitulace'!$Q$3:$Q$999,\"0,0;0;0;\\0\")))","v":0},{"$f":"IF($A87=\"\",,SUMPRODUCT((LOOKUP(ROW(N$1:N$997),ROW(N$1:N$997)/ISNUMBER('Měsíční rekapitulace'!$L$1:$L$997),'Měsíční rekapitulace'!$L$1:$L$997)=N$4)*('Měsíční rekapitulace'!$A$3:$A$999=$A87)*TEXT('Měsíční rekapitulace'!$Q$3:$Q$999,\"0,0;0;0;\\0\")))","v":0},{"$f":"IF($A87=\"\",,SUMPRODUCT((LOOKUP(ROW(O$1:O$997),ROW(O$1:O$997)/ISNUMBER('Měsíční rekapitulace'!$L$1:$L$997),'Měsíční rekapitulace'!$L$1:$L$997)=O$4)*('Měsíční rekapitulace'!$A$3:$A$999=$A87)*TEXT('Měsíční rekapitulace'!$Q$3:$Q$999,\"0,0;0;0;\\0\")))","v":0},0]
[{"$f":"IFERROR(INDEX('Měsíční rekapitulace'!A$3:A$999,SMALL(IF(('Měsíční rekapitulace'!A$3:A$999<>\"\")*('Měsíční rekapitulace'!A$3:A$999<>'Měsíční rekapitulace'!$A$2)*(COUNTIF(A$5:A87,'Měsíční rekapitulace'!A$3:A$999)=0),ROW('Měsíční rekapitulace'!A$3:A$999)-2),1)),\"\")","v":""},{"$f":"IFERROR(INDEX('Měsíční rekapitulace'!E$3:E$999,MATCH(A88,'Měsíční rekapitulace'!A$3:A$999,)),\"\")","v":""},null,{"$f":"IF($A88=\"\",,SUMPRODUCT((LOOKUP(ROW(D$1:D$997),ROW(D$1:D$997)/ISNUMBER('Měsíční rekapitulace'!$L$1:$L$997),'Měsíční rekapitulace'!$L$1:$L$997)=D$4)*('Měsíční rekapitulace'!$A$3:$A$999=$A88)*TEXT('Měsíční rekapitulace'!$Q$3:$Q$999,\"0,0;0;0;\\0\")))","v":0},{"$f":"IF($A88=\"\",,SUMPRODUCT((LOOKUP(ROW(E$1:E$997),ROW(E$1:E$997)/ISNUMBER('Měsíční rekapitulace'!$L$1:$L$997),'Měsíční rekapitulace'!$L$1:$L$997)=E$4)*('Měsíční rekapitulace'!$A$3:$A$999=$A88)*TEXT('Měsíční rekapitulace'!$Q$3:$Q$999,\"0,0;0;0;\\0\")))","v":0},{"$f":"IF($A88=\"\",,SUMPRODUCT((LOOKUP(ROW(F$1:F$997),ROW(F$1:F$997)/ISNUMBER('Měsíční rekapitulace'!$L$1:$L$997),'Měsíční rekapitulace'!$L$1:$L$997)=F$4)*('Měsíční rekapitulace'!$A$3:$A$999=$A88)*TEXT('Měsíční rekapitulace'!$Q$3:$Q$999,\"0,0;0;0;\\0\")))","v":0},{"$f":"IF($A88=\"\",,SUMPRODUCT((LOOKUP(ROW(G$1:G$997),ROW(G$1:G$997)/ISNUMBER('Měsíční rekapitulace'!$L$1:$L$997),'Měsíční rekapitulace'!$L$1:$L$997)=G$4)*('Měsíční rekapitulace'!$A$3:$A$999=$A88)*TEXT('Měsíční rekapitulace'!$Q$3:$Q$999,\"0,0;0;0;\\0\")))","v":0},{"$f":"IF($A88=\"\",,SUMPRODUCT((LOOKUP(ROW(H$1:H$997),ROW(H$1:H$997)/ISNUMBER('Měsíční rekapitulace'!$L$1:$L$997),'Měsíční rekapitulace'!$L$1:$L$997)=H$4)*('Měsíční rekapitulace'!$A$3:$A$999=$A88)*TEXT('Měsíční rekapitulace'!$Q$3:$Q$999,\"0,0;0;0;\\0\")))","v":0},{"$f":"IF($A88=\"\",,SUMPRODUCT((LOOKUP(ROW(I$1:I$997),ROW(I$1:I$997)/ISNUMBER('Měsíční rekapitulace'!$L$1:$L$997),'Měsíční rekapitulace'!$L$1:$L$997)=I$4)*('Měsíční rekapitulace'!$A$3:$A$999=$A88)*TEXT('Měsíční rekapitulace'!$Q$3:$Q$999,\"0,0;0;0;\\0\")))","v":0},{"$f":"IF($A88=\"\",,SUMPRODUCT((LOOKUP(ROW(J$1:J$997),ROW(J$1:J$997)/ISNUMBER('Měsíční rekapitulace'!$L$1:$L$997),'Měsíční rekapitulace'!$L$1:$L$997)=J$4)*('Měsíční rekapitulace'!$A$3:$A$999=$A88)*TEXT('Měsíční rekapitulace'!$Q$3:$Q$999,\"0,0;0;0;\\0\")))","v":0},{"$f":"IF($A88=\"\",,SUMPRODUCT((LOOKUP(ROW(K$1:K$997),ROW(K$1:K$997)/ISNUMBER('Měsíční rekapitulace'!$L$1:$L$997),'Měsíční rekapitulace'!$L$1:$L$997)=K$4)*('Měsíční rekapitulace'!$A$3:$A$999=$A88)*TEXT('Měsíční rekapitulace'!$Q$3:$Q$999,\"0,0;0;0;\\0\")))","v":0},{"$f":"IF($A88=\"\",,SUMPRODUCT((LOOKUP(ROW(L$1:L$997),ROW(L$1:L$997)/ISNUMBER('Měsíční rekapitulace'!$L$1:$L$997),'Měsíční rekapitulace'!$L$1:$L$997)=L$4)*('Měsíční rekapitulace'!$A$3:$A$999=$A88)*TEXT('Měsíční rekapitulace'!$Q$3:$Q$999,\"0,0;0;0;\\0\")))","v":0},{"$f":"IF($A88=\"\",,SUMPRODUCT((LOOKUP(ROW(M$1:M$997),ROW(M$1:M$997)/ISNUMBER('Měsíční rekapitulace'!$L$1:$L$997),'Měsíční rekapitulace'!$L$1:$L$997)=M$4)*('Měsíční rekapitulace'!$A$3:$A$999=$A88)*TEXT('Měsíční rekapitulace'!$Q$3:$Q$999,\"0,0;0;0;\\0\")))","v":0},{"$f":"IF($A88=\"\",,SUMPRODUCT((LOOKUP(ROW(N$1:N$997),ROW(N$1:N$997)/ISNUMBER('Měsíční rekapitulace'!$L$1:$L$997),'Měsíční rekapitulace'!$L$1:$L$997)=N$4)*('Měsíční rekapitulace'!$A$3:$A$999=$A88)*TEXT('Měsíční rekapitulace'!$Q$3:$Q$999,\"0,0;0;0;\\0\")))","v":0},{"$f":"IF($A88=\"\",,SUMPRODUCT((LOOKUP(ROW(O$1:O$997),ROW(O$1:O$997)/ISNUMBER('Měsíční rekapitulace'!$L$1:$L$997),'Měsíční rekapitulace'!$L$1:$L$997)=O$4)*('Měsíční rekapitulace'!$A$3:$A$999=$A88)*TEXT('Měsíční rekapitulace'!$Q$3:$Q$999,\"0,0;0;0;\\0\")))","v":0},0]
[{"$f":"IFERROR(INDEX('Měsíční rekapitulace'!A$3:A$999,SMALL(IF(('Měsíční rekapitulace'!A$3:A$999<>\"\")*('Měsíční rekapitulace'!A$3:A$999<>'Měsíční rekapitulace'!$A$2)*(COUNTIF(A$5:A88,'Měsíční rekapitulace'!A$3:A$999)=0),ROW('Měsíční rekapitulace'!A$3:A$999)-2),1)),\"\")","v":""},{"$f":"IFERROR(INDEX('Měsíční rekapitulace'!E$3:E$999,MATCH(A89,'Měsíční rekapitulace'!A$3:A$999,)),\"\")","v":""},null,{"$f":"IF($A89=\"\",,SUMPRODUCT((LOOKUP(ROW(D$1:D$997),ROW(D$1:D$997)/ISNUMBER('Měsíční rekapitulace'!$L$1:$L$997),'Měsíční rekapitulace'!$L$1:$L$997)=D$4)*('Měsíční rekapitulace'!$A$3:$A$999=$A89)*TEXT('Měsíční rekapitulace'!$Q$3:$Q$999,\"0,0;0;0;\\0\")))","v":0},{"$f":"IF($A89=\"\",,SUMPRODUCT((LOOKUP(ROW(E$1:E$997),ROW(E$1:E$997)/ISNUMBER('Měsíční rekapitulace'!$L$1:$L$997),'Měsíční rekapitulace'!$L$1:$L$997)=E$4)*('Měsíční rekapitulace'!$A$3:$A$999=$A89)*TEXT('Měsíční rekapitulace'!$Q$3:$Q$999,\"0,0;0;0;\\0\")))","v":0},{"$f":"IF($A89=\"\",,SUMPRODUCT((LOOKUP(ROW(F$1:F$997),ROW(F$1:F$997)/ISNUMBER('Měsíční rekapitulace'!$L$1:$L$997),'Měsíční rekapitulace'!$L$1:$L$997)=F$4)*('Měsíční rekapitulace'!$A$3:$A$999=$A89)*TEXT('Měsíční rekapitulace'!$Q$3:$Q$999,\"0,0;0;0;\\0\")))","v":0},{"$f":"IF($A89=\"\",,SUMPRODUCT((LOOKUP(ROW(G$1:G$997),ROW(G$1:G$997)/ISNUMBER('Měsíční rekapitulace'!$L$1:$L$997),'Měsíční rekapitulace'!$L$1:$L$997)=G$4)*('Měsíční rekapitulace'!$A$3:$A$999=$A89)*TEXT('Měsíční rekapitulace'!$Q$3:$Q$999,\"0,0;0;0;\\0\")))","v":0},{"$f":"IF($A89=\"\",,SUMPRODUCT((LOOKUP(ROW(H$1:H$997),ROW(H$1:H$997)/ISNUMBER('Měsíční rekapitulace'!$L$1:$L$997),'Měsíční rekapitulace'!$L$1:$L$997)=H$4)*('Měsíční rekapitulace'!$A$3:$A$999=$A89)*TEXT('Měsíční rekapitulace'!$Q$3:$Q$999,\"0,0;0;0;\\0\")))","v":0},{"$f":"IF($A89=\"\",,SUMPRODUCT((LOOKUP(ROW(I$1:I$997),ROW(I$1:I$997)/ISNUMBER('Měsíční rekapitulace'!$L$1:$L$997),'Měsíční rekapitulace'!$L$1:$L$997)=I$4)*('Měsíční rekapitulace'!$A$3:$A$999=$A89)*TEXT('Měsíční rekapitulace'!$Q$3:$Q$999,\"0,0;0;0;\\0\")))","v":0},{"$f":"IF($A89=\"\",,SUMPRODUCT((LOOKUP(ROW(J$1:J$997),ROW(J$1:J$997)/ISNUMBER('Měsíční rekapitulace'!$L$1:$L$997),'Měsíční rekapitulace'!$L$1:$L$997)=J$4)*('Měsíční rekapitulace'!$A$3:$A$999=$A89)*TEXT('Měsíční rekapitulace'!$Q$3:$Q$999,\"0,0;0;0;\\0\")))","v":0},{"$f":"IF($A89=\"\",,SUMPRODUCT((LOOKUP(ROW(K$1:K$997),ROW(K$1:K$997)/ISNUMBER('Měsíční rekapitulace'!$L$1:$L$997),'Měsíční rekapitulace'!$L$1:$L$997)=K$4)*('Měsíční rekapitulace'!$A$3:$A$999=$A89)*TEXT('Měsíční rekapitulace'!$Q$3:$Q$999,\"0,0;0;0;\\0\")))","v":0},{"$f":"IF($A89=\"\",,SUMPRODUCT((LOOKUP(ROW(L$1:L$997),ROW(L$1:L$997)/ISNUMBER('Měsíční rekapitulace'!$L$1:$L$997),'Měsíční rekapitulace'!$L$1:$L$997)=L$4)*('Měsíční rekapitulace'!$A$3:$A$999=$A89)*TEXT('Měsíční rekapitulace'!$Q$3:$Q$999,\"0,0;0;0;\\0\")))","v":0},{"$f":"IF($A89=\"\",,SUMPRODUCT((LOOKUP(ROW(M$1:M$997),ROW(M$1:M$997)/ISNUMBER('Měsíční rekapitulace'!$L$1:$L$997),'Měsíční rekapitulace'!$L$1:$L$997)=M$4)*('Měsíční rekapitulace'!$A$3:$A$999=$A89)*TEXT('Měsíční rekapitulace'!$Q$3:$Q$999,\"0,0;0;0;\\0\")))","v":0},{"$f":"IF($A89=\"\",,SUMPRODUCT((LOOKUP(ROW(N$1:N$997),ROW(N$1:N$997)/ISNUMBER('Měsíční rekapitulace'!$L$1:$L$997),'Měsíční rekapitulace'!$L$1:$L$997)=N$4)*('Měsíční rekapitulace'!$A$3:$A$999=$A89)*TEXT('Měsíční rekapitulace'!$Q$3:$Q$999,\"0,0;0;0;\\0\")))","v":0},{"$f":"IF($A89=\"\",,SUMPRODUCT((LOOKUP(ROW(O$1:O$997),ROW(O$1:O$997)/ISNUMBER('Měsíční rekapitulace'!$L$1:$L$997),'Měsíční rekapitulace'!$L$1:$L$997)=O$4)*('Měsíční rekapitulace'!$A$3:$A$999=$A89)*TEXT('Měsíční rekapitulace'!$Q$3:$Q$999,\"0,0;0;0;\\0\")))","v":0},0]
[{"$f":"IFERROR(INDEX('Měsíční rekapitulace'!A$3:A$999,SMALL(IF(('Měsíční rekapitulace'!A$3:A$999<>\"\")*('Měsíční rekapitulace'!A$3:A$999<>'Měsíční rekapitulace'!$A$2)*(COUNTIF(A$5:A89,'Měsíční rekapitulace'!A$3:A$999)=0),ROW('Měsíční rekapitulace'!A$3:A$999)-2),1)),\"\")","v":""},{"$f":"IFERROR(INDEX('Měsíční rekapitulace'!E$3:E$999,MATCH(A90,'Měsíční rekapitulace'!A$3:A$999,)),\"\")","v":""},null,{"$f":"IF($A90=\"\",,SUMPRODUCT((LOOKUP(ROW(D$1:D$997),ROW(D$1:D$997)/ISNUMBER('Měsíční rekapitulace'!$L$1:$L$997),'Měsíční rekapitulace'!$L$1:$L$997)=D$4)*('Měsíční rekapitulace'!$A$3:$A$999=$A90)*TEXT('Měsíční rekapitulace'!$Q$3:$Q$999,\"0,0;0;0;\\0\")))","v":0},{"$f":"IF($A90=\"\",,SUMPRODUCT((LOOKUP(ROW(E$1:E$997),ROW(E$1:E$997)/ISNUMBER('Měsíční rekapitulace'!$L$1:$L$997),'Měsíční rekapitulace'!$L$1:$L$997)=E$4)*('Měsíční rekapitulace'!$A$3:$A$999=$A90)*TEXT('Měsíční rekapitulace'!$Q$3:$Q$999,\"0,0;0;0;\\0\")))","v":0},{"$f":"IF($A90=\"\",,SUMPRODUCT((LOOKUP(ROW(F$1:F$997),ROW(F$1:F$997)/ISNUMBER('Měsíční rekapitulace'!$L$1:$L$997),'Měsíční rekapitulace'!$L$1:$L$997)=F$4)*('Měsíční rekapitulace'!$A$3:$A$999=$A90)*TEXT('Měsíční rekapitulace'!$Q$3:$Q$999,\"0,0;0;0;\\0\")))","v":0},{"$f":"IF($A90=\"\",,SUMPRODUCT((LOOKUP(ROW(G$1:G$997),ROW(G$1:G$997)/ISNUMBER('Měsíční rekapitulace'!$L$1:$L$997),'Měsíční rekapitulace'!$L$1:$L$997)=G$4)*('Měsíční rekapitulace'!$A$3:$A$999=$A90)*TEXT('Měsíční rekapitulace'!$Q$3:$Q$999,\"0,0;0;0;\\0\")))","v":0},{"$f":"IF($A90=\"\",,SUMPRODUCT((LOOKUP(ROW(H$1:H$997),ROW(H$1:H$997)/ISNUMBER('Měsíční rekapitulace'!$L$1:$L$997),'Měsíční rekapitulace'!$L$1:$L$997)=H$4)*('Měsíční rekapitulace'!$A$3:$A$999=$A90)*TEXT('Měsíční rekapitulace'!$Q$3:$Q$999,\"0,0;0;0;\\0\")))","v":0},{"$f":"IF($A90=\"\",,SUMPRODUCT((LOOKUP(ROW(I$1:I$997),ROW(I$1:I$997)/ISNUMBER('Měsíční rekapitulace'!$L$1:$L$997),'Měsíční rekapitulace'!$L$1:$L$997)=I$4)*('Měsíční rekapitulace'!$A$3:$A$999=$A90)*TEXT('Měsíční rekapitulace'!$Q$3:$Q$999,\"0,0;0;0;\\0\")))","v":0},{"$f":"IF($A90=\"\",,SUMPRODUCT((LOOKUP(ROW(J$1:J$997),ROW(J$1:J$997)/ISNUMBER('Měsíční rekapitulace'!$L$1:$L$997),'Měsíční rekapitulace'!$L$1:$L$997)=J$4)*('Měsíční rekapitulace'!$A$3:$A$999=$A90)*TEXT('Měsíční rekapitulace'!$Q$3:$Q$999,\"0,0;0;0;\\0\")))","v":0},{"$f":"IF($A90=\"\",,SUMPRODUCT((LOOKUP(ROW(K$1:K$997),ROW(K$1:K$997)/ISNUMBER('Měsíční rekapitulace'!$L$1:$L$997),'Měsíční rekapitulace'!$L$1:$L$997)=K$4)*('Měsíční rekapitulace'!$A$3:$A$999=$A90)*TEXT('Měsíční rekapitulace'!$Q$3:$Q$999,\"0,0;0;0;\\0\")))","v":0},{"$f":"IF($A90=\"\",,SUMPRODUCT((LOOKUP(ROW(L$1:L$997),ROW(L$1:L$997)/ISNUMBER('Měsíční rekapitulace'!$L$1:$L$997),'Měsíční rekapitulace'!$L$1:$L$997)=L$4)*('Měsíční rekapitulace'!$A$3:$A$999=$A90)*TEXT('Měsíční rekapitulace'!$Q$3:$Q$999,\"0,0;0;0;\\0\")))","v":0},{"$f":"IF($A90=\"\",,SUMPRODUCT((LOOKUP(ROW(M$1:M$997),ROW(M$1:M$997)/ISNUMBER('Měsíční rekapitulace'!$L$1:$L$997),'Měsíční rekapitulace'!$L$1:$L$997)=M$4)*('Měsíční rekapitulace'!$A$3:$A$999=$A90)*TEXT('Měsíční rekapitulace'!$Q$3:$Q$999,\"0,0;0;0;\\0\")))","v":0},{"$f":"IF($A90=\"\",,SUMPRODUCT((LOOKUP(ROW(N$1:N$997),ROW(N$1:N$997)/ISNUMBER('Měsíční rekapitulace'!$L$1:$L$997),'Měsíční rekapitulace'!$L$1:$L$997)=N$4)*('Měsíční rekapitulace'!$A$3:$A$999=$A90)*TEXT('Měsíční rekapitulace'!$Q$3:$Q$999,\"0,0;0;0;\\0\")))","v":0},{"$f":"IF($A90=\"\",,SUMPRODUCT((LOOKUP(ROW(O$1:O$997),ROW(O$1:O$997)/ISNUMBER('Měsíční rekapitulace'!$L$1:$L$997),'Měsíční rekapitulace'!$L$1:$L$997)=O$4)*('Měsíční rekapitulace'!$A$3:$A$999=$A90)*TEXT('Měsíční rekapitulace'!$Q$3:$Q$999,\"0,0;0;0;\\0\")))","v":0},0]
[{"$f":"IFERROR(INDEX('Měsíční rekapitulace'!A$3:A$999,SMALL(IF(('Měsíční rekapitulace'!A$3:A$999<>\"\")*('Měsíční rekapitulace'!A$3:A$999<>'Měsíční rekapitulace'!$A$2)*(COUNTIF(A$5:A90,'Měsíční rekapitulace'!A$3:A$999)=0),ROW('Měsíční rekapitulace'!A$3:A$999)-2),1)),\"\")","v":""},{"$f":"IFERROR(INDEX('Měsíční rekapitulace'!E$3:E$999,MATCH(A91,'Měsíční rekapitulace'!A$3:A$999,)),\"\")","v":""},null,{"$f":"IF($A91=\"\",,SUMPRODUCT((LOOKUP(ROW(D$1:D$997),ROW(D$1:D$997)/ISNUMBER('Měsíční rekapitulace'!$L$1:$L$997),'Měsíční rekapitulace'!$L$1:$L$997)=D$4)*('Měsíční rekapitulace'!$A$3:$A$999=$A91)*TEXT('Měsíční rekapitulace'!$Q$3:$Q$999,\"0,0;0;0;\\0\")))","v":0},{"$f":"IF($A91=\"\",,SUMPRODUCT((LOOKUP(ROW(E$1:E$997),ROW(E$1:E$997)/ISNUMBER('Měsíční rekapitulace'!$L$1:$L$997),'Měsíční rekapitulace'!$L$1:$L$997)=E$4)*('Měsíční rekapitulace'!$A$3:$A$999=$A91)*TEXT('Měsíční rekapitulace'!$Q$3:$Q$999,\"0,0;0;0;\\0\")))","v":0},{"$f":"IF($A91=\"\",,SUMPRODUCT((LOOKUP(ROW(F$1:F$997),ROW(F$1:F$997)/ISNUMBER('Měsíční rekapitulace'!$L$1:$L$997),'Měsíční rekapitulace'!$L$1:$L$997)=F$4)*('Měsíční rekapitulace'!$A$3:$A$999=$A91)*TEXT('Měsíční rekapitulace'!$Q$3:$Q$999,\"0,0;0;0;\\0\")))","v":0},{"$f":"IF($A91=\"\",,SUMPRODUCT((LOOKUP(ROW(G$1:G$997),ROW(G$1:G$997)/ISNUMBER('Měsíční rekapitulace'!$L$1:$L$997),'Měsíční rekapitulace'!$L$1:$L$997)=G$4)*('Měsíční rekapitulace'!$A$3:$A$999=$A91)*TEXT('Měsíční rekapitulace'!$Q$3:$Q$999,\"0,0;0;0;\\0\")))","v":0},{"$f":"IF($A91=\"\",,SUMPRODUCT((LOOKUP(ROW(H$1:H$997),ROW(H$1:H$997)/ISNUMBER('Měsíční rekapitulace'!$L$1:$L$997),'Měsíční rekapitulace'!$L$1:$L$997)=H$4)*('Měsíční rekapitulace'!$A$3:$A$999=$A91)*TEXT('Měsíční rekapitulace'!$Q$3:$Q$999,\"0,0;0;0;\\0\")))","v":0},{"$f":"IF($A91=\"\",,SUMPRODUCT((LOOKUP(ROW(I$1:I$997),ROW(I$1:I$997)/ISNUMBER('Měsíční rekapitulace'!$L$1:$L$997),'Měsíční rekapitulace'!$L$1:$L$997)=I$4)*('Měsíční rekapitulace'!$A$3:$A$999=$A91)*TEXT('Měsíční rekapitulace'!$Q$3:$Q$999,\"0,0;0;0;\\0\")))","v":0},{"$f":"IF($A91=\"\",,SUMPRODUCT((LOOKUP(ROW(J$1:J$997),ROW(J$1:J$997)/ISNUMBER('Měsíční rekapitulace'!$L$1:$L$997),'Měsíční rekapitulace'!$L$1:$L$997)=J$4)*('Měsíční rekapitulace'!$A$3:$A$999=$A91)*TEXT('Měsíční rekapitulace'!$Q$3:$Q$999,\"0,0;0;0;\\0\")))","v":0},{"$f":"IF($A91=\"\",,SUMPRODUCT((LOOKUP(ROW(K$1:K$997),ROW(K$1:K$997)/ISNUMBER('Měsíční rekapitulace'!$L$1:$L$997),'Měsíční rekapitulace'!$L$1:$L$997)=K$4)*('Měsíční rekapitulace'!$A$3:$A$999=$A91)*TEXT('Měsíční rekapitulace'!$Q$3:$Q$999,\"0,0;0;0;\\0\")))","v":0},{"$f":"IF($A91=\"\",,SUMPRODUCT((LOOKUP(ROW(L$1:L$997),ROW(L$1:L$997)/ISNUMBER('Měsíční rekapitulace'!$L$1:$L$997),'Měsíční rekapitulace'!$L$1:$L$997)=L$4)*('Měsíční rekapitulace'!$A$3:$A$999=$A91)*TEXT('Měsíční rekapitulace'!$Q$3:$Q$999,\"0,0;0;0;\\0\")))","v":0},{"$f":"IF($A91=\"\",,SUMPRODUCT((LOOKUP(ROW(M$1:M$997),ROW(M$1:M$997)/ISNUMBER('Měsíční rekapitulace'!$L$1:$L$997),'Měsíční rekapitulace'!$L$1:$L$997)=M$4)*('Měsíční rekapitulace'!$A$3:$A$999=$A91)*TEXT('Měsíční rekapitulace'!$Q$3:$Q$999,\"0,0;0;0;\\0\")))","v":0},{"$f":"IF($A91=\"\",,SUMPRODUCT((LOOKUP(ROW(N$1:N$997),ROW(N$1:N$997)/ISNUMBER('Měsíční rekapitulace'!$L$1:$L$997),'Měsíční rekapitulace'!$L$1:$L$997)=N$4)*('Měsíční rekapitulace'!$A$3:$A$999=$A91)*TEXT('Měsíční rekapitulace'!$Q$3:$Q$999,\"0,0;0;0;\\0\")))","v":0},{"$f":"IF($A91=\"\",,SUMPRODUCT((LOOKUP(ROW(O$1:O$997),ROW(O$1:O$997)/ISNUMBER('Měsíční rekapitulace'!$L$1:$L$997),'Měsíční rekapitulace'!$L$1:$L$997)=O$4)*('Měsíční rekapitulace'!$A$3:$A$999=$A91)*TEXT('Měsíční rekapitulace'!$Q$3:$Q$999,\"0,0;0;0;\\0\")))","v":0},0]
[{"$f":"IFERROR(INDEX('Měsíční rekapitulace'!A$3:A$999,SMALL(IF(('Měsíční rekapitulace'!A$3:A$999<>\"\")*('Měsíční rekapitulace'!A$3:A$999<>'Měsíční rekapitulace'!$A$2)*(COUNTIF(A$5:A91,'Měsíční rekapitulace'!A$3:A$999)=0),ROW('Měsíční rekapitulace'!A$3:A$999)-2),1)),\"\")","v":""},{"$f":"IFERROR(INDEX('Měsíční rekapitulace'!E$3:E$999,MATCH(A92,'Měsíční rekapitulace'!A$3:A$999,)),\"\")","v":""},null,{"$f":"IF($A92=\"\",,SUMPRODUCT((LOOKUP(ROW(D$1:D$997),ROW(D$1:D$997)/ISNUMBER('Měsíční rekapitulace'!$L$1:$L$997),'Měsíční rekapitulace'!$L$1:$L$997)=D$4)*('Měsíční rekapitulace'!$A$3:$A$999=$A92)*TEXT('Měsíční rekapitulace'!$Q$3:$Q$999,\"0,0;0;0;\\0\")))","v":0},{"$f":"IF($A92=\"\",,SUMPRODUCT((LOOKUP(ROW(E$1:E$997),ROW(E$1:E$997)/ISNUMBER('Měsíční rekapitulace'!$L$1:$L$997),'Měsíční rekapitulace'!$L$1:$L$997)=E$4)*('Měsíční rekapitulace'!$A$3:$A$999=$A92)*TEXT('Měsíční rekapitulace'!$Q$3:$Q$999,\"0,0;0;0;\\0\")))","v":0},{"$f":"IF($A92=\"\",,SUMPRODUCT((LOOKUP(ROW(F$1:F$997),ROW(F$1:F$997)/ISNUMBER('Měsíční rekapitulace'!$L$1:$L$997),'Měsíční rekapitulace'!$L$1:$L$997)=F$4)*('Měsíční rekapitulace'!$A$3:$A$999=$A92)*TEXT('Měsíční rekapitulace'!$Q$3:$Q$999,\"0,0;0;0;\\0\")))","v":0},{"$f":"IF($A92=\"\",,SUMPRODUCT((LOOKUP(ROW(G$1:G$997),ROW(G$1:G$997)/ISNUMBER('Měsíční rekapitulace'!$L$1:$L$997),'Měsíční rekapitulace'!$L$1:$L$997)=G$4)*('Měsíční rekapitulace'!$A$3:$A$999=$A92)*TEXT('Měsíční rekapitulace'!$Q$3:$Q$999,\"0,0;0;0;\\0\")))","v":0},{"$f":"IF($A92=\"\",,SUMPRODUCT((LOOKUP(ROW(H$1:H$997),ROW(H$1:H$997)/ISNUMBER('Měsíční rekapitulace'!$L$1:$L$997),'Měsíční rekapitulace'!$L$1:$L$997)=H$4)*('Měsíční rekapitulace'!$A$3:$A$999=$A92)*TEXT('Měsíční rekapitulace'!$Q$3:$Q$999,\"0,0;0;0;\\0\")))","v":0},{"$f":"IF($A92=\"\",,SUMPRODUCT((LOOKUP(ROW(I$1:I$997),ROW(I$1:I$997)/ISNUMBER('Měsíční rekapitulace'!$L$1:$L$997),'Měsíční rekapitulace'!$L$1:$L$997)=I$4)*('Měsíční rekapitulace'!$A$3:$A$999=$A92)*TEXT('Měsíční rekapitulace'!$Q$3:$Q$999,\"0,0;0;0;\\0\")))","v":0},{"$f":"IF($A92=\"\",,SUMPRODUCT((LOOKUP(ROW(J$1:J$997),ROW(J$1:J$997)/ISNUMBER('Měsíční rekapitulace'!$L$1:$L$997),'Měsíční rekapitulace'!$L$1:$L$997)=J$4)*('Měsíční rekapitulace'!$A$3:$A$999=$A92)*TEXT('Měsíční rekapitulace'!$Q$3:$Q$999,\"0,0;0;0;\\0\")))","v":0},{"$f":"IF($A92=\"\",,SUMPRODUCT((LOOKUP(ROW(K$1:K$997),ROW(K$1:K$997)/ISNUMBER('Měsíční rekapitulace'!$L$1:$L$997),'Měsíční rekapitulace'!$L$1:$L$997)=K$4)*('Měsíční rekapitulace'!$A$3:$A$999=$A92)*TEXT('Měsíční rekapitulace'!$Q$3:$Q$999,\"0,0;0;0;\\0\")))","v":0},{"$f":"IF($A92=\"\",,SUMPRODUCT((LOOKUP(ROW(L$1:L$997),ROW(L$1:L$997)/ISNUMBER('Měsíční rekapitulace'!$L$1:$L$997),'Měsíční rekapitulace'!$L$1:$L$997)=L$4)*('Měsíční rekapitulace'!$A$3:$A$999=$A92)*TEXT('Měsíční rekapitulace'!$Q$3:$Q$999,\"0,0;0;0;\\0\")))","v":0},{"$f":"IF($A92=\"\",,SUMPRODUCT((LOOKUP(ROW(M$1:M$997),ROW(M$1:M$997)/ISNUMBER('Měsíční rekapitulace'!$L$1:$L$997),'Měsíční rekapitulace'!$L$1:$L$997)=M$4)*('Měsíční rekapitulace'!$A$3:$A$999=$A92)*TEXT('Měsíční rekapitulace'!$Q$3:$Q$999,\"0,0;0;0;\\0\")))","v":0},{"$f":"IF($A92=\"\",,SUMPRODUCT((LOOKUP(ROW(N$1:N$997),ROW(N$1:N$997)/ISNUMBER('Měsíční rekapitulace'!$L$1:$L$997),'Měsíční rekapitulace'!$L$1:$L$997)=N$4)*('Měsíční rekapitulace'!$A$3:$A$999=$A92)*TEXT('Měsíční rekapitulace'!$Q$3:$Q$999,\"0,0;0;0;\\0\")))","v":0},{"$f":"IF($A92=\"\",,SUMPRODUCT((LOOKUP(ROW(O$1:O$997),ROW(O$1:O$997)/ISNUMBER('Měsíční rekapitulace'!$L$1:$L$997),'Měsíční rekapitulace'!$L$1:$L$997)=O$4)*('Měsíční rekapitulace'!$A$3:$A$999=$A92)*TEXT('Měsíční rekapitulace'!$Q$3:$Q$999,\"0,0;0;0;\\0\")))","v":0},0]
[{"$f":"IFERROR(INDEX('Měsíční rekapitulace'!A$3:A$999,SMALL(IF(('Měsíční rekapitulace'!A$3:A$999<>\"\")*('Měsíční rekapitulace'!A$3:A$999<>'Měsíční rekapitulace'!$A$2)*(COUNTIF(A$5:A92,'Měsíční rekapitulace'!A$3:A$999)=0),ROW('Měsíční rekapitulace'!A$3:A$999)-2),1)),\"\")","v":""},{"$f":"IFERROR(INDEX('Měsíční rekapitulace'!E$3:E$999,MATCH(A93,'Měsíční rekapitulace'!A$3:A$999,)),\"\")","v":""},null,{"$f":"IF($A93=\"\",,SUMPRODUCT((LOOKUP(ROW(D$1:D$997),ROW(D$1:D$997)/ISNUMBER('Měsíční rekapitulace'!$L$1:$L$997),'Měsíční rekapitulace'!$L$1:$L$997)=D$4)*('Měsíční rekapitulace'!$A$3:$A$999=$A93)*TEXT('Měsíční rekapitulace'!$Q$3:$Q$999,\"0,0;0;0;\\0\")))","v":0},{"$f":"IF($A93=\"\",,SUMPRODUCT((LOOKUP(ROW(E$1:E$997),ROW(E$1:E$997)/ISNUMBER('Měsíční rekapitulace'!$L$1:$L$997),'Měsíční rekapitulace'!$L$1:$L$997)=E$4)*('Měsíční rekapitulace'!$A$3:$A$999=$A93)*TEXT('Měsíční rekapitulace'!$Q$3:$Q$999,\"0,0;0;0;\\0\")))","v":0},{"$f":"IF($A93=\"\",,SUMPRODUCT((LOOKUP(ROW(F$1:F$997),ROW(F$1:F$997)/ISNUMBER('Měsíční rekapitulace'!$L$1:$L$997),'Měsíční rekapitulace'!$L$1:$L$997)=F$4)*('Měsíční rekapitulace'!$A$3:$A$999=$A93)*TEXT('Měsíční rekapitulace'!$Q$3:$Q$999,\"0,0;0;0;\\0\")))","v":0},{"$f":"IF($A93=\"\",,SUMPRODUCT((LOOKUP(ROW(G$1:G$997),ROW(G$1:G$997)/ISNUMBER('Měsíční rekapitulace'!$L$1:$L$997),'Měsíční rekapitulace'!$L$1:$L$997)=G$4)*('Měsíční rekapitulace'!$A$3:$A$999=$A93)*TEXT('Měsíční rekapitulace'!$Q$3:$Q$999,\"0,0;0;0;\\0\")))","v":0},{"$f":"IF($A93=\"\",,SUMPRODUCT((LOOKUP(ROW(H$1:H$997),ROW(H$1:H$997)/ISNUMBER('Měsíční rekapitulace'!$L$1:$L$997),'Měsíční rekapitulace'!$L$1:$L$997)=H$4)*('Měsíční rekapitulace'!$A$3:$A$999=$A93)*TEXT('Měsíční rekapitulace'!$Q$3:$Q$999,\"0,0;0;0;\\0\")))","v":0},{"$f":"IF($A93=\"\",,SUMPRODUCT((LOOKUP(ROW(I$1:I$997),ROW(I$1:I$997)/ISNUMBER('Měsíční rekapitulace'!$L$1:$L$997),'Měsíční rekapitulace'!$L$1:$L$997)=I$4)*('Měsíční rekapitulace'!$A$3:$A$999=$A93)*TEXT('Měsíční rekapitulace'!$Q$3:$Q$999,\"0,0;0;0;\\0\")))","v":0},{"$f":"IF($A93=\"\",,SUMPRODUCT((LOOKUP(ROW(J$1:J$997),ROW(J$1:J$997)/ISNUMBER('Měsíční rekapitulace'!$L$1:$L$997),'Měsíční rekapitulace'!$L$1:$L$997)=J$4)*('Měsíční rekapitulace'!$A$3:$A$999=$A93)*TEXT('Měsíční rekapitulace'!$Q$3:$Q$999,\"0,0;0;0;\\0\")))","v":0},{"$f":"IF($A93=\"\",,SUMPRODUCT((LOOKUP(ROW(K$1:K$997),ROW(K$1:K$997)/ISNUMBER('Měsíční rekapitulace'!$L$1:$L$997),'Měsíční rekapitulace'!$L$1:$L$997)=K$4)*('Měsíční rekapitulace'!$A$3:$A$999=$A93)*TEXT('Měsíční rekapitulace'!$Q$3:$Q$999,\"0,0;0;0;\\0\")))","v":0},{"$f":"IF($A93=\"\",,SUMPRODUCT((LOOKUP(ROW(L$1:L$997),ROW(L$1:L$997)/ISNUMBER('Měsíční rekapitulace'!$L$1:$L$997),'Měsíční rekapitulace'!$L$1:$L$997)=L$4)*('Měsíční rekapitulace'!$A$3:$A$999=$A93)*TEXT('Měsíční rekapitulace'!$Q$3:$Q$999,\"0,0;0;0;\\0\")))","v":0},{"$f":"IF($A93=\"\",,SUMPRODUCT((LOOKUP(ROW(M$1:M$997),ROW(M$1:M$997)/ISNUMBER('Měsíční rekapitulace'!$L$1:$L$997),'Měsíční rekapitulace'!$L$1:$L$997)=M$4)*('Měsíční rekapitulace'!$A$3:$A$999=$A93)*TEXT('Měsíční rekapitulace'!$Q$3:$Q$999,\"0,0;0;0;\\0\")))","v":0},{"$f":"IF($A93=\"\",,SUMPRODUCT((LOOKUP(ROW(N$1:N$997),ROW(N$1:N$997)/ISNUMBER('Měsíční rekapitulace'!$L$1:$L$997),'Měsíční rekapitulace'!$L$1:$L$997)=N$4)*('Měsíční rekapitulace'!$A$3:$A$999=$A93)*TEXT('Měsíční rekapitulace'!$Q$3:$Q$999,\"0,0;0;0;\\0\")))","v":0},{"$f":"IF($A93=\"\",,SUMPRODUCT((LOOKUP(ROW(O$1:O$997),ROW(O$1:O$997)/ISNUMBER('Měsíční rekapitulace'!$L$1:$L$997),'Měsíční rekapitulace'!$L$1:$L$997)=O$4)*('Měsíční rekapitulace'!$A$3:$A$999=$A93)*TEXT('Měsíční rekapitulace'!$Q$3:$Q$999,\"0,0;0;0;\\0\")))","v":0},0]
[{"$f":"IFERROR(INDEX('Měsíční rekapitulace'!A$3:A$999,SMALL(IF(('Měsíční rekapitulace'!A$3:A$999<>\"\")*('Měsíční rekapitulace'!A$3:A$999<>'Měsíční rekapitulace'!$A$2)*(COUNTIF(A$5:A93,'Měsíční rekapitulace'!A$3:A$999)=0),ROW('Měsíční rekapitulace'!A$3:A$999)-2),1)),\"\")","v":""},{"$f":"IFERROR(INDEX('Měsíční rekapitulace'!E$3:E$999,MATCH(A94,'Měsíční rekapitulace'!A$3:A$999,)),\"\")","v":""},null,{"$f":"IF($A94=\"\",,SUMPRODUCT((LOOKUP(ROW(D$1:D$997),ROW(D$1:D$997)/ISNUMBER('Měsíční rekapitulace'!$L$1:$L$997),'Měsíční rekapitulace'!$L$1:$L$997)=D$4)*('Měsíční rekapitulace'!$A$3:$A$999=$A94)*TEXT('Měsíční rekapitulace'!$Q$3:$Q$999,\"0,0;0;0;\\0\")))","v":0},{"$f":"IF($A94=\"\",,SUMPRODUCT((LOOKUP(ROW(E$1:E$997),ROW(E$1:E$997)/ISNUMBER('Měsíční rekapitulace'!$L$1:$L$997),'Měsíční rekapitulace'!$L$1:$L$997)=E$4)*('Měsíční rekapitulace'!$A$3:$A$999=$A94)*TEXT('Měsíční rekapitulace'!$Q$3:$Q$999,\"0,0;0;0;\\0\")))","v":0},{"$f":"IF($A94=\"\",,SUMPRODUCT((LOOKUP(ROW(F$1:F$997),ROW(F$1:F$997)/ISNUMBER('Měsíční rekapitulace'!$L$1:$L$997),'Měsíční rekapitulace'!$L$1:$L$997)=F$4)*('Měsíční rekapitulace'!$A$3:$A$999=$A94)*TEXT('Měsíční rekapitulace'!$Q$3:$Q$999,\"0,0;0;0;\\0\")))","v":0},{"$f":"IF($A94=\"\",,SUMPRODUCT((LOOKUP(ROW(G$1:G$997),ROW(G$1:G$997)/ISNUMBER('Měsíční rekapitulace'!$L$1:$L$997),'Měsíční rekapitulace'!$L$1:$L$997)=G$4)*('Měsíční rekapitulace'!$A$3:$A$999=$A94)*TEXT('Měsíční rekapitulace'!$Q$3:$Q$999,\"0,0;0;0;\\0\")))","v":0},{"$f":"IF($A94=\"\",,SUMPRODUCT((LOOKUP(ROW(H$1:H$997),ROW(H$1:H$997)/ISNUMBER('Měsíční rekapitulace'!$L$1:$L$997),'Měsíční rekapitulace'!$L$1:$L$997)=H$4)*('Měsíční rekapitulace'!$A$3:$A$999=$A94)*TEXT('Měsíční rekapitulace'!$Q$3:$Q$999,\"0,0;0;0;\\0\")))","v":0},{"$f":"IF($A94=\"\",,SUMPRODUCT((LOOKUP(ROW(I$1:I$997),ROW(I$1:I$997)/ISNUMBER('Měsíční rekapitulace'!$L$1:$L$997),'Měsíční rekapitulace'!$L$1:$L$997)=I$4)*('Měsíční rekapitulace'!$A$3:$A$999=$A94)*TEXT('Měsíční rekapitulace'!$Q$3:$Q$999,\"0,0;0;0;\\0\")))","v":0},{"$f":"IF($A94=\"\",,SUMPRODUCT((LOOKUP(ROW(J$1:J$997),ROW(J$1:J$997)/ISNUMBER('Měsíční rekapitulace'!$L$1:$L$997),'Měsíční rekapitulace'!$L$1:$L$997)=J$4)*('Měsíční rekapitulace'!$A$3:$A$999=$A94)*TEXT('Měsíční rekapitulace'!$Q$3:$Q$999,\"0,0;0;0;\\0\")))","v":0},{"$f":"IF($A94=\"\",,SUMPRODUCT((LOOKUP(ROW(K$1:K$997),ROW(K$1:K$997)/ISNUMBER('Měsíční rekapitulace'!$L$1:$L$997),'Měsíční rekapitulace'!$L$1:$L$997)=K$4)*('Měsíční rekapitulace'!$A$3:$A$999=$A94)*TEXT('Měsíční rekapitulace'!$Q$3:$Q$999,\"0,0;0;0;\\0\")))","v":0},{"$f":"IF($A94=\"\",,SUMPRODUCT((LOOKUP(ROW(L$1:L$997),ROW(L$1:L$997)/ISNUMBER('Měsíční rekapitulace'!$L$1:$L$997),'Měsíční rekapitulace'!$L$1:$L$997)=L$4)*('Měsíční rekapitulace'!$A$3:$A$999=$A94)*TEXT('Měsíční rekapitulace'!$Q$3:$Q$999,\"0,0;0;0;\\0\")))","v":0},{"$f":"IF($A94=\"\",,SUMPRODUCT((LOOKUP(ROW(M$1:M$997),ROW(M$1:M$997)/ISNUMBER('Měsíční rekapitulace'!$L$1:$L$997),'Měsíční rekapitulace'!$L$1:$L$997)=M$4)*('Měsíční rekapitulace'!$A$3:$A$999=$A94)*TEXT('Měsíční rekapitulace'!$Q$3:$Q$999,\"0,0;0;0;\\0\")))","v":0},{"$f":"IF($A94=\"\",,SUMPRODUCT((LOOKUP(ROW(N$1:N$997),ROW(N$1:N$997)/ISNUMBER('Měsíční rekapitulace'!$L$1:$L$997),'Měsíční rekapitulace'!$L$1:$L$997)=N$4)*('Měsíční rekapitulace'!$A$3:$A$999=$A94)*TEXT('Měsíční rekapitulace'!$Q$3:$Q$999,\"0,0;0;0;\\0\")))","v":0},{"$f":"IF($A94=\"\",,SUMPRODUCT((LOOKUP(ROW(O$1:O$997),ROW(O$1:O$997)/ISNUMBER('Měsíční rekapitulace'!$L$1:$L$997),'Měsíční rekapitulace'!$L$1:$L$997)=O$4)*('Měsíční rekapitulace'!$A$3:$A$999=$A94)*TEXT('Měsíční rekapitulace'!$Q$3:$Q$999,\"0,0;0;0;\\0\")))","v":0},0]
[{"$f":"IFERROR(INDEX('Měsíční rekapitulace'!A$3:A$999,SMALL(IF(('Měsíční rekapitulace'!A$3:A$999<>\"\")*('Měsíční rekapitulace'!A$3:A$999<>'Měsíční rekapitulace'!$A$2)*(COUNTIF(A$5:A94,'Měsíční rekapitulace'!A$3:A$999)=0),ROW('Měsíční rekapitulace'!A$3:A$999)-2),1)),\"\")","v":""},{"$f":"IFERROR(INDEX('Měsíční rekapitulace'!E$3:E$999,MATCH(A95,'Měsíční rekapitulace'!A$3:A$999,)),\"\")","v":""},null,{"$f":"IF($A95=\"\",,SUMPRODUCT((LOOKUP(ROW(D$1:D$997),ROW(D$1:D$997)/ISNUMBER('Měsíční rekapitulace'!$L$1:$L$997),'Měsíční rekapitulace'!$L$1:$L$997)=D$4)*('Měsíční rekapitulace'!$A$3:$A$999=$A95)*TEXT('Měsíční rekapitulace'!$Q$3:$Q$999,\"0,0;0;0;\\0\")))","v":0},{"$f":"IF($A95=\"\",,SUMPRODUCT((LOOKUP(ROW(E$1:E$997),ROW(E$1:E$997)/ISNUMBER('Měsíční rekapitulace'!$L$1:$L$997),'Měsíční rekapitulace'!$L$1:$L$997)=E$4)*('Měsíční rekapitulace'!$A$3:$A$999=$A95)*TEXT('Měsíční rekapitulace'!$Q$3:$Q$999,\"0,0;0;0;\\0\")))","v":0},{"$f":"IF($A95=\"\",,SUMPRODUCT((LOOKUP(ROW(F$1:F$997),ROW(F$1:F$997)/ISNUMBER('Měsíční rekapitulace'!$L$1:$L$997),'Měsíční rekapitulace'!$L$1:$L$997)=F$4)*('Měsíční rekapitulace'!$A$3:$A$999=$A95)*TEXT('Měsíční rekapitulace'!$Q$3:$Q$999,\"0,0;0;0;\\0\")))","v":0},{"$f":"IF($A95=\"\",,SUMPRODUCT((LOOKUP(ROW(G$1:G$997),ROW(G$1:G$997)/ISNUMBER('Měsíční rekapitulace'!$L$1:$L$997),'Měsíční rekapitulace'!$L$1:$L$997)=G$4)*('Měsíční rekapitulace'!$A$3:$A$999=$A95)*TEXT('Měsíční rekapitulace'!$Q$3:$Q$999,\"0,0;0;0;\\0\")))","v":0},{"$f":"IF($A95=\"\",,SUMPRODUCT((LOOKUP(ROW(H$1:H$997),ROW(H$1:H$997)/ISNUMBER('Měsíční rekapitulace'!$L$1:$L$997),'Měsíční rekapitulace'!$L$1:$L$997)=H$4)*('Měsíční rekapitulace'!$A$3:$A$999=$A95)*TEXT('Měsíční rekapitulace'!$Q$3:$Q$999,\"0,0;0;0;\\0\")))","v":0},{"$f":"IF($A95=\"\",,SUMPRODUCT((LOOKUP(ROW(I$1:I$997),ROW(I$1:I$997)/ISNUMBER('Měsíční rekapitulace'!$L$1:$L$997),'Měsíční rekapitulace'!$L$1:$L$997)=I$4)*('Měsíční rekapitulace'!$A$3:$A$999=$A95)*TEXT('Měsíční rekapitulace'!$Q$3:$Q$999,\"0,0;0;0;\\0\")))","v":0},{"$f":"IF($A95=\"\",,SUMPRODUCT((LOOKUP(ROW(J$1:J$997),ROW(J$1:J$997)/ISNUMBER('Měsíční rekapitulace'!$L$1:$L$997),'Měsíční rekapitulace'!$L$1:$L$997)=J$4)*('Měsíční rekapitulace'!$A$3:$A$999=$A95)*TEXT('Měsíční rekapitulace'!$Q$3:$Q$999,\"0,0;0;0;\\0\")))","v":0},{"$f":"IF($A95=\"\",,SUMPRODUCT((LOOKUP(ROW(K$1:K$997),ROW(K$1:K$997)/ISNUMBER('Měsíční rekapitulace'!$L$1:$L$997),'Měsíční rekapitulace'!$L$1:$L$997)=K$4)*('Měsíční rekapitulace'!$A$3:$A$999=$A95)*TEXT('Měsíční rekapitulace'!$Q$3:$Q$999,\"0,0;0;0;\\0\")))","v":0},{"$f":"IF($A95=\"\",,SUMPRODUCT((LOOKUP(ROW(L$1:L$997),ROW(L$1:L$997)/ISNUMBER('Měsíční rekapitulace'!$L$1:$L$997),'Měsíční rekapitulace'!$L$1:$L$997)=L$4)*('Měsíční rekapitulace'!$A$3:$A$999=$A95)*TEXT('Měsíční rekapitulace'!$Q$3:$Q$999,\"0,0;0;0;\\0\")))","v":0},{"$f":"IF($A95=\"\",,SUMPRODUCT((LOOKUP(ROW(M$1:M$997),ROW(M$1:M$997)/ISNUMBER('Měsíční rekapitulace'!$L$1:$L$997),'Měsíční rekapitulace'!$L$1:$L$997)=M$4)*('Měsíční rekapitulace'!$A$3:$A$999=$A95)*TEXT('Měsíční rekapitulace'!$Q$3:$Q$999,\"0,0;0;0;\\0\")))","v":0},{"$f":"IF($A95=\"\",,SUMPRODUCT((LOOKUP(ROW(N$1:N$997),ROW(N$1:N$997)/ISNUMBER('Měsíční rekapitulace'!$L$1:$L$997),'Měsíční rekapitulace'!$L$1:$L$997)=N$4)*('Měsíční rekapitulace'!$A$3:$A$999=$A95)*TEXT('Měsíční rekapitulace'!$Q$3:$Q$999,\"0,0;0;0;\\0\")))","v":0},{"$f":"IF($A95=\"\",,SUMPRODUCT((LOOKUP(ROW(O$1:O$997),ROW(O$1:O$997)/ISNUMBER('Měsíční rekapitulace'!$L$1:$L$997),'Měsíční rekapitulace'!$L$1:$L$997)=O$4)*('Měsíční rekapitulace'!$A$3:$A$999=$A95)*TEXT('Měsíční rekapitulace'!$Q$3:$Q$999,\"0,0;0;0;\\0\")))","v":0},0]
[{"$f":"IFERROR(INDEX('Měsíční rekapitulace'!A$3:A$999,SMALL(IF(('Měsíční rekapitulace'!A$3:A$999<>\"\")*('Měsíční rekapitulace'!A$3:A$999<>'Měsíční rekapitulace'!$A$2)*(COUNTIF(A$5:A95,'Měsíční rekapitulace'!A$3:A$999)=0),ROW('Měsíční rekapitulace'!A$3:A$999)-2),1)),\"\")","v":""},{"$f":"IFERROR(INDEX('Měsíční rekapitulace'!E$3:E$999,MATCH(A96,'Měsíční rekapitulace'!A$3:A$999,)),\"\")","v":""},null,{"$f":"IF($A96=\"\",,SUMPRODUCT((LOOKUP(ROW(D$1:D$997),ROW(D$1:D$997)/ISNUMBER('Měsíční rekapitulace'!$L$1:$L$997),'Měsíční rekapitulace'!$L$1:$L$997)=D$4)*('Měsíční rekapitulace'!$A$3:$A$999=$A96)*TEXT('Měsíční rekapitulace'!$Q$3:$Q$999,\"0,0;0;0;\\0\")))","v":0},{"$f":"IF($A96=\"\",,SUMPRODUCT((LOOKUP(ROW(E$1:E$997),ROW(E$1:E$997)/ISNUMBER('Měsíční rekapitulace'!$L$1:$L$997),'Měsíční rekapitulace'!$L$1:$L$997)=E$4)*('Měsíční rekapitulace'!$A$3:$A$999=$A96)*TEXT('Měsíční rekapitulace'!$Q$3:$Q$999,\"0,0;0;0;\\0\")))","v":0},{"$f":"IF($A96=\"\",,SUMPRODUCT((LOOKUP(ROW(F$1:F$997),ROW(F$1:F$997)/ISNUMBER('Měsíční rekapitulace'!$L$1:$L$997),'Měsíční rekapitulace'!$L$1:$L$997)=F$4)*('Měsíční rekapitulace'!$A$3:$A$999=$A96)*TEXT('Měsíční rekapitulace'!$Q$3:$Q$999,\"0,0;0;0;\\0\")))","v":0},{"$f":"IF($A96=\"\",,SUMPRODUCT((LOOKUP(ROW(G$1:G$997),ROW(G$1:G$997)/ISNUMBER('Měsíční rekapitulace'!$L$1:$L$997),'Měsíční rekapitulace'!$L$1:$L$997)=G$4)*('Měsíční rekapitulace'!$A$3:$A$999=$A96)*TEXT('Měsíční rekapitulace'!$Q$3:$Q$999,\"0,0;0;0;\\0\")))","v":0},{"$f":"IF($A96=\"\",,SUMPRODUCT((LOOKUP(ROW(H$1:H$997),ROW(H$1:H$997)/ISNUMBER('Měsíční rekapitulace'!$L$1:$L$997),'Měsíční rekapitulace'!$L$1:$L$997)=H$4)*('Měsíční rekapitulace'!$A$3:$A$999=$A96)*TEXT('Měsíční rekapitulace'!$Q$3:$Q$999,\"0,0;0;0;\\0\")))","v":0},{"$f":"IF($A96=\"\",,SUMPRODUCT((LOOKUP(ROW(I$1:I$997),ROW(I$1:I$997)/ISNUMBER('Měsíční rekapitulace'!$L$1:$L$997),'Měsíční rekapitulace'!$L$1:$L$997)=I$4)*('Měsíční rekapitulace'!$A$3:$A$999=$A96)*TEXT('Měsíční rekapitulace'!$Q$3:$Q$999,\"0,0;0;0;\\0\")))","v":0},{"$f":"IF($A96=\"\",,SUMPRODUCT((LOOKUP(ROW(J$1:J$997),ROW(J$1:J$997)/ISNUMBER('Měsíční rekapitulace'!$L$1:$L$997),'Měsíční rekapitulace'!$L$1:$L$997)=J$4)*('Měsíční rekapitulace'!$A$3:$A$999=$A96)*TEXT('Měsíční rekapitulace'!$Q$3:$Q$999,\"0,0;0;0;\\0\")))","v":0},{"$f":"IF($A96=\"\",,SUMPRODUCT((LOOKUP(ROW(K$1:K$997),ROW(K$1:K$997)/ISNUMBER('Měsíční rekapitulace'!$L$1:$L$997),'Měsíční rekapitulace'!$L$1:$L$997)=K$4)*('Měsíční rekapitulace'!$A$3:$A$999=$A96)*TEXT('Měsíční rekapitulace'!$Q$3:$Q$999,\"0,0;0;0;\\0\")))","v":0},{"$f":"IF($A96=\"\",,SUMPRODUCT((LOOKUP(ROW(L$1:L$997),ROW(L$1:L$997)/ISNUMBER('Měsíční rekapitulace'!$L$1:$L$997),'Měsíční rekapitulace'!$L$1:$L$997)=L$4)*('Měsíční rekapitulace'!$A$3:$A$999=$A96)*TEXT('Měsíční rekapitulace'!$Q$3:$Q$999,\"0,0;0;0;\\0\")))","v":0},{"$f":"IF($A96=\"\",,SUMPRODUCT((LOOKUP(ROW(M$1:M$997),ROW(M$1:M$997)/ISNUMBER('Měsíční rekapitulace'!$L$1:$L$997),'Měsíční rekapitulace'!$L$1:$L$997)=M$4)*('Měsíční rekapitulace'!$A$3:$A$999=$A96)*TEXT('Měsíční rekapitulace'!$Q$3:$Q$999,\"0,0;0;0;\\0\")))","v":0},{"$f":"IF($A96=\"\",,SUMPRODUCT((LOOKUP(ROW(N$1:N$997),ROW(N$1:N$997)/ISNUMBER('Měsíční rekapitulace'!$L$1:$L$997),'Měsíční rekapitulace'!$L$1:$L$997)=N$4)*('Měsíční rekapitulace'!$A$3:$A$999=$A96)*TEXT('Měsíční rekapitulace'!$Q$3:$Q$999,\"0,0;0;0;\\0\")))","v":0},{"$f":"IF($A96=\"\",,SUMPRODUCT((LOOKUP(ROW(O$1:O$997),ROW(O$1:O$997)/ISNUMBER('Měsíční rekapitulace'!$L$1:$L$997),'Měsíční rekapitulace'!$L$1:$L$997)=O$4)*('Měsíční rekapitulace'!$A$3:$A$999=$A96)*TEXT('Měsíční rekapitulace'!$Q$3:$Q$999,\"0,0;0;0;\\0\")))","v":0},0]
[{"$f":"IFERROR(INDEX('Měsíční rekapitulace'!A$3:A$999,SMALL(IF(('Měsíční rekapitulace'!A$3:A$999<>\"\")*('Měsíční rekapitulace'!A$3:A$999<>'Měsíční rekapitulace'!$A$2)*(COUNTIF(A$5:A96,'Měsíční rekapitulace'!A$3:A$999)=0),ROW('Měsíční rekapitulace'!A$3:A$999)-2),1)),\"\")","v":""},{"$f":"IFERROR(INDEX('Měsíční rekapitulace'!E$3:E$999,MATCH(A97,'Měsíční rekapitulace'!A$3:A$999,)),\"\")","v":""},null,{"$f":"IF($A97=\"\",,SUMPRODUCT((LOOKUP(ROW(D$1:D$997),ROW(D$1:D$997)/ISNUMBER('Měsíční rekapitulace'!$L$1:$L$997),'Měsíční rekapitulace'!$L$1:$L$997)=D$4)*('Měsíční rekapitulace'!$A$3:$A$999=$A97)*TEXT('Měsíční rekapitulace'!$Q$3:$Q$999,\"0,0;0;0;\\0\")))","v":0},{"$f":"IF($A97=\"\",,SUMPRODUCT((LOOKUP(ROW(E$1:E$997),ROW(E$1:E$997)/ISNUMBER('Měsíční rekapitulace'!$L$1:$L$997),'Měsíční rekapitulace'!$L$1:$L$997)=E$4)*('Měsíční rekapitulace'!$A$3:$A$999=$A97)*TEXT('Měsíční rekapitulace'!$Q$3:$Q$999,\"0,0;0;0;\\0\")))","v":0},{"$f":"IF($A97=\"\",,SUMPRODUCT((LOOKUP(ROW(F$1:F$997),ROW(F$1:F$997)/ISNUMBER('Měsíční rekapitulace'!$L$1:$L$997),'Měsíční rekapitulace'!$L$1:$L$997)=F$4)*('Měsíční rekapitulace'!$A$3:$A$999=$A97)*TEXT('Měsíční rekapitulace'!$Q$3:$Q$999,\"0,0;0;0;\\0\")))","v":0},{"$f":"IF($A97=\"\",,SUMPRODUCT((LOOKUP(ROW(G$1:G$997),ROW(G$1:G$997)/ISNUMBER('Měsíční rekapitulace'!$L$1:$L$997),'Měsíční rekapitulace'!$L$1:$L$997)=G$4)*('Měsíční rekapitulace'!$A$3:$A$999=$A97)*TEXT('Měsíční rekapitulace'!$Q$3:$Q$999,\"0,0;0;0;\\0\")))","v":0},{"$f":"IF($A97=\"\",,SUMPRODUCT((LOOKUP(ROW(H$1:H$997),ROW(H$1:H$997)/ISNUMBER('Měsíční rekapitulace'!$L$1:$L$997),'Měsíční rekapitulace'!$L$1:$L$997)=H$4)*('Měsíční rekapitulace'!$A$3:$A$999=$A97)*TEXT('Měsíční rekapitulace'!$Q$3:$Q$999,\"0,0;0;0;\\0\")))","v":0},{"$f":"IF($A97=\"\",,SUMPRODUCT((LOOKUP(ROW(I$1:I$997),ROW(I$1:I$997)/ISNUMBER('Měsíční rekapitulace'!$L$1:$L$997),'Měsíční rekapitulace'!$L$1:$L$997)=I$4)*('Měsíční rekapitulace'!$A$3:$A$999=$A97)*TEXT('Měsíční rekapitulace'!$Q$3:$Q$999,\"0,0;0;0;\\0\")))","v":0},{"$f":"IF($A97=\"\",,SUMPRODUCT((LOOKUP(ROW(J$1:J$997),ROW(J$1:J$997)/ISNUMBER('Měsíční rekapitulace'!$L$1:$L$997),'Měsíční rekapitulace'!$L$1:$L$997)=J$4)*('Měsíční rekapitulace'!$A$3:$A$999=$A97)*TEXT('Měsíční rekapitulace'!$Q$3:$Q$999,\"0,0;0;0;\\0\")))","v":0},{"$f":"IF($A97=\"\",,SUMPRODUCT((LOOKUP(ROW(K$1:K$997),ROW(K$1:K$997)/ISNUMBER('Měsíční rekapitulace'!$L$1:$L$997),'Měsíční rekapitulace'!$L$1:$L$997)=K$4)*('Měsíční rekapitulace'!$A$3:$A$999=$A97)*TEXT('Měsíční rekapitulace'!$Q$3:$Q$999,\"0,0;0;0;\\0\")))","v":0},{"$f":"IF($A97=\"\",,SUMPRODUCT((LOOKUP(ROW(L$1:L$997),ROW(L$1:L$997)/ISNUMBER('Měsíční rekapitulace'!$L$1:$L$997),'Měsíční rekapitulace'!$L$1:$L$997)=L$4)*('Měsíční rekapitulace'!$A$3:$A$999=$A97)*TEXT('Měsíční rekapitulace'!$Q$3:$Q$999,\"0,0;0;0;\\0\")))","v":0},{"$f":"IF($A97=\"\",,SUMPRODUCT((LOOKUP(ROW(M$1:M$997),ROW(M$1:M$997)/ISNUMBER('Měsíční rekapitulace'!$L$1:$L$997),'Měsíční rekapitulace'!$L$1:$L$997)=M$4)*('Měsíční rekapitulace'!$A$3:$A$999=$A97)*TEXT('Měsíční rekapitulace'!$Q$3:$Q$999,\"0,0;0;0;\\0\")))","v":0},{"$f":"IF($A97=\"\",,SUMPRODUCT((LOOKUP(ROW(N$1:N$997),ROW(N$1:N$997)/ISNUMBER('Měsíční rekapitulace'!$L$1:$L$997),'Měsíční rekapitulace'!$L$1:$L$997)=N$4)*('Měsíční rekapitulace'!$A$3:$A$999=$A97)*TEXT('Měsíční rekapitulace'!$Q$3:$Q$999,\"0,0;0;0;\\0\")))","v":0},{"$f":"IF($A97=\"\",,SUMPRODUCT((LOOKUP(ROW(O$1:O$997),ROW(O$1:O$997)/ISNUMBER('Měsíční rekapitulace'!$L$1:$L$997),'Měsíční rekapitulace'!$L$1:$L$997)=O$4)*('Měsíční rekapitulace'!$A$3:$A$999=$A97)*TEXT('Měsíční rekapitulace'!$Q$3:$Q$999,\"0,0;0;0;\\0\")))","v":0},0]
[{"$f":"IFERROR(INDEX('Měsíční rekapitulace'!A$3:A$999,SMALL(IF(('Měsíční rekapitulace'!A$3:A$999<>\"\")*('Měsíční rekapitulace'!A$3:A$999<>'Měsíční rekapitulace'!$A$2)*(COUNTIF(A$5:A97,'Měsíční rekapitulace'!A$3:A$999)=0),ROW('Měsíční rekapitulace'!A$3:A$999)-2),1)),\"\")","v":""},{"$f":"IFERROR(INDEX('Měsíční rekapitulace'!E$3:E$999,MATCH(A98,'Měsíční rekapitulace'!A$3:A$999,)),\"\")","v":""},null,{"$f":"IF($A98=\"\",,SUMPRODUCT((LOOKUP(ROW(D$1:D$997),ROW(D$1:D$997)/ISNUMBER('Měsíční rekapitulace'!$L$1:$L$997),'Měsíční rekapitulace'!$L$1:$L$997)=D$4)*('Měsíční rekapitulace'!$A$3:$A$999=$A98)*TEXT('Měsíční rekapitulace'!$Q$3:$Q$999,\"0,0;0;0;\\0\")))","v":0},{"$f":"IF($A98=\"\",,SUMPRODUCT((LOOKUP(ROW(E$1:E$997),ROW(E$1:E$997)/ISNUMBER('Měsíční rekapitulace'!$L$1:$L$997),'Měsíční rekapitulace'!$L$1:$L$997)=E$4)*('Měsíční rekapitulace'!$A$3:$A$999=$A98)*TEXT('Měsíční rekapitulace'!$Q$3:$Q$999,\"0,0;0;0;\\0\")))","v":0},{"$f":"IF($A98=\"\",,SUMPRODUCT((LOOKUP(ROW(F$1:F$997),ROW(F$1:F$997)/ISNUMBER('Měsíční rekapitulace'!$L$1:$L$997),'Měsíční rekapitulace'!$L$1:$L$997)=F$4)*('Měsíční rekapitulace'!$A$3:$A$999=$A98)*TEXT('Měsíční rekapitulace'!$Q$3:$Q$999,\"0,0;0;0;\\0\")))","v":0},{"$f":"IF($A98=\"\",,SUMPRODUCT((LOOKUP(ROW(G$1:G$997),ROW(G$1:G$997)/ISNUMBER('Měsíční rekapitulace'!$L$1:$L$997),'Měsíční rekapitulace'!$L$1:$L$997)=G$4)*('Měsíční rekapitulace'!$A$3:$A$999=$A98)*TEXT('Měsíční rekapitulace'!$Q$3:$Q$999,\"0,0;0;0;\\0\")))","v":0},{"$f":"IF($A98=\"\",,SUMPRODUCT((LOOKUP(ROW(H$1:H$997),ROW(H$1:H$997)/ISNUMBER('Měsíční rekapitulace'!$L$1:$L$997),'Měsíční rekapitulace'!$L$1:$L$997)=H$4)*('Měsíční rekapitulace'!$A$3:$A$999=$A98)*TEXT('Měsíční rekapitulace'!$Q$3:$Q$999,\"0,0;0;0;\\0\")))","v":0},{"$f":"IF($A98=\"\",,SUMPRODUCT((LOOKUP(ROW(I$1:I$997),ROW(I$1:I$997)/ISNUMBER('Měsíční rekapitulace'!$L$1:$L$997),'Měsíční rekapitulace'!$L$1:$L$997)=I$4)*('Měsíční rekapitulace'!$A$3:$A$999=$A98)*TEXT('Měsíční rekapitulace'!$Q$3:$Q$999,\"0,0;0;0;\\0\")))","v":0},{"$f":"IF($A98=\"\",,SUMPRODUCT((LOOKUP(ROW(J$1:J$997),ROW(J$1:J$997)/ISNUMBER('Měsíční rekapitulace'!$L$1:$L$997),'Měsíční rekapitulace'!$L$1:$L$997)=J$4)*('Měsíční rekapitulace'!$A$3:$A$999=$A98)*TEXT('Měsíční rekapitulace'!$Q$3:$Q$999,\"0,0;0;0;\\0\")))","v":0},{"$f":"IF($A98=\"\",,SUMPRODUCT((LOOKUP(ROW(K$1:K$997),ROW(K$1:K$997)/ISNUMBER('Měsíční rekapitulace'!$L$1:$L$997),'Měsíční rekapitulace'!$L$1:$L$997)=K$4)*('Měsíční rekapitulace'!$A$3:$A$999=$A98)*TEXT('Měsíční rekapitulace'!$Q$3:$Q$999,\"0,0;0;0;\\0\")))","v":0},{"$f":"IF($A98=\"\",,SUMPRODUCT((LOOKUP(ROW(L$1:L$997),ROW(L$1:L$997)/ISNUMBER('Měsíční rekapitulace'!$L$1:$L$997),'Měsíční rekapitulace'!$L$1:$L$997)=L$4)*('Měsíční rekapitulace'!$A$3:$A$999=$A98)*TEXT('Měsíční rekapitulace'!$Q$3:$Q$999,\"0,0;0;0;\\0\")))","v":0},{"$f":"IF($A98=\"\",,SUMPRODUCT((LOOKUP(ROW(M$1:M$997),ROW(M$1:M$997)/ISNUMBER('Měsíční rekapitulace'!$L$1:$L$997),'Měsíční rekapitulace'!$L$1:$L$997)=M$4)*('Měsíční rekapitulace'!$A$3:$A$999=$A98)*TEXT('Měsíční rekapitulace'!$Q$3:$Q$999,\"0,0;0;0;\\0\")))","v":0},{"$f":"IF($A98=\"\",,SUMPRODUCT((LOOKUP(ROW(N$1:N$997),ROW(N$1:N$997)/ISNUMBER('Měsíční rekapitulace'!$L$1:$L$997),'Měsíční rekapitulace'!$L$1:$L$997)=N$4)*('Měsíční rekapitulace'!$A$3:$A$999=$A98)*TEXT('Měsíční rekapitulace'!$Q$3:$Q$999,\"0,0;0;0;\\0\")))","v":0},{"$f":"IF($A98=\"\",,SUMPRODUCT((LOOKUP(ROW(O$1:O$997),ROW(O$1:O$997)/ISNUMBER('Měsíční rekapitulace'!$L$1:$L$997),'Měsíční rekapitulace'!$L$1:$L$997)=O$4)*('Měsíční rekapitulace'!$A$3:$A$999=$A98)*TEXT('Měsíční rekapitulace'!$Q$3:$Q$999,\"0,0;0;0;\\0\")))","v":0},0]
[{"$f":"IFERROR(INDEX('Měsíční rekapitulace'!A$3:A$999,SMALL(IF(('Měsíční rekapitulace'!A$3:A$999<>\"\")*('Měsíční rekapitulace'!A$3:A$999<>'Měsíční rekapitulace'!$A$2)*(COUNTIF(A$5:A98,'Měsíční rekapitulace'!A$3:A$999)=0),ROW('Měsíční rekapitulace'!A$3:A$999)-2),1)),\"\")","v":""},{"$f":"IFERROR(INDEX('Měsíční rekapitulace'!E$3:E$999,MATCH(A99,'Měsíční rekapitulace'!A$3:A$999,)),\"\")","v":""},null,{"$f":"IF($A99=\"\",,SUMPRODUCT((LOOKUP(ROW(D$1:D$997),ROW(D$1:D$997)/ISNUMBER('Měsíční rekapitulace'!$L$1:$L$997),'Měsíční rekapitulace'!$L$1:$L$997)=D$4)*('Měsíční rekapitulace'!$A$3:$A$999=$A99)*TEXT('Měsíční rekapitulace'!$Q$3:$Q$999,\"0,0;0;0;\\0\")))","v":0},{"$f":"IF($A99=\"\",,SUMPRODUCT((LOOKUP(ROW(E$1:E$997),ROW(E$1:E$997)/ISNUMBER('Měsíční rekapitulace'!$L$1:$L$997),'Měsíční rekapitulace'!$L$1:$L$997)=E$4)*('Měsíční rekapitulace'!$A$3:$A$999=$A99)*TEXT('Měsíční rekapitulace'!$Q$3:$Q$999,\"0,0;0;0;\\0\")))","v":0},{"$f":"IF($A99=\"\",,SUMPRODUCT((LOOKUP(ROW(F$1:F$997),ROW(F$1:F$997)/ISNUMBER('Měsíční rekapitulace'!$L$1:$L$997),'Měsíční rekapitulace'!$L$1:$L$997)=F$4)*('Měsíční rekapitulace'!$A$3:$A$999=$A99)*TEXT('Měsíční rekapitulace'!$Q$3:$Q$999,\"0,0;0;0;\\0\")))","v":0},{"$f":"IF($A99=\"\",,SUMPRODUCT((LOOKUP(ROW(G$1:G$997),ROW(G$1:G$997)/ISNUMBER('Měsíční rekapitulace'!$L$1:$L$997),'Měsíční rekapitulace'!$L$1:$L$997)=G$4)*('Měsíční rekapitulace'!$A$3:$A$999=$A99)*TEXT('Měsíční rekapitulace'!$Q$3:$Q$999,\"0,0;0;0;\\0\")))","v":0},{"$f":"IF($A99=\"\",,SUMPRODUCT((LOOKUP(ROW(H$1:H$997),ROW(H$1:H$997)/ISNUMBER('Měsíční rekapitulace'!$L$1:$L$997),'Měsíční rekapitulace'!$L$1:$L$997)=H$4)*('Měsíční rekapitulace'!$A$3:$A$999=$A99)*TEXT('Měsíční rekapitulace'!$Q$3:$Q$999,\"0,0;0;0;\\0\")))","v":0},{"$f":"IF($A99=\"\",,SUMPRODUCT((LOOKUP(ROW(I$1:I$997),ROW(I$1:I$997)/ISNUMBER('Měsíční rekapitulace'!$L$1:$L$997),'Měsíční rekapitulace'!$L$1:$L$997)=I$4)*('Měsíční rekapitulace'!$A$3:$A$999=$A99)*TEXT('Měsíční rekapitulace'!$Q$3:$Q$999,\"0,0;0;0;\\0\")))","v":0},{"$f":"IF($A99=\"\",,SUMPRODUCT((LOOKUP(ROW(J$1:J$997),ROW(J$1:J$997)/ISNUMBER('Měsíční rekapitulace'!$L$1:$L$997),'Měsíční rekapitulace'!$L$1:$L$997)=J$4)*('Měsíční rekapitulace'!$A$3:$A$999=$A99)*TEXT('Měsíční rekapitulace'!$Q$3:$Q$999,\"0,0;0;0;\\0\")))","v":0},{"$f":"IF($A99=\"\",,SUMPRODUCT((LOOKUP(ROW(K$1:K$997),ROW(K$1:K$997)/ISNUMBER('Měsíční rekapitulace'!$L$1:$L$997),'Měsíční rekapitulace'!$L$1:$L$997)=K$4)*('Měsíční rekapitulace'!$A$3:$A$999=$A99)*TEXT('Měsíční rekapitulace'!$Q$3:$Q$999,\"0,0;0;0;\\0\")))","v":0},{"$f":"IF($A99=\"\",,SUMPRODUCT((LOOKUP(ROW(L$1:L$997),ROW(L$1:L$997)/ISNUMBER('Měsíční rekapitulace'!$L$1:$L$997),'Měsíční rekapitulace'!$L$1:$L$997)=L$4)*('Měsíční rekapitulace'!$A$3:$A$999=$A99)*TEXT('Měsíční rekapitulace'!$Q$3:$Q$999,\"0,0;0;0;\\0\")))","v":0},{"$f":"IF($A99=\"\",,SUMPRODUCT((LOOKUP(ROW(M$1:M$997),ROW(M$1:M$997)/ISNUMBER('Měsíční rekapitulace'!$L$1:$L$997),'Měsíční rekapitulace'!$L$1:$L$997)=M$4)*('Měsíční rekapitulace'!$A$3:$A$999=$A99)*TEXT('Měsíční rekapitulace'!$Q$3:$Q$999,\"0,0;0;0;\\0\")))","v":0},{"$f":"IF($A99=\"\",,SUMPRODUCT((LOOKUP(ROW(N$1:N$997),ROW(N$1:N$997)/ISNUMBER('Měsíční rekapitulace'!$L$1:$L$997),'Měsíční rekapitulace'!$L$1:$L$997)=N$4)*('Měsíční rekapitulace'!$A$3:$A$999=$A99)*TEXT('Měsíční rekapitulace'!$Q$3:$Q$999,\"0,0;0;0;\\0\")))","v":0},{"$f":"IF($A99=\"\",,SUMPRODUCT((LOOKUP(ROW(O$1:O$997),ROW(O$1:O$997)/ISNUMBER('Měsíční rekapitulace'!$L$1:$L$997),'Měsíční rekapitulace'!$L$1:$L$997)=O$4)*('Měsíční rekapitulace'!$A$3:$A$999=$A99)*TEXT('Měsíční rekapitulace'!$Q$3:$Q$999,\"0,0;0;0;\\0\")))","v":0},0]
[{"$f":"IFERROR(INDEX('Měsíční rekapitulace'!A$3:A$999,SMALL(IF(('Měsíční rekapitulace'!A$3:A$999<>\"\")*('Měsíční rekapitulace'!A$3:A$999<>'Měsíční rekapitulace'!$A$2)*(COUNTIF(A$5:A99,'Měsíční rekapitulace'!A$3:A$999)=0),ROW('Měsíční rekapitulace'!A$3:A$999)-2),1)),\"\")","v":""},{"$f":"IFERROR(INDEX('Měsíční rekapitulace'!E$3:E$999,MATCH(A100,'Měsíční rekapitulace'!A$3:A$999,)),\"\")","v":""},null,{"$f":"IF($A100=\"\",,SUMPRODUCT((LOOKUP(ROW(D$1:D$997),ROW(D$1:D$997)/ISNUMBER('Měsíční rekapitulace'!$L$1:$L$997),'Měsíční rekapitulace'!$L$1:$L$997)=D$4)*('Měsíční rekapitulace'!$A$3:$A$999=$A100)*TEXT('Měsíční rekapitulace'!$Q$3:$Q$999,\"0,0;0;0;\\0\")))","v":0},{"$f":"IF($A100=\"\",,SUMPRODUCT((LOOKUP(ROW(E$1:E$997),ROW(E$1:E$997)/ISNUMBER('Měsíční rekapitulace'!$L$1:$L$997),'Měsíční rekapitulace'!$L$1:$L$997)=E$4)*('Měsíční rekapitulace'!$A$3:$A$999=$A100)*TEXT('Měsíční rekapitulace'!$Q$3:$Q$999,\"0,0;0;0;\\0\")))","v":0},{"$f":"IF($A100=\"\",,SUMPRODUCT((LOOKUP(ROW(F$1:F$997),ROW(F$1:F$997)/ISNUMBER('Měsíční rekapitulace'!$L$1:$L$997),'Měsíční rekapitulace'!$L$1:$L$997)=F$4)*('Měsíční rekapitulace'!$A$3:$A$999=$A100)*TEXT('Měsíční rekapitulace'!$Q$3:$Q$999,\"0,0;0;0;\\0\")))","v":0},{"$f":"IF($A100=\"\",,SUMPRODUCT((LOOKUP(ROW(G$1:G$997),ROW(G$1:G$997)/ISNUMBER('Měsíční rekapitulace'!$L$1:$L$997),'Měsíční rekapitulace'!$L$1:$L$997)=G$4)*('Měsíční rekapitulace'!$A$3:$A$999=$A100)*TEXT('Měsíční rekapitulace'!$Q$3:$Q$999,\"0,0;0;0;\\0\")))","v":0},{"$f":"IF($A100=\"\",,SUMPRODUCT((LOOKUP(ROW(H$1:H$997),ROW(H$1:H$997)/ISNUMBER('Měsíční rekapitulace'!$L$1:$L$997),'Měsíční rekapitulace'!$L$1:$L$997)=H$4)*('Měsíční rekapitulace'!$A$3:$A$999=$A100)*TEXT('Měsíční rekapitulace'!$Q$3:$Q$999,\"0,0;0;0;\\0\")))","v":0},{"$f":"IF($A100=\"\",,SUMPRODUCT((LOOKUP(ROW(I$1:I$997),ROW(I$1:I$997)/ISNUMBER('Měsíční rekapitulace'!$L$1:$L$997),'Měsíční rekapitulace'!$L$1:$L$997)=I$4)*('Měsíční rekapitulace'!$A$3:$A$999=$A100)*TEXT('Měsíční rekapitulace'!$Q$3:$Q$999,\"0,0;0;0;\\0\")))","v":0},{"$f":"IF($A100=\"\",,SUMPRODUCT((LOOKUP(ROW(J$1:J$997),ROW(J$1:J$997)/ISNUMBER('Měsíční rekapitulace'!$L$1:$L$997),'Měsíční rekapitulace'!$L$1:$L$997)=J$4)*('Měsíční rekapitulace'!$A$3:$A$999=$A100)*TEXT('Měsíční rekapitulace'!$Q$3:$Q$999,\"0,0;0;0;\\0\")))","v":0},{"$f":"IF($A100=\"\",,SUMPRODUCT((LOOKUP(ROW(K$1:K$997),ROW(K$1:K$997)/ISNUMBER('Měsíční rekapitulace'!$L$1:$L$997),'Měsíční rekapitulace'!$L$1:$L$997)=K$4)*('Měsíční rekapitulace'!$A$3:$A$999=$A100)*TEXT('Měsíční rekapitulace'!$Q$3:$Q$999,\"0,0;0;0;\\0\")))","v":0},{"$f":"IF($A100=\"\",,SUMPRODUCT((LOOKUP(ROW(L$1:L$997),ROW(L$1:L$997)/ISNUMBER('Měsíční rekapitulace'!$L$1:$L$997),'Měsíční rekapitulace'!$L$1:$L$997)=L$4)*('Měsíční rekapitulace'!$A$3:$A$999=$A100)*TEXT('Měsíční rekapitulace'!$Q$3:$Q$999,\"0,0;0;0;\\0\")))","v":0},{"$f":"IF($A100=\"\",,SUMPRODUCT((LOOKUP(ROW(M$1:M$997),ROW(M$1:M$997)/ISNUMBER('Měsíční rekapitulace'!$L$1:$L$997),'Měsíční rekapitulace'!$L$1:$L$997)=M$4)*('Měsíční rekapitulace'!$A$3:$A$999=$A100)*TEXT('Měsíční rekapitulace'!$Q$3:$Q$999,\"0,0;0;0;\\0\")))","v":0},{"$f":"IF($A100=\"\",,SUMPRODUCT((LOOKUP(ROW(N$1:N$997),ROW(N$1:N$997)/ISNUMBER('Měsíční rekapitulace'!$L$1:$L$997),'Měsíční rekapitulace'!$L$1:$L$997)=N$4)*('Měsíční rekapitulace'!$A$3:$A$999=$A100)*TEXT('Měsíční rekapitulace'!$Q$3:$Q$999,\"0,0;0;0;\\0\")))","v":0},{"$f":"IF($A100=\"\",,SUMPRODUCT((LOOKUP(ROW(O$1:O$997),ROW(O$1:O$997)/ISNUMBER('Měsíční rekapitulace'!$L$1:$L$997),'Měsíční rekapitulace'!$L$1:$L$997)=O$4)*('Měsíční rekapitulace'!$A$3:$A$999=$A100)*TEXT('Měsíční rekapitulace'!$Q$3:$Q$999,\"0,0;0;0;\\0\")))","v":0},0]
[{"$f":"IFERROR(INDEX('Měsíční rekapitulace'!A$3:A$999,SMALL(IF(('Měsíční rekapitulace'!A$3:A$999<>\"\")*('Měsíční rekapitulace'!A$3:A$999<>'Měsíční rekapitulace'!$A$2)*(COUNTIF(A$5:A100,'Měsíční rekapitulace'!A$3:A$999)=0),ROW('Měsíční rekapitulace'!A$3:A$999)-2),1)),\"\")","v":""},{"$f":"IFERROR(INDEX('Měsíční rekapitulace'!E$3:E$999,MATCH(A101,'Měsíční rekapitulace'!A$3:A$999,)),\"\")","v":""},null,{"$f":"IF($A101=\"\",,SUMPRODUCT((LOOKUP(ROW(D$1:D$997),ROW(D$1:D$997)/ISNUMBER('Měsíční rekapitulace'!$L$1:$L$997),'Měsíční rekapitulace'!$L$1:$L$997)=D$4)*('Měsíční rekapitulace'!$A$3:$A$999=$A101)*TEXT('Měsíční rekapitulace'!$Q$3:$Q$999,\"0,0;0;0;\\0\")))","v":0},{"$f":"IF($A101=\"\",,SUMPRODUCT((LOOKUP(ROW(E$1:E$997),ROW(E$1:E$997)/ISNUMBER('Měsíční rekapitulace'!$L$1:$L$997),'Měsíční rekapitulace'!$L$1:$L$997)=E$4)*('Měsíční rekapitulace'!$A$3:$A$999=$A101)*TEXT('Měsíční rekapitulace'!$Q$3:$Q$999,\"0,0;0;0;\\0\")))","v":0},{"$f":"IF($A101=\"\",,SUMPRODUCT((LOOKUP(ROW(F$1:F$997),ROW(F$1:F$997)/ISNUMBER('Měsíční rekapitulace'!$L$1:$L$997),'Měsíční rekapitulace'!$L$1:$L$997)=F$4)*('Měsíční rekapitulace'!$A$3:$A$999=$A101)*TEXT('Měsíční rekapitulace'!$Q$3:$Q$999,\"0,0;0;0;\\0\")))","v":0},{"$f":"IF($A101=\"\",,SUMPRODUCT((LOOKUP(ROW(G$1:G$997),ROW(G$1:G$997)/ISNUMBER('Měsíční rekapitulace'!$L$1:$L$997),'Měsíční rekapitulace'!$L$1:$L$997)=G$4)*('Měsíční rekapitulace'!$A$3:$A$999=$A101)*TEXT('Měsíční rekapitulace'!$Q$3:$Q$999,\"0,0;0;0;\\0\")))","v":0},{"$f":"IF($A101=\"\",,SUMPRODUCT((LOOKUP(ROW(H$1:H$997),ROW(H$1:H$997)/ISNUMBER('Měsíční rekapitulace'!$L$1:$L$997),'Měsíční rekapitulace'!$L$1:$L$997)=H$4)*('Měsíční rekapitulace'!$A$3:$A$999=$A101)*TEXT('Měsíční rekapitulace'!$Q$3:$Q$999,\"0,0;0;0;\\0\")))","v":0},{"$f":"IF($A101=\"\",,SUMPRODUCT((LOOKUP(ROW(I$1:I$997),ROW(I$1:I$997)/ISNUMBER('Měsíční rekapitulace'!$L$1:$L$997),'Měsíční rekapitulace'!$L$1:$L$997)=I$4)*('Měsíční rekapitulace'!$A$3:$A$999=$A101)*TEXT('Měsíční rekapitulace'!$Q$3:$Q$999,\"0,0;0;0;\\0\")))","v":0},{"$f":"IF($A101=\"\",,SUMPRODUCT((LOOKUP(ROW(J$1:J$997),ROW(J$1:J$997)/ISNUMBER('Měsíční rekapitulace'!$L$1:$L$997),'Měsíční rekapitulace'!$L$1:$L$997)=J$4)*('Měsíční rekapitulace'!$A$3:$A$999=$A101)*TEXT('Měsíční rekapitulace'!$Q$3:$Q$999,\"0,0;0;0;\\0\")))","v":0},{"$f":"IF($A101=\"\",,SUMPRODUCT((LOOKUP(ROW(K$1:K$997),ROW(K$1:K$997)/ISNUMBER('Měsíční rekapitulace'!$L$1:$L$997),'Měsíční rekapitulace'!$L$1:$L$997)=K$4)*('Měsíční rekapitulace'!$A$3:$A$999=$A101)*TEXT('Měsíční rekapitulace'!$Q$3:$Q$999,\"0,0;0;0;\\0\")))","v":0},{"$f":"IF($A101=\"\",,SUMPRODUCT((LOOKUP(ROW(L$1:L$997),ROW(L$1:L$997)/ISNUMBER('Měsíční rekapitulace'!$L$1:$L$997),'Měsíční rekapitulace'!$L$1:$L$997)=L$4)*('Měsíční rekapitulace'!$A$3:$A$999=$A101)*TEXT('Měsíční rekapitulace'!$Q$3:$Q$999,\"0,0;0;0;\\0\")))","v":0},{"$f":"IF($A101=\"\",,SUMPRODUCT((LOOKUP(ROW(M$1:M$997),ROW(M$1:M$997)/ISNUMBER('Měsíční rekapitulace'!$L$1:$L$997),'Měsíční rekapitulace'!$L$1:$L$997)=M$4)*('Měsíční rekapitulace'!$A$3:$A$999=$A101)*TEXT('Měsíční rekapitulace'!$Q$3:$Q$999,\"0,0;0;0;\\0\")))","v":0},{"$f":"IF($A101=\"\",,SUMPRODUCT((LOOKUP(ROW(N$1:N$997),ROW(N$1:N$997)/ISNUMBER('Měsíční rekapitulace'!$L$1:$L$997),'Měsíční rekapitulace'!$L$1:$L$997)=N$4)*('Měsíční rekapitulace'!$A$3:$A$999=$A101)*TEXT('Měsíční rekapitulace'!$Q$3:$Q$999,\"0,0;0;0;\\0\")))","v":0},{"$f":"IF($A101=\"\",,SUMPRODUCT((LOOKUP(ROW(O$1:O$997),ROW(O$1:O$997)/ISNUMBER('Měsíční rekapitulace'!$L$1:$L$997),'Měsíční rekapitulace'!$L$1:$L$997)=O$4)*('Měsíční rekapitulace'!$A$3:$A$999=$A101)*TEXT('Měsíční rekapitulace'!$Q$3:$Q$999,\"0,0;0;0;\\0\")))","v":0},0]
[{"$f":"IFERROR(INDEX('Měsíční rekapitulace'!A$3:A$999,SMALL(IF(('Měsíční rekapitulace'!A$3:A$999<>\"\")*('Měsíční rekapitulace'!A$3:A$999<>'Měsíční rekapitulace'!$A$2)*(COUNTIF(A$5:A101,'Měsíční rekapitulace'!A$3:A$999)=0),ROW('Měsíční rekapitulace'!A$3:A$999)-2),1)),\"\")","v":""},{"$f":"IFERROR(INDEX('Měsíční rekapitulace'!E$3:E$999,MATCH(A102,'Měsíční rekapitulace'!A$3:A$999,)),\"\")","v":""},null,{"$f":"IF($A102=\"\",,SUMPRODUCT((LOOKUP(ROW(D$1:D$997),ROW(D$1:D$997)/ISNUMBER('Měsíční rekapitulace'!$L$1:$L$997),'Měsíční rekapitulace'!$L$1:$L$997)=D$4)*('Měsíční rekapitulace'!$A$3:$A$999=$A102)*TEXT('Měsíční rekapitulace'!$Q$3:$Q$999,\"0,0;0;0;\\0\")))","v":0},{"$f":"IF($A102=\"\",,SUMPRODUCT((LOOKUP(ROW(E$1:E$997),ROW(E$1:E$997)/ISNUMBER('Měsíční rekapitulace'!$L$1:$L$997),'Měsíční rekapitulace'!$L$1:$L$997)=E$4)*('Měsíční rekapitulace'!$A$3:$A$999=$A102)*TEXT('Měsíční rekapitulace'!$Q$3:$Q$999,\"0,0;0;0;\\0\")))","v":0},{"$f":"IF($A102=\"\",,SUMPRODUCT((LOOKUP(ROW(F$1:F$997),ROW(F$1:F$997)/ISNUMBER('Měsíční rekapitulace'!$L$1:$L$997),'Měsíční rekapitulace'!$L$1:$L$997)=F$4)*('Měsíční rekapitulace'!$A$3:$A$999=$A102)*TEXT('Měsíční rekapitulace'!$Q$3:$Q$999,\"0,0;0;0;\\0\")))","v":0},{"$f":"IF($A102=\"\",,SUMPRODUCT((LOOKUP(ROW(G$1:G$997),ROW(G$1:G$997)/ISNUMBER('Měsíční rekapitulace'!$L$1:$L$997),'Měsíční rekapitulace'!$L$1:$L$997)=G$4)*('Měsíční rekapitulace'!$A$3:$A$999=$A102)*TEXT('Měsíční rekapitulace'!$Q$3:$Q$999,\"0,0;0;0;\\0\")))","v":0},{"$f":"IF($A102=\"\",,SUMPRODUCT((LOOKUP(ROW(H$1:H$997),ROW(H$1:H$997)/ISNUMBER('Měsíční rekapitulace'!$L$1:$L$997),'Měsíční rekapitulace'!$L$1:$L$997)=H$4)*('Měsíční rekapitulace'!$A$3:$A$999=$A102)*TEXT('Měsíční rekapitulace'!$Q$3:$Q$999,\"0,0;0;0;\\0\")))","v":0},{"$f":"IF($A102=\"\",,SUMPRODUCT((LOOKUP(ROW(I$1:I$997),ROW(I$1:I$997)/ISNUMBER('Měsíční rekapitulace'!$L$1:$L$997),'Měsíční rekapitulace'!$L$1:$L$997)=I$4)*('Měsíční rekapitulace'!$A$3:$A$999=$A102)*TEXT('Měsíční rekapitulace'!$Q$3:$Q$999,\"0,0;0;0;\\0\")))","v":0},{"$f":"IF($A102=\"\",,SUMPRODUCT((LOOKUP(ROW(J$1:J$997),ROW(J$1:J$997)/ISNUMBER('Měsíční rekapitulace'!$L$1:$L$997),'Měsíční rekapitulace'!$L$1:$L$997)=J$4)*('Měsíční rekapitulace'!$A$3:$A$999=$A102)*TEXT('Měsíční rekapitulace'!$Q$3:$Q$999,\"0,0;0;0;\\0\")))","v":0},{"$f":"IF($A102=\"\",,SUMPRODUCT((LOOKUP(ROW(K$1:K$997),ROW(K$1:K$997)/ISNUMBER('Měsíční rekapitulace'!$L$1:$L$997),'Měsíční rekapitulace'!$L$1:$L$997)=K$4)*('Měsíční rekapitulace'!$A$3:$A$999=$A102)*TEXT('Měsíční rekapitulace'!$Q$3:$Q$999,\"0,0;0;0;\\0\")))","v":0},{"$f":"IF($A102=\"\",,SUMPRODUCT((LOOKUP(ROW(L$1:L$997),ROW(L$1:L$997)/ISNUMBER('Měsíční rekapitulace'!$L$1:$L$997),'Měsíční rekapitulace'!$L$1:$L$997)=L$4)*('Měsíční rekapitulace'!$A$3:$A$999=$A102)*TEXT('Měsíční rekapitulace'!$Q$3:$Q$999,\"0,0;0;0;\\0\")))","v":0},{"$f":"IF($A102=\"\",,SUMPRODUCT((LOOKUP(ROW(M$1:M$997),ROW(M$1:M$997)/ISNUMBER('Měsíční rekapitulace'!$L$1:$L$997),'Měsíční rekapitulace'!$L$1:$L$997)=M$4)*('Měsíční rekapitulace'!$A$3:$A$999=$A102)*TEXT('Měsíční rekapitulace'!$Q$3:$Q$999,\"0,0;0;0;\\0\")))","v":0},{"$f":"IF($A102=\"\",,SUMPRODUCT((LOOKUP(ROW(N$1:N$997),ROW(N$1:N$997)/ISNUMBER('Měsíční rekapitulace'!$L$1:$L$997),'Měsíční rekapitulace'!$L$1:$L$997)=N$4)*('Měsíční rekapitulace'!$A$3:$A$999=$A102)*TEXT('Měsíční rekapitulace'!$Q$3:$Q$999,\"0,0;0;0;\\0\")))","v":0},{"$f":"IF($A102=\"\",,SUMPRODUCT((LOOKUP(ROW(O$1:O$997),ROW(O$1:O$997)/ISNUMBER('Měsíční rekapitulace'!$L$1:$L$997),'Měsíční rekapitulace'!$L$1:$L$997)=O$4)*('Měsíční rekapitulace'!$A$3:$A$999=$A102)*TEXT('Měsíční rekapitulace'!$Q$3:$Q$999,\"0,0;0;0;\\0\")))","v":0},0]
[{"$f":"IFERROR(INDEX('Měsíční rekapitulace'!A$3:A$999,SMALL(IF(('Měsíční rekapitulace'!A$3:A$999<>\"\")*('Měsíční rekapitulace'!A$3:A$999<>'Měsíční rekapitulace'!$A$2)*(COUNTIF(A$5:A102,'Měsíční rekapitulace'!A$3:A$999)=0),ROW('Měsíční rekapitulace'!A$3:A$999)-2),1)),\"\")","v":""},{"$f":"IFERROR(INDEX('Měsíční rekapitulace'!E$3:E$999,MATCH(A103,'Měsíční rekapitulace'!A$3:A$999,)),\"\")","v":""},null,{"$f":"IF($A103=\"\",,SUMPRODUCT((LOOKUP(ROW(D$1:D$997),ROW(D$1:D$997)/ISNUMBER('Měsíční rekapitulace'!$L$1:$L$997),'Měsíční rekapitulace'!$L$1:$L$997)=D$4)*('Měsíční rekapitulace'!$A$3:$A$999=$A103)*TEXT('Měsíční rekapitulace'!$Q$3:$Q$999,\"0,0;0;0;\\0\")))","v":0},{"$f":"IF($A103=\"\",,SUMPRODUCT((LOOKUP(ROW(E$1:E$997),ROW(E$1:E$997)/ISNUMBER('Měsíční rekapitulace'!$L$1:$L$997),'Měsíční rekapitulace'!$L$1:$L$997)=E$4)*('Měsíční rekapitulace'!$A$3:$A$999=$A103)*TEXT('Měsíční rekapitulace'!$Q$3:$Q$999,\"0,0;0;0;\\0\")))","v":0},{"$f":"IF($A103=\"\",,SUMPRODUCT((LOOKUP(ROW(F$1:F$997),ROW(F$1:F$997)/ISNUMBER('Měsíční rekapitulace'!$L$1:$L$997),'Měsíční rekapitulace'!$L$1:$L$997)=F$4)*('Měsíční rekapitulace'!$A$3:$A$999=$A103)*TEXT('Měsíční rekapitulace'!$Q$3:$Q$999,\"0,0;0;0;\\0\")))","v":0},{"$f":"IF($A103=\"\",,SUMPRODUCT((LOOKUP(ROW(G$1:G$997),ROW(G$1:G$997)/ISNUMBER('Měsíční rekapitulace'!$L$1:$L$997),'Měsíční rekapitulace'!$L$1:$L$997)=G$4)*('Měsíční rekapitulace'!$A$3:$A$999=$A103)*TEXT('Měsíční rekapitulace'!$Q$3:$Q$999,\"0,0;0;0;\\0\")))","v":0},{"$f":"IF($A103=\"\",,SUMPRODUCT((LOOKUP(ROW(H$1:H$997),ROW(H$1:H$997)/ISNUMBER('Měsíční rekapitulace'!$L$1:$L$997),'Měsíční rekapitulace'!$L$1:$L$997)=H$4)*('Měsíční rekapitulace'!$A$3:$A$999=$A103)*TEXT('Měsíční rekapitulace'!$Q$3:$Q$999,\"0,0;0;0;\\0\")))","v":0},{"$f":"IF($A103=\"\",,SUMPRODUCT((LOOKUP(ROW(I$1:I$997),ROW(I$1:I$997)/ISNUMBER('Měsíční rekapitulace'!$L$1:$L$997),'Měsíční rekapitulace'!$L$1:$L$997)=I$4)*('Měsíční rekapitulace'!$A$3:$A$999=$A103)*TEXT('Měsíční rekapitulace'!$Q$3:$Q$999,\"0,0;0;0;\\0\")))","v":0},{"$f":"IF($A103=\"\",,SUMPRODUCT((LOOKUP(ROW(J$1:J$997),ROW(J$1:J$997)/ISNUMBER('Měsíční rekapitulace'!$L$1:$L$997),'Měsíční rekapitulace'!$L$1:$L$997)=J$4)*('Měsíční rekapitulace'!$A$3:$A$999=$A103)*TEXT('Měsíční rekapitulace'!$Q$3:$Q$999,\"0,0;0;0;\\0\")))","v":0},{"$f":"IF($A103=\"\",,SUMPRODUCT((LOOKUP(ROW(K$1:K$997),ROW(K$1:K$997)/ISNUMBER('Měsíční rekapitulace'!$L$1:$L$997),'Měsíční rekapitulace'!$L$1:$L$997)=K$4)*('Měsíční rekapitulace'!$A$3:$A$999=$A103)*TEXT('Měsíční rekapitulace'!$Q$3:$Q$999,\"0,0;0;0;\\0\")))","v":0},{"$f":"IF($A103=\"\",,SUMPRODUCT((LOOKUP(ROW(L$1:L$997),ROW(L$1:L$997)/ISNUMBER('Měsíční rekapitulace'!$L$1:$L$997),'Měsíční rekapitulace'!$L$1:$L$997)=L$4)*('Měsíční rekapitulace'!$A$3:$A$999=$A103)*TEXT('Měsíční rekapitulace'!$Q$3:$Q$999,\"0,0;0;0;\\0\")))","v":0},{"$f":"IF($A103=\"\",,SUMPRODUCT((LOOKUP(ROW(M$1:M$997),ROW(M$1:M$997)/ISNUMBER('Měsíční rekapitulace'!$L$1:$L$997),'Měsíční rekapitulace'!$L$1:$L$997)=M$4)*('Měsíční rekapitulace'!$A$3:$A$999=$A103)*TEXT('Měsíční rekapitulace'!$Q$3:$Q$999,\"0,0;0;0;\\0\")))","v":0},{"$f":"IF($A103=\"\",,SUMPRODUCT((LOOKUP(ROW(N$1:N$997),ROW(N$1:N$997)/ISNUMBER('Měsíční rekapitulace'!$L$1:$L$997),'Měsíční rekapitulace'!$L$1:$L$997)=N$4)*('Měsíční rekapitulace'!$A$3:$A$999=$A103)*TEXT('Měsíční rekapitulace'!$Q$3:$Q$999,\"0,0;0;0;\\0\")))","v":0},{"$f":"IF($A103=\"\",,SUMPRODUCT((LOOKUP(ROW(O$1:O$997),ROW(O$1:O$997)/ISNUMBER('Měsíční rekapitulace'!$L$1:$L$997),'Měsíční rekapitulace'!$L$1:$L$997)=O$4)*('Měsíční rekapitulace'!$A$3:$A$999=$A103)*TEXT('Měsíční rekapitulace'!$Q$3:$Q$999,\"0,0;0;0;\\0\")))","v":0},0]
[{"$f":"IFERROR(INDEX('Měsíční rekapitulace'!A$3:A$999,SMALL(IF(('Měsíční rekapitulace'!A$3:A$999<>\"\")*('Měsíční rekapitulace'!A$3:A$999<>'Měsíční rekapitulace'!$A$2)*(COUNTIF(A$5:A103,'Měsíční rekapitulace'!A$3:A$999)=0),ROW('Měsíční rekapitulace'!A$3:A$999)-2),1)),\"\")","v":""},{"$f":"IFERROR(INDEX('Měsíční rekapitulace'!E$3:E$999,MATCH(A104,'Měsíční rekapitulace'!A$3:A$999,)),\"\")","v":""},null,{"$f":"IF($A104=\"\",,SUMPRODUCT((LOOKUP(ROW(D$1:D$997),ROW(D$1:D$997)/ISNUMBER('Měsíční rekapitulace'!$L$1:$L$997),'Měsíční rekapitulace'!$L$1:$L$997)=D$4)*('Měsíční rekapitulace'!$A$3:$A$999=$A104)*TEXT('Měsíční rekapitulace'!$Q$3:$Q$999,\"0,0;0;0;\\0\")))","v":0},{"$f":"IF($A104=\"\",,SUMPRODUCT((LOOKUP(ROW(E$1:E$997),ROW(E$1:E$997)/ISNUMBER('Měsíční rekapitulace'!$L$1:$L$997),'Měsíční rekapitulace'!$L$1:$L$997)=E$4)*('Měsíční rekapitulace'!$A$3:$A$999=$A104)*TEXT('Měsíční rekapitulace'!$Q$3:$Q$999,\"0,0;0;0;\\0\")))","v":0},{"$f":"IF($A104=\"\",,SUMPRODUCT((LOOKUP(ROW(F$1:F$997),ROW(F$1:F$997)/ISNUMBER('Měsíční rekapitulace'!$L$1:$L$997),'Měsíční rekapitulace'!$L$1:$L$997)=F$4)*('Měsíční rekapitulace'!$A$3:$A$999=$A104)*TEXT('Měsíční rekapitulace'!$Q$3:$Q$999,\"0,0;0;0;\\0\")))","v":0},{"$f":"IF($A104=\"\",,SUMPRODUCT((LOOKUP(ROW(G$1:G$997),ROW(G$1:G$997)/ISNUMBER('Měsíční rekapitulace'!$L$1:$L$997),'Měsíční rekapitulace'!$L$1:$L$997)=G$4)*('Měsíční rekapitulace'!$A$3:$A$999=$A104)*TEXT('Měsíční rekapitulace'!$Q$3:$Q$999,\"0,0;0;0;\\0\")))","v":0},{"$f":"IF($A104=\"\",,SUMPRODUCT((LOOKUP(ROW(H$1:H$997),ROW(H$1:H$997)/ISNUMBER('Měsíční rekapitulace'!$L$1:$L$997),'Měsíční rekapitulace'!$L$1:$L$997)=H$4)*('Měsíční rekapitulace'!$A$3:$A$999=$A104)*TEXT('Měsíční rekapitulace'!$Q$3:$Q$999,\"0,0;0;0;\\0\")))","v":0},{"$f":"IF($A104=\"\",,SUMPRODUCT((LOOKUP(ROW(I$1:I$997),ROW(I$1:I$997)/ISNUMBER('Měsíční rekapitulace'!$L$1:$L$997),'Měsíční rekapitulace'!$L$1:$L$997)=I$4)*('Měsíční rekapitulace'!$A$3:$A$999=$A104)*TEXT('Měsíční rekapitulace'!$Q$3:$Q$999,\"0,0;0;0;\\0\")))","v":0},{"$f":"IF($A104=\"\",,SUMPRODUCT((LOOKUP(ROW(J$1:J$997),ROW(J$1:J$997)/ISNUMBER('Měsíční rekapitulace'!$L$1:$L$997),'Měsíční rekapitulace'!$L$1:$L$997)=J$4)*('Měsíční rekapitulace'!$A$3:$A$999=$A104)*TEXT('Měsíční rekapitulace'!$Q$3:$Q$999,\"0,0;0;0;\\0\")))","v":0},{"$f":"IF($A104=\"\",,SUMPRODUCT((LOOKUP(ROW(K$1:K$997),ROW(K$1:K$997)/ISNUMBER('Měsíční rekapitulace'!$L$1:$L$997),'Měsíční rekapitulace'!$L$1:$L$997)=K$4)*('Měsíční rekapitulace'!$A$3:$A$999=$A104)*TEXT('Měsíční rekapitulace'!$Q$3:$Q$999,\"0,0;0;0;\\0\")))","v":0},{"$f":"IF($A104=\"\",,SUMPRODUCT((LOOKUP(ROW(L$1:L$997),ROW(L$1:L$997)/ISNUMBER('Měsíční rekapitulace'!$L$1:$L$997),'Měsíční rekapitulace'!$L$1:$L$997)=L$4)*('Měsíční rekapitulace'!$A$3:$A$999=$A104)*TEXT('Měsíční rekapitulace'!$Q$3:$Q$999,\"0,0;0;0;\\0\")))","v":0},{"$f":"IF($A104=\"\",,SUMPRODUCT((LOOKUP(ROW(M$1:M$997),ROW(M$1:M$997)/ISNUMBER('Měsíční rekapitulace'!$L$1:$L$997),'Měsíční rekapitulace'!$L$1:$L$997)=M$4)*('Měsíční rekapitulace'!$A$3:$A$999=$A104)*TEXT('Měsíční rekapitulace'!$Q$3:$Q$999,\"0,0;0;0;\\0\")))","v":0},{"$f":"IF($A104=\"\",,SUMPRODUCT((LOOKUP(ROW(N$1:N$997),ROW(N$1:N$997)/ISNUMBER('Měsíční rekapitulace'!$L$1:$L$997),'Měsíční rekapitulace'!$L$1:$L$997)=N$4)*('Měsíční rekapitulace'!$A$3:$A$999=$A104)*TEXT('Měsíční rekapitulace'!$Q$3:$Q$999,\"0,0;0;0;\\0\")))","v":0},{"$f":"IF($A104=\"\",,SUMPRODUCT((LOOKUP(ROW(O$1:O$997),ROW(O$1:O$997)/ISNUMBER('Měsíční rekapitulace'!$L$1:$L$997),'Měsíční rekapitulace'!$L$1:$L$997)=O$4)*('Měsíční rekapitulace'!$A$3:$A$999=$A104)*TEXT('Měsíční rekapitulace'!$Q$3:$Q$999,\"0,0;0;0;\\0\")))","v":0},0]
[{"$f":"IFERROR(INDEX('Měsíční rekapitulace'!A$3:A$999,SMALL(IF(('Měsíční rekapitulace'!A$3:A$999<>\"\")*('Měsíční rekapitulace'!A$3:A$999<>'Měsíční rekapitulace'!$A$2)*(COUNTIF(A$5:A104,'Měsíční rekapitulace'!A$3:A$999)=0),ROW('Měsíční rekapitulace'!A$3:A$999)-2),1)),\"\")","v":""},{"$f":"IFERROR(INDEX('Měsíční rekapitulace'!E$3:E$999,MATCH(A105,'Měsíční rekapitulace'!A$3:A$999,)),\"\")","v":""},null,{"$f":"IF($A105=\"\",,SUMPRODUCT((LOOKUP(ROW(D$1:D$997),ROW(D$1:D$997)/ISNUMBER('Měsíční rekapitulace'!$L$1:$L$997),'Měsíční rekapitulace'!$L$1:$L$997)=D$4)*('Měsíční rekapitulace'!$A$3:$A$999=$A105)*TEXT('Měsíční rekapitulace'!$Q$3:$Q$999,\"0,0;0;0;\\0\")))","v":0},{"$f":"IF($A105=\"\",,SUMPRODUCT((LOOKUP(ROW(E$1:E$997),ROW(E$1:E$997)/ISNUMBER('Měsíční rekapitulace'!$L$1:$L$997),'Měsíční rekapitulace'!$L$1:$L$997)=E$4)*('Měsíční rekapitulace'!$A$3:$A$999=$A105)*TEXT('Měsíční rekapitulace'!$Q$3:$Q$999,\"0,0;0;0;\\0\")))","v":0},{"$f":"IF($A105=\"\",,SUMPRODUCT((LOOKUP(ROW(F$1:F$997),ROW(F$1:F$997)/ISNUMBER('Měsíční rekapitulace'!$L$1:$L$997),'Měsíční rekapitulace'!$L$1:$L$997)=F$4)*('Měsíční rekapitulace'!$A$3:$A$999=$A105)*TEXT('Měsíční rekapitulace'!$Q$3:$Q$999,\"0,0;0;0;\\0\")))","v":0},{"$f":"IF($A105=\"\",,SUMPRODUCT((LOOKUP(ROW(G$1:G$997),ROW(G$1:G$997)/ISNUMBER('Měsíční rekapitulace'!$L$1:$L$997),'Měsíční rekapitulace'!$L$1:$L$997)=G$4)*('Měsíční rekapitulace'!$A$3:$A$999=$A105)*TEXT('Měsíční rekapitulace'!$Q$3:$Q$999,\"0,0;0;0;\\0\")))","v":0},{"$f":"IF($A105=\"\",,SUMPRODUCT((LOOKUP(ROW(H$1:H$997),ROW(H$1:H$997)/ISNUMBER('Měsíční rekapitulace'!$L$1:$L$997),'Měsíční rekapitulace'!$L$1:$L$997)=H$4)*('Měsíční rekapitulace'!$A$3:$A$999=$A105)*TEXT('Měsíční rekapitulace'!$Q$3:$Q$999,\"0,0;0;0;\\0\")))","v":0},{"$f":"IF($A105=\"\",,SUMPRODUCT((LOOKUP(ROW(I$1:I$997),ROW(I$1:I$997)/ISNUMBER('Měsíční rekapitulace'!$L$1:$L$997),'Měsíční rekapitulace'!$L$1:$L$997)=I$4)*('Měsíční rekapitulace'!$A$3:$A$999=$A105)*TEXT('Měsíční rekapitulace'!$Q$3:$Q$999,\"0,0;0;0;\\0\")))","v":0},{"$f":"IF($A105=\"\",,SUMPRODUCT((LOOKUP(ROW(J$1:J$997),ROW(J$1:J$997)/ISNUMBER('Měsíční rekapitulace'!$L$1:$L$997),'Měsíční rekapitulace'!$L$1:$L$997)=J$4)*('Měsíční rekapitulace'!$A$3:$A$999=$A105)*TEXT('Měsíční rekapitulace'!$Q$3:$Q$999,\"0,0;0;0;\\0\")))","v":0},{"$f":"IF($A105=\"\",,SUMPRODUCT((LOOKUP(ROW(K$1:K$997),ROW(K$1:K$997)/ISNUMBER('Měsíční rekapitulace'!$L$1:$L$997),'Měsíční rekapitulace'!$L$1:$L$997)=K$4)*('Měsíční rekapitulace'!$A$3:$A$999=$A105)*TEXT('Měsíční rekapitulace'!$Q$3:$Q$999,\"0,0;0;0;\\0\")))","v":0},{"$f":"IF($A105=\"\",,SUMPRODUCT((LOOKUP(ROW(L$1:L$997),ROW(L$1:L$997)/ISNUMBER('Měsíční rekapitulace'!$L$1:$L$997),'Měsíční rekapitulace'!$L$1:$L$997)=L$4)*('Měsíční rekapitulace'!$A$3:$A$999=$A105)*TEXT('Měsíční rekapitulace'!$Q$3:$Q$999,\"0,0;0;0;\\0\")))","v":0},{"$f":"IF($A105=\"\",,SUMPRODUCT((LOOKUP(ROW(M$1:M$997),ROW(M$1:M$997)/ISNUMBER('Měsíční rekapitulace'!$L$1:$L$997),'Měsíční rekapitulace'!$L$1:$L$997)=M$4)*('Měsíční rekapitulace'!$A$3:$A$999=$A105)*TEXT('Měsíční rekapitulace'!$Q$3:$Q$999,\"0,0;0;0;\\0\")))","v":0},{"$f":"IF($A105=\"\",,SUMPRODUCT((LOOKUP(ROW(N$1:N$997),ROW(N$1:N$997)/ISNUMBER('Měsíční rekapitulace'!$L$1:$L$997),'Měsíční rekapitulace'!$L$1:$L$997)=N$4)*('Měsíční rekapitulace'!$A$3:$A$999=$A105)*TEXT('Měsíční rekapitulace'!$Q$3:$Q$999,\"0,0;0;0;\\0\")))","v":0},{"$f":"IF($A105=\"\",,SUMPRODUCT((LOOKUP(ROW(O$1:O$997),ROW(O$1:O$997)/ISNUMBER('Měsíční rekapitulace'!$L$1:$L$997),'Měsíční rekapitulace'!$L$1:$L$997)=O$4)*('Měsíční rekapitulace'!$A$3:$A$999=$A105)*TEXT('Měsíční rekapitulace'!$Q$3:$Q$999,\"0,0;0;0;\\0\")))","v":0},0]
[{"$f":"IFERROR(INDEX('Měsíční rekapitulace'!A$3:A$999,SMALL(IF(('Měsíční rekapitulace'!A$3:A$999<>\"\")*('Měsíční rekapitulace'!A$3:A$999<>'Měsíční rekapitulace'!$A$2)*(COUNTIF(A$5:A105,'Měsíční rekapitulace'!A$3:A$999)=0),ROW('Měsíční rekapitulace'!A$3:A$999)-2),1)),\"\")","v":""},{"$f":"IFERROR(INDEX('Měsíční rekapitulace'!E$3:E$999,MATCH(A106,'Měsíční rekapitulace'!A$3:A$999,)),\"\")","v":""},null,{"$f":"IF($A106=\"\",,SUMPRODUCT((LOOKUP(ROW(D$1:D$997),ROW(D$1:D$997)/ISNUMBER('Měsíční rekapitulace'!$L$1:$L$997),'Měsíční rekapitulace'!$L$1:$L$997)=D$4)*('Měsíční rekapitulace'!$A$3:$A$999=$A106)*TEXT('Měsíční rekapitulace'!$Q$3:$Q$999,\"0,0;0;0;\\0\")))","v":0},{"$f":"IF($A106=\"\",,SUMPRODUCT((LOOKUP(ROW(E$1:E$997),ROW(E$1:E$997)/ISNUMBER('Měsíční rekapitulace'!$L$1:$L$997),'Měsíční rekapitulace'!$L$1:$L$997)=E$4)*('Měsíční rekapitulace'!$A$3:$A$999=$A106)*TEXT('Měsíční rekapitulace'!$Q$3:$Q$999,\"0,0;0;0;\\0\")))","v":0},{"$f":"IF($A106=\"\",,SUMPRODUCT((LOOKUP(ROW(F$1:F$997),ROW(F$1:F$997)/ISNUMBER('Měsíční rekapitulace'!$L$1:$L$997),'Měsíční rekapitulace'!$L$1:$L$997)=F$4)*('Měsíční rekapitulace'!$A$3:$A$999=$A106)*TEXT('Měsíční rekapitulace'!$Q$3:$Q$999,\"0,0;0;0;\\0\")))","v":0},{"$f":"IF($A106=\"\",,SUMPRODUCT((LOOKUP(ROW(G$1:G$997),ROW(G$1:G$997)/ISNUMBER('Měsíční rekapitulace'!$L$1:$L$997),'Měsíční rekapitulace'!$L$1:$L$997)=G$4)*('Měsíční rekapitulace'!$A$3:$A$999=$A106)*TEXT('Měsíční rekapitulace'!$Q$3:$Q$999,\"0,0;0;0;\\0\")))","v":0},{"$f":"IF($A106=\"\",,SUMPRODUCT((LOOKUP(ROW(H$1:H$997),ROW(H$1:H$997)/ISNUMBER('Měsíční rekapitulace'!$L$1:$L$997),'Měsíční rekapitulace'!$L$1:$L$997)=H$4)*('Měsíční rekapitulace'!$A$3:$A$999=$A106)*TEXT('Měsíční rekapitulace'!$Q$3:$Q$999,\"0,0;0;0;\\0\")))","v":0},{"$f":"IF($A106=\"\",,SUMPRODUCT((LOOKUP(ROW(I$1:I$997),ROW(I$1:I$997)/ISNUMBER('Měsíční rekapitulace'!$L$1:$L$997),'Měsíční rekapitulace'!$L$1:$L$997)=I$4)*('Měsíční rekapitulace'!$A$3:$A$999=$A106)*TEXT('Měsíční rekapitulace'!$Q$3:$Q$999,\"0,0;0;0;\\0\")))","v":0},{"$f":"IF($A106=\"\",,SUMPRODUCT((LOOKUP(ROW(J$1:J$997),ROW(J$1:J$997)/ISNUMBER('Měsíční rekapitulace'!$L$1:$L$997),'Měsíční rekapitulace'!$L$1:$L$997)=J$4)*('Měsíční rekapitulace'!$A$3:$A$999=$A106)*TEXT('Měsíční rekapitulace'!$Q$3:$Q$999,\"0,0;0;0;\\0\")))","v":0},{"$f":"IF($A106=\"\",,SUMPRODUCT((LOOKUP(ROW(K$1:K$997),ROW(K$1:K$997)/ISNUMBER('Měsíční rekapitulace'!$L$1:$L$997),'Měsíční rekapitulace'!$L$1:$L$997)=K$4)*('Měsíční rekapitulace'!$A$3:$A$999=$A106)*TEXT('Měsíční rekapitulace'!$Q$3:$Q$999,\"0,0;0;0;\\0\")))","v":0},{"$f":"IF($A106=\"\",,SUMPRODUCT((LOOKUP(ROW(L$1:L$997),ROW(L$1:L$997)/ISNUMBER('Měsíční rekapitulace'!$L$1:$L$997),'Měsíční rekapitulace'!$L$1:$L$997)=L$4)*('Měsíční rekapitulace'!$A$3:$A$999=$A106)*TEXT('Měsíční rekapitulace'!$Q$3:$Q$999,\"0,0;0;0;\\0\")))","v":0},{"$f":"IF($A106=\"\",,SUMPRODUCT((LOOKUP(ROW(M$1:M$997),ROW(M$1:M$997)/ISNUMBER('Měsíční rekapitulace'!$L$1:$L$997),'Měsíční rekapitulace'!$L$1:$L$997)=M$4)*('Měsíční rekapitulace'!$A$3:$A$999=$A106)*TEXT('Měsíční rekapitulace'!$Q$3:$Q$999,\"0,0;0;0;\\0\")))","v":0},{"$f":"IF($A106=\"\",,SUMPRODUCT((LOOKUP(ROW(N$1:N$997),ROW(N$1:N$997)/ISNUMBER('Měsíční rekapitulace'!$L$1:$L$997),'Měsíční rekapitulace'!$L$1:$L$997)=N$4)*('Měsíční rekapitulace'!$A$3:$A$999=$A106)*TEXT('Měsíční rekapitulace'!$Q$3:$Q$999,\"0,0;0;0;\\0\")))","v":0},{"$f":"IF($A106=\"\",,SUMPRODUCT((LOOKUP(ROW(O$1:O$997),ROW(O$1:O$997)/ISNUMBER('Měsíční rekapitulace'!$L$1:$L$997),'Měsíční rekapitulace'!$L$1:$L$997)=O$4)*('Měsíční rekapitulace'!$A$3:$A$999=$A106)*TEXT('Měsíční rekapitulace'!$Q$3:$Q$999,\"0,0;0;0;\\0\")))","v":0},0]
[{"$f":"IFERROR(INDEX('Měsíční rekapitulace'!A$3:A$999,SMALL(IF(('Měsíční rekapitulace'!A$3:A$999<>\"\")*('Měsíční rekapitulace'!A$3:A$999<>'Měsíční rekapitulace'!$A$2)*(COUNTIF(A$5:A106,'Měsíční rekapitulace'!A$3:A$999)=0),ROW('Měsíční rekapitulace'!A$3:A$999)-2),1)),\"\")","v":""},{"$f":"IFERROR(INDEX('Měsíční rekapitulace'!E$3:E$999,MATCH(A107,'Měsíční rekapitulace'!A$3:A$999,)),\"\")","v":""},null,{"$f":"IF($A107=\"\",,SUMPRODUCT((LOOKUP(ROW(D$1:D$997),ROW(D$1:D$997)/ISNUMBER('Měsíční rekapitulace'!$L$1:$L$997),'Měsíční rekapitulace'!$L$1:$L$997)=D$4)*('Měsíční rekapitulace'!$A$3:$A$999=$A107)*TEXT('Měsíční rekapitulace'!$Q$3:$Q$999,\"0,0;0;0;\\0\")))","v":0},{"$f":"IF($A107=\"\",,SUMPRODUCT((LOOKUP(ROW(E$1:E$997),ROW(E$1:E$997)/ISNUMBER('Měsíční rekapitulace'!$L$1:$L$997),'Měsíční rekapitulace'!$L$1:$L$997)=E$4)*('Měsíční rekapitulace'!$A$3:$A$999=$A107)*TEXT('Měsíční rekapitulace'!$Q$3:$Q$999,\"0,0;0;0;\\0\")))","v":0},{"$f":"IF($A107=\"\",,SUMPRODUCT((LOOKUP(ROW(F$1:F$997),ROW(F$1:F$997)/ISNUMBER('Měsíční rekapitulace'!$L$1:$L$997),'Měsíční rekapitulace'!$L$1:$L$997)=F$4)*('Měsíční rekapitulace'!$A$3:$A$999=$A107)*TEXT('Měsíční rekapitulace'!$Q$3:$Q$999,\"0,0;0;0;\\0\")))","v":0},{"$f":"IF($A107=\"\",,SUMPRODUCT((LOOKUP(ROW(G$1:G$997),ROW(G$1:G$997)/ISNUMBER('Měsíční rekapitulace'!$L$1:$L$997),'Měsíční rekapitulace'!$L$1:$L$997)=G$4)*('Měsíční rekapitulace'!$A$3:$A$999=$A107)*TEXT('Měsíční rekapitulace'!$Q$3:$Q$999,\"0,0;0;0;\\0\")))","v":0},{"$f":"IF($A107=\"\",,SUMPRODUCT((LOOKUP(ROW(H$1:H$997),ROW(H$1:H$997)/ISNUMBER('Měsíční rekapitulace'!$L$1:$L$997),'Měsíční rekapitulace'!$L$1:$L$997)=H$4)*('Měsíční rekapitulace'!$A$3:$A$999=$A107)*TEXT('Měsíční rekapitulace'!$Q$3:$Q$999,\"0,0;0;0;\\0\")))","v":0},{"$f":"IF($A107=\"\",,SUMPRODUCT((LOOKUP(ROW(I$1:I$997),ROW(I$1:I$997)/ISNUMBER('Měsíční rekapitulace'!$L$1:$L$997),'Měsíční rekapitulace'!$L$1:$L$997)=I$4)*('Měsíční rekapitulace'!$A$3:$A$999=$A107)*TEXT('Měsíční rekapitulace'!$Q$3:$Q$999,\"0,0;0;0;\\0\")))","v":0},{"$f":"IF($A107=\"\",,SUMPRODUCT((LOOKUP(ROW(J$1:J$997),ROW(J$1:J$997)/ISNUMBER('Měsíční rekapitulace'!$L$1:$L$997),'Měsíční rekapitulace'!$L$1:$L$997)=J$4)*('Měsíční rekapitulace'!$A$3:$A$999=$A107)*TEXT('Měsíční rekapitulace'!$Q$3:$Q$999,\"0,0;0;0;\\0\")))","v":0},{"$f":"IF($A107=\"\",,SUMPRODUCT((LOOKUP(ROW(K$1:K$997),ROW(K$1:K$997)/ISNUMBER('Měsíční rekapitulace'!$L$1:$L$997),'Měsíční rekapitulace'!$L$1:$L$997)=K$4)*('Měsíční rekapitulace'!$A$3:$A$999=$A107)*TEXT('Měsíční rekapitulace'!$Q$3:$Q$999,\"0,0;0;0;\\0\")))","v":0},{"$f":"IF($A107=\"\",,SUMPRODUCT((LOOKUP(ROW(L$1:L$997),ROW(L$1:L$997)/ISNUMBER('Měsíční rekapitulace'!$L$1:$L$997),'Měsíční rekapitulace'!$L$1:$L$997)=L$4)*('Měsíční rekapitulace'!$A$3:$A$999=$A107)*TEXT('Měsíční rekapitulace'!$Q$3:$Q$999,\"0,0;0;0;\\0\")))","v":0},{"$f":"IF($A107=\"\",,SUMPRODUCT((LOOKUP(ROW(M$1:M$997),ROW(M$1:M$997)/ISNUMBER('Měsíční rekapitulace'!$L$1:$L$997),'Měsíční rekapitulace'!$L$1:$L$997)=M$4)*('Měsíční rekapitulace'!$A$3:$A$999=$A107)*TEXT('Měsíční rekapitulace'!$Q$3:$Q$999,\"0,0;0;0;\\0\")))","v":0},{"$f":"IF($A107=\"\",,SUMPRODUCT((LOOKUP(ROW(N$1:N$997),ROW(N$1:N$997)/ISNUMBER('Měsíční rekapitulace'!$L$1:$L$997),'Měsíční rekapitulace'!$L$1:$L$997)=N$4)*('Měsíční rekapitulace'!$A$3:$A$999=$A107)*TEXT('Měsíční rekapitulace'!$Q$3:$Q$999,\"0,0;0;0;\\0\")))","v":0},{"$f":"IF($A107=\"\",,SUMPRODUCT((LOOKUP(ROW(O$1:O$997),ROW(O$1:O$997)/ISNUMBER('Měsíční rekapitulace'!$L$1:$L$997),'Měsíční rekapitulace'!$L$1:$L$997)=O$4)*('Měsíční rekapitulace'!$A$3:$A$999=$A107)*TEXT('Měsíční rekapitulace'!$Q$3:$Q$999,\"0,0;0;0;\\0\")))","v":0},0]
[{"$f":"IFERROR(INDEX('Měsíční rekapitulace'!A$3:A$999,SMALL(IF(('Měsíční rekapitulace'!A$3:A$999<>\"\")*('Měsíční rekapitulace'!A$3:A$999<>'Měsíční rekapitulace'!$A$2)*(COUNTIF(A$5:A107,'Měsíční rekapitulace'!A$3:A$999)=0),ROW('Měsíční rekapitulace'!A$3:A$999)-2),1)),\"\")","v":""},{"$f":"IFERROR(INDEX('Měsíční rekapitulace'!E$3:E$999,MATCH(A108,'Měsíční rekapitulace'!A$3:A$999,)),\"\")","v":""},null,{"$f":"IF($A108=\"\",,SUMPRODUCT((LOOKUP(ROW(D$1:D$997),ROW(D$1:D$997)/ISNUMBER('Měsíční rekapitulace'!$L$1:$L$997),'Měsíční rekapitulace'!$L$1:$L$997)=D$4)*('Měsíční rekapitulace'!$A$3:$A$999=$A108)*TEXT('Měsíční rekapitulace'!$Q$3:$Q$999,\"0,0;0;0;\\0\")))","v":0},{"$f":"IF($A108=\"\",,SUMPRODUCT((LOOKUP(ROW(E$1:E$997),ROW(E$1:E$997)/ISNUMBER('Měsíční rekapitulace'!$L$1:$L$997),'Měsíční rekapitulace'!$L$1:$L$997)=E$4)*('Měsíční rekapitulace'!$A$3:$A$999=$A108)*TEXT('Měsíční rekapitulace'!$Q$3:$Q$999,\"0,0;0;0;\\0\")))","v":0},{"$f":"IF($A108=\"\",,SUMPRODUCT((LOOKUP(ROW(F$1:F$997),ROW(F$1:F$997)/ISNUMBER('Měsíční rekapitulace'!$L$1:$L$997),'Měsíční rekapitulace'!$L$1:$L$997)=F$4)*('Měsíční rekapitulace'!$A$3:$A$999=$A108)*TEXT('Měsíční rekapitulace'!$Q$3:$Q$999,\"0,0;0;0;\\0\")))","v":0},{"$f":"IF($A108=\"\",,SUMPRODUCT((LOOKUP(ROW(G$1:G$997),ROW(G$1:G$997)/ISNUMBER('Měsíční rekapitulace'!$L$1:$L$997),'Měsíční rekapitulace'!$L$1:$L$997)=G$4)*('Měsíční rekapitulace'!$A$3:$A$999=$A108)*TEXT('Měsíční rekapitulace'!$Q$3:$Q$999,\"0,0;0;0;\\0\")))","v":0},{"$f":"IF($A108=\"\",,SUMPRODUCT((LOOKUP(ROW(H$1:H$997),ROW(H$1:H$997)/ISNUMBER('Měsíční rekapitulace'!$L$1:$L$997),'Měsíční rekapitulace'!$L$1:$L$997)=H$4)*('Měsíční rekapitulace'!$A$3:$A$999=$A108)*TEXT('Měsíční rekapitulace'!$Q$3:$Q$999,\"0,0;0;0;\\0\")))","v":0},{"$f":"IF($A108=\"\",,SUMPRODUCT((LOOKUP(ROW(I$1:I$997),ROW(I$1:I$997)/ISNUMBER('Měsíční rekapitulace'!$L$1:$L$997),'Měsíční rekapitulace'!$L$1:$L$997)=I$4)*('Měsíční rekapitulace'!$A$3:$A$999=$A108)*TEXT('Měsíční rekapitulace'!$Q$3:$Q$999,\"0,0;0;0;\\0\")))","v":0},{"$f":"IF($A108=\"\",,SUMPRODUCT((LOOKUP(ROW(J$1:J$997),ROW(J$1:J$997)/ISNUMBER('Měsíční rekapitulace'!$L$1:$L$997),'Měsíční rekapitulace'!$L$1:$L$997)=J$4)*('Měsíční rekapitulace'!$A$3:$A$999=$A108)*TEXT('Měsíční rekapitulace'!$Q$3:$Q$999,\"0,0;0;0;\\0\")))","v":0},{"$f":"IF($A108=\"\",,SUMPRODUCT((LOOKUP(ROW(K$1:K$997),ROW(K$1:K$997)/ISNUMBER('Měsíční rekapitulace'!$L$1:$L$997),'Měsíční rekapitulace'!$L$1:$L$997)=K$4)*('Měsíční rekapitulace'!$A$3:$A$999=$A108)*TEXT('Měsíční rekapitulace'!$Q$3:$Q$999,\"0,0;0;0;\\0\")))","v":0},{"$f":"IF($A108=\"\",,SUMPRODUCT((LOOKUP(ROW(L$1:L$997),ROW(L$1:L$997)/ISNUMBER('Měsíční rekapitulace'!$L$1:$L$997),'Měsíční rekapitulace'!$L$1:$L$997)=L$4)*('Měsíční rekapitulace'!$A$3:$A$999=$A108)*TEXT('Měsíční rekapitulace'!$Q$3:$Q$999,\"0,0;0;0;\\0\")))","v":0},{"$f":"IF($A108=\"\",,SUMPRODUCT((LOOKUP(ROW(M$1:M$997),ROW(M$1:M$997)/ISNUMBER('Měsíční rekapitulace'!$L$1:$L$997),'Měsíční rekapitulace'!$L$1:$L$997)=M$4)*('Měsíční rekapitulace'!$A$3:$A$999=$A108)*TEXT('Měsíční rekapitulace'!$Q$3:$Q$999,\"0,0;0;0;\\0\")))","v":0},{"$f":"IF($A108=\"\",,SUMPRODUCT((LOOKUP(ROW(N$1:N$997),ROW(N$1:N$997)/ISNUMBER('Měsíční rekapitulace'!$L$1:$L$997),'Měsíční rekapitulace'!$L$1:$L$997)=N$4)*('Měsíční rekapitulace'!$A$3:$A$999=$A108)*TEXT('Měsíční rekapitulace'!$Q$3:$Q$999,\"0,0;0;0;\\0\")))","v":0},{"$f":"IF($A108=\"\",,SUMPRODUCT((LOOKUP(ROW(O$1:O$997),ROW(O$1:O$997)/ISNUMBER('Měsíční rekapitulace'!$L$1:$L$997),'Měsíční rekapitulace'!$L$1:$L$997)=O$4)*('Měsíční rekapitulace'!$A$3:$A$999=$A108)*TEXT('Měsíční rekapitulace'!$Q$3:$Q$999,\"0,0;0;0;\\0\")))","v":0},0]
[{"$f":"IFERROR(INDEX('Měsíční rekapitulace'!A$3:A$999,SMALL(IF(('Měsíční rekapitulace'!A$3:A$999<>\"\")*('Měsíční rekapitulace'!A$3:A$999<>'Měsíční rekapitulace'!$A$2)*(COUNTIF(A$5:A108,'Měsíční rekapitulace'!A$3:A$999)=0),ROW('Měsíční rekapitulace'!A$3:A$999)-2),1)),\"\")","v":""},{"$f":"IFERROR(INDEX('Měsíční rekapitulace'!E$3:E$999,MATCH(A109,'Měsíční rekapitulace'!A$3:A$999,)),\"\")","v":""},null,{"$f":"IF($A109=\"\",,SUMPRODUCT((LOOKUP(ROW(D$1:D$997),ROW(D$1:D$997)/ISNUMBER('Měsíční rekapitulace'!$L$1:$L$997),'Měsíční rekapitulace'!$L$1:$L$997)=D$4)*('Měsíční rekapitulace'!$A$3:$A$999=$A109)*TEXT('Měsíční rekapitulace'!$Q$3:$Q$999,\"0,0;0;0;\\0\")))","v":0},{"$f":"IF($A109=\"\",,SUMPRODUCT((LOOKUP(ROW(E$1:E$997),ROW(E$1:E$997)/ISNUMBER('Měsíční rekapitulace'!$L$1:$L$997),'Měsíční rekapitulace'!$L$1:$L$997)=E$4)*('Měsíční rekapitulace'!$A$3:$A$999=$A109)*TEXT('Měsíční rekapitulace'!$Q$3:$Q$999,\"0,0;0;0;\\0\")))","v":0},{"$f":"IF($A109=\"\",,SUMPRODUCT((LOOKUP(ROW(F$1:F$997),ROW(F$1:F$997)/ISNUMBER('Měsíční rekapitulace'!$L$1:$L$997),'Měsíční rekapitulace'!$L$1:$L$997)=F$4)*('Měsíční rekapitulace'!$A$3:$A$999=$A109)*TEXT('Měsíční rekapitulace'!$Q$3:$Q$999,\"0,0;0;0;\\0\")))","v":0},{"$f":"IF($A109=\"\",,SUMPRODUCT((LOOKUP(ROW(G$1:G$997),ROW(G$1:G$997)/ISNUMBER('Měsíční rekapitulace'!$L$1:$L$997),'Měsíční rekapitulace'!$L$1:$L$997)=G$4)*('Měsíční rekapitulace'!$A$3:$A$999=$A109)*TEXT('Měsíční rekapitulace'!$Q$3:$Q$999,\"0,0;0;0;\\0\")))","v":0},{"$f":"IF($A109=\"\",,SUMPRODUCT((LOOKUP(ROW(H$1:H$997),ROW(H$1:H$997)/ISNUMBER('Měsíční rekapitulace'!$L$1:$L$997),'Měsíční rekapitulace'!$L$1:$L$997)=H$4)*('Měsíční rekapitulace'!$A$3:$A$999=$A109)*TEXT('Měsíční rekapitulace'!$Q$3:$Q$999,\"0,0;0;0;\\0\")))","v":0},{"$f":"IF($A109=\"\",,SUMPRODUCT((LOOKUP(ROW(I$1:I$997),ROW(I$1:I$997)/ISNUMBER('Měsíční rekapitulace'!$L$1:$L$997),'Měsíční rekapitulace'!$L$1:$L$997)=I$4)*('Měsíční rekapitulace'!$A$3:$A$999=$A109)*TEXT('Měsíční rekapitulace'!$Q$3:$Q$999,\"0,0;0;0;\\0\")))","v":0},{"$f":"IF($A109=\"\",,SUMPRODUCT((LOOKUP(ROW(J$1:J$997),ROW(J$1:J$997)/ISNUMBER('Měsíční rekapitulace'!$L$1:$L$997),'Měsíční rekapitulace'!$L$1:$L$997)=J$4)*('Měsíční rekapitulace'!$A$3:$A$999=$A109)*TEXT('Měsíční rekapitulace'!$Q$3:$Q$999,\"0,0;0;0;\\0\")))","v":0},{"$f":"IF($A109=\"\",,SUMPRODUCT((LOOKUP(ROW(K$1:K$997),ROW(K$1:K$997)/ISNUMBER('Měsíční rekapitulace'!$L$1:$L$997),'Měsíční rekapitulace'!$L$1:$L$997)=K$4)*('Měsíční rekapitulace'!$A$3:$A$999=$A109)*TEXT('Měsíční rekapitulace'!$Q$3:$Q$999,\"0,0;0;0;\\0\")))","v":0},{"$f":"IF($A109=\"\",,SUMPRODUCT((LOOKUP(ROW(L$1:L$997),ROW(L$1:L$997)/ISNUMBER('Měsíční rekapitulace'!$L$1:$L$997),'Měsíční rekapitulace'!$L$1:$L$997)=L$4)*('Měsíční rekapitulace'!$A$3:$A$999=$A109)*TEXT('Měsíční rekapitulace'!$Q$3:$Q$999,\"0,0;0;0;\\0\")))","v":0},{"$f":"IF($A109=\"\",,SUMPRODUCT((LOOKUP(ROW(M$1:M$997),ROW(M$1:M$997)/ISNUMBER('Měsíční rekapitulace'!$L$1:$L$997),'Měsíční rekapitulace'!$L$1:$L$997)=M$4)*('Měsíční rekapitulace'!$A$3:$A$999=$A109)*TEXT('Měsíční rekapitulace'!$Q$3:$Q$999,\"0,0;0;0;\\0\")))","v":0},{"$f":"IF($A109=\"\",,SUMPRODUCT((LOOKUP(ROW(N$1:N$997),ROW(N$1:N$997)/ISNUMBER('Měsíční rekapitulace'!$L$1:$L$997),'Měsíční rekapitulace'!$L$1:$L$997)=N$4)*('Měsíční rekapitulace'!$A$3:$A$999=$A109)*TEXT('Měsíční rekapitulace'!$Q$3:$Q$999,\"0,0;0;0;\\0\")))","v":0},{"$f":"IF($A109=\"\",,SUMPRODUCT((LOOKUP(ROW(O$1:O$997),ROW(O$1:O$997)/ISNUMBER('Měsíční rekapitulace'!$L$1:$L$997),'Měsíční rekapitulace'!$L$1:$L$997)=O$4)*('Měsíční rekapitulace'!$A$3:$A$999=$A109)*TEXT('Měsíční rekapitulace'!$Q$3:$Q$999,\"0,0;0;0;\\0\")))","v":0},0]
[{"$f":"IFERROR(INDEX('Měsíční rekapitulace'!A$3:A$999,SMALL(IF(('Měsíční rekapitulace'!A$3:A$999<>\"\")*('Měsíční rekapitulace'!A$3:A$999<>'Měsíční rekapitulace'!$A$2)*(COUNTIF(A$5:A109,'Měsíční rekapitulace'!A$3:A$999)=0),ROW('Měsíční rekapitulace'!A$3:A$999)-2),1)),\"\")","v":""},{"$f":"IFERROR(INDEX('Měsíční rekapitulace'!E$3:E$999,MATCH(A110,'Měsíční rekapitulace'!A$3:A$999,)),\"\")","v":""},null,{"$f":"IF($A110=\"\",,SUMPRODUCT((LOOKUP(ROW(D$1:D$997),ROW(D$1:D$997)/ISNUMBER('Měsíční rekapitulace'!$L$1:$L$997),'Měsíční rekapitulace'!$L$1:$L$997)=D$4)*('Měsíční rekapitulace'!$A$3:$A$999=$A110)*TEXT('Měsíční rekapitulace'!$Q$3:$Q$999,\"0,0;0;0;\\0\")))","v":0},{"$f":"IF($A110=\"\",,SUMPRODUCT((LOOKUP(ROW(E$1:E$997),ROW(E$1:E$997)/ISNUMBER('Měsíční rekapitulace'!$L$1:$L$997),'Měsíční rekapitulace'!$L$1:$L$997)=E$4)*('Měsíční rekapitulace'!$A$3:$A$999=$A110)*TEXT('Měsíční rekapitulace'!$Q$3:$Q$999,\"0,0;0;0;\\0\")))","v":0},{"$f":"IF($A110=\"\",,SUMPRODUCT((LOOKUP(ROW(F$1:F$997),ROW(F$1:F$997)/ISNUMBER('Měsíční rekapitulace'!$L$1:$L$997),'Měsíční rekapitulace'!$L$1:$L$997)=F$4)*('Měsíční rekapitulace'!$A$3:$A$999=$A110)*TEXT('Měsíční rekapitulace'!$Q$3:$Q$999,\"0,0;0;0;\\0\")))","v":0},{"$f":"IF($A110=\"\",,SUMPRODUCT((LOOKUP(ROW(G$1:G$997),ROW(G$1:G$997)/ISNUMBER('Měsíční rekapitulace'!$L$1:$L$997),'Měsíční rekapitulace'!$L$1:$L$997)=G$4)*('Měsíční rekapitulace'!$A$3:$A$999=$A110)*TEXT('Měsíční rekapitulace'!$Q$3:$Q$999,\"0,0;0;0;\\0\")))","v":0},{"$f":"IF($A110=\"\",,SUMPRODUCT((LOOKUP(ROW(H$1:H$997),ROW(H$1:H$997)/ISNUMBER('Měsíční rekapitulace'!$L$1:$L$997),'Měsíční rekapitulace'!$L$1:$L$997)=H$4)*('Měsíční rekapitulace'!$A$3:$A$999=$A110)*TEXT('Měsíční rekapitulace'!$Q$3:$Q$999,\"0,0;0;0;\\0\")))","v":0},{"$f":"IF($A110=\"\",,SUMPRODUCT((LOOKUP(ROW(I$1:I$997),ROW(I$1:I$997)/ISNUMBER('Měsíční rekapitulace'!$L$1:$L$997),'Měsíční rekapitulace'!$L$1:$L$997)=I$4)*('Měsíční rekapitulace'!$A$3:$A$999=$A110)*TEXT('Měsíční rekapitulace'!$Q$3:$Q$999,\"0,0;0;0;\\0\")))","v":0},{"$f":"IF($A110=\"\",,SUMPRODUCT((LOOKUP(ROW(J$1:J$997),ROW(J$1:J$997)/ISNUMBER('Měsíční rekapitulace'!$L$1:$L$997),'Měsíční rekapitulace'!$L$1:$L$997)=J$4)*('Měsíční rekapitulace'!$A$3:$A$999=$A110)*TEXT('Měsíční rekapitulace'!$Q$3:$Q$999,\"0,0;0;0;\\0\")))","v":0},{"$f":"IF($A110=\"\",,SUMPRODUCT((LOOKUP(ROW(K$1:K$997),ROW(K$1:K$997)/ISNUMBER('Měsíční rekapitulace'!$L$1:$L$997),'Měsíční rekapitulace'!$L$1:$L$997)=K$4)*('Měsíční rekapitulace'!$A$3:$A$999=$A110)*TEXT('Měsíční rekapitulace'!$Q$3:$Q$999,\"0,0;0;0;\\0\")))","v":0},{"$f":"IF($A110=\"\",,SUMPRODUCT((LOOKUP(ROW(L$1:L$997),ROW(L$1:L$997)/ISNUMBER('Měsíční rekapitulace'!$L$1:$L$997),'Měsíční rekapitulace'!$L$1:$L$997)=L$4)*('Měsíční rekapitulace'!$A$3:$A$999=$A110)*TEXT('Měsíční rekapitulace'!$Q$3:$Q$999,\"0,0;0;0;\\0\")))","v":0},{"$f":"IF($A110=\"\",,SUMPRODUCT((LOOKUP(ROW(M$1:M$997),ROW(M$1:M$997)/ISNUMBER('Měsíční rekapitulace'!$L$1:$L$997),'Měsíční rekapitulace'!$L$1:$L$997)=M$4)*('Měsíční rekapitulace'!$A$3:$A$999=$A110)*TEXT('Měsíční rekapitulace'!$Q$3:$Q$999,\"0,0;0;0;\\0\")))","v":0},{"$f":"IF($A110=\"\",,SUMPRODUCT((LOOKUP(ROW(N$1:N$997),ROW(N$1:N$997)/ISNUMBER('Měsíční rekapitulace'!$L$1:$L$997),'Měsíční rekapitulace'!$L$1:$L$997)=N$4)*('Měsíční rekapitulace'!$A$3:$A$999=$A110)*TEXT('Měsíční rekapitulace'!$Q$3:$Q$999,\"0,0;0;0;\\0\")))","v":0},{"$f":"IF($A110=\"\",,SUMPRODUCT((LOOKUP(ROW(O$1:O$997),ROW(O$1:O$997)/ISNUMBER('Měsíční rekapitulace'!$L$1:$L$997),'Měsíční rekapitulace'!$L$1:$L$997)=O$4)*('Měsíční rekapitulace'!$A$3:$A$999=$A110)*TEXT('Měsíční rekapitulace'!$Q$3:$Q$999,\"0,0;0;0;\\0\")))","v":0},0]
[{"$f":"IFERROR(INDEX('Měsíční rekapitulace'!A$3:A$999,SMALL(IF(('Měsíční rekapitulace'!A$3:A$999<>\"\")*('Měsíční rekapitulace'!A$3:A$999<>'Měsíční rekapitulace'!$A$2)*(COUNTIF(A$5:A110,'Měsíční rekapitulace'!A$3:A$999)=0),ROW('Měsíční rekapitulace'!A$3:A$999)-2),1)),\"\")","v":""},{"$f":"IFERROR(INDEX('Měsíční rekapitulace'!E$3:E$999,MATCH(A111,'Měsíční rekapitulace'!A$3:A$999,)),\"\")","v":""},null,{"$f":"IF($A111=\"\",,SUMPRODUCT((LOOKUP(ROW(D$1:D$997),ROW(D$1:D$997)/ISNUMBER('Měsíční rekapitulace'!$L$1:$L$997),'Měsíční rekapitulace'!$L$1:$L$997)=D$4)*('Měsíční rekapitulace'!$A$3:$A$999=$A111)*TEXT('Měsíční rekapitulace'!$Q$3:$Q$999,\"0,0;0;0;\\0\")))","v":0},{"$f":"IF($A111=\"\",,SUMPRODUCT((LOOKUP(ROW(E$1:E$997),ROW(E$1:E$997)/ISNUMBER('Měsíční rekapitulace'!$L$1:$L$997),'Měsíční rekapitulace'!$L$1:$L$997)=E$4)*('Měsíční rekapitulace'!$A$3:$A$999=$A111)*TEXT('Měsíční rekapitulace'!$Q$3:$Q$999,\"0,0;0;0;\\0\")))","v":0},{"$f":"IF($A111=\"\",,SUMPRODUCT((LOOKUP(ROW(F$1:F$997),ROW(F$1:F$997)/ISNUMBER('Měsíční rekapitulace'!$L$1:$L$997),'Měsíční rekapitulace'!$L$1:$L$997)=F$4)*('Měsíční rekapitulace'!$A$3:$A$999=$A111)*TEXT('Měsíční rekapitulace'!$Q$3:$Q$999,\"0,0;0;0;\\0\")))","v":0},{"$f":"IF($A111=\"\",,SUMPRODUCT((LOOKUP(ROW(G$1:G$997),ROW(G$1:G$997)/ISNUMBER('Měsíční rekapitulace'!$L$1:$L$997),'Měsíční rekapitulace'!$L$1:$L$997)=G$4)*('Měsíční rekapitulace'!$A$3:$A$999=$A111)*TEXT('Měsíční rekapitulace'!$Q$3:$Q$999,\"0,0;0;0;\\0\")))","v":0},{"$f":"IF($A111=\"\",,SUMPRODUCT((LOOKUP(ROW(H$1:H$997),ROW(H$1:H$997)/ISNUMBER('Měsíční rekapitulace'!$L$1:$L$997),'Měsíční rekapitulace'!$L$1:$L$997)=H$4)*('Měsíční rekapitulace'!$A$3:$A$999=$A111)*TEXT('Měsíční rekapitulace'!$Q$3:$Q$999,\"0,0;0;0;\\0\")))","v":0},{"$f":"IF($A111=\"\",,SUMPRODUCT((LOOKUP(ROW(I$1:I$997),ROW(I$1:I$997)/ISNUMBER('Měsíční rekapitulace'!$L$1:$L$997),'Měsíční rekapitulace'!$L$1:$L$997)=I$4)*('Měsíční rekapitulace'!$A$3:$A$999=$A111)*TEXT('Měsíční rekapitulace'!$Q$3:$Q$999,\"0,0;0;0;\\0\")))","v":0},{"$f":"IF($A111=\"\",,SUMPRODUCT((LOOKUP(ROW(J$1:J$997),ROW(J$1:J$997)/ISNUMBER('Měsíční rekapitulace'!$L$1:$L$997),'Měsíční rekapitulace'!$L$1:$L$997)=J$4)*('Měsíční rekapitulace'!$A$3:$A$999=$A111)*TEXT('Měsíční rekapitulace'!$Q$3:$Q$999,\"0,0;0;0;\\0\")))","v":0},{"$f":"IF($A111=\"\",,SUMPRODUCT((LOOKUP(ROW(K$1:K$997),ROW(K$1:K$997)/ISNUMBER('Měsíční rekapitulace'!$L$1:$L$997),'Měsíční rekapitulace'!$L$1:$L$997)=K$4)*('Měsíční rekapitulace'!$A$3:$A$999=$A111)*TEXT('Měsíční rekapitulace'!$Q$3:$Q$999,\"0,0;0;0;\\0\")))","v":0},{"$f":"IF($A111=\"\",,SUMPRODUCT((LOOKUP(ROW(L$1:L$997),ROW(L$1:L$997)/ISNUMBER('Měsíční rekapitulace'!$L$1:$L$997),'Měsíční rekapitulace'!$L$1:$L$997)=L$4)*('Měsíční rekapitulace'!$A$3:$A$999=$A111)*TEXT('Měsíční rekapitulace'!$Q$3:$Q$999,\"0,0;0;0;\\0\")))","v":0},{"$f":"IF($A111=\"\",,SUMPRODUCT((LOOKUP(ROW(M$1:M$997),ROW(M$1:M$997)/ISNUMBER('Měsíční rekapitulace'!$L$1:$L$997),'Měsíční rekapitulace'!$L$1:$L$997)=M$4)*('Měsíční rekapitulace'!$A$3:$A$999=$A111)*TEXT('Měsíční rekapitulace'!$Q$3:$Q$999,\"0,0;0;0;\\0\")))","v":0},{"$f":"IF($A111=\"\",,SUMPRODUCT((LOOKUP(ROW(N$1:N$997),ROW(N$1:N$997)/ISNUMBER('Měsíční rekapitulace'!$L$1:$L$997),'Měsíční rekapitulace'!$L$1:$L$997)=N$4)*('Měsíční rekapitulace'!$A$3:$A$999=$A111)*TEXT('Měsíční rekapitulace'!$Q$3:$Q$999,\"0,0;0;0;\\0\")))","v":0},{"$f":"IF($A111=\"\",,SUMPRODUCT((LOOKUP(ROW(O$1:O$997),ROW(O$1:O$997)/ISNUMBER('Měsíční rekapitulace'!$L$1:$L$997),'Měsíční rekapitulace'!$L$1:$L$997)=O$4)*('Měsíční rekapitulace'!$A$3:$A$999=$A111)*TEXT('Měsíční rekapitulace'!$Q$3:$Q$999,\"0,0;0;0;\\0\")))","v":0},0]
[{"$f":"IFERROR(INDEX('Měsíční rekapitulace'!A$3:A$999,SMALL(IF(('Měsíční rekapitulace'!A$3:A$999<>\"\")*('Měsíční rekapitulace'!A$3:A$999<>'Měsíční rekapitulace'!$A$2)*(COUNTIF(A$5:A111,'Měsíční rekapitulace'!A$3:A$999)=0),ROW('Měsíční rekapitulace'!A$3:A$999)-2),1)),\"\")","v":""},{"$f":"IFERROR(INDEX('Měsíční rekapitulace'!E$3:E$999,MATCH(A112,'Měsíční rekapitulace'!A$3:A$999,)),\"\")","v":""},null,{"$f":"IF($A112=\"\",,SUMPRODUCT((LOOKUP(ROW(D$1:D$997),ROW(D$1:D$997)/ISNUMBER('Měsíční rekapitulace'!$L$1:$L$997),'Měsíční rekapitulace'!$L$1:$L$997)=D$4)*('Měsíční rekapitulace'!$A$3:$A$999=$A112)*TEXT('Měsíční rekapitulace'!$Q$3:$Q$999,\"0,0;0;0;\\0\")))","v":0},{"$f":"IF($A112=\"\",,SUMPRODUCT((LOOKUP(ROW(E$1:E$997),ROW(E$1:E$997)/ISNUMBER('Měsíční rekapitulace'!$L$1:$L$997),'Měsíční rekapitulace'!$L$1:$L$997)=E$4)*('Měsíční rekapitulace'!$A$3:$A$999=$A112)*TEXT('Měsíční rekapitulace'!$Q$3:$Q$999,\"0,0;0;0;\\0\")))","v":0},{"$f":"IF($A112=\"\",,SUMPRODUCT((LOOKUP(ROW(F$1:F$997),ROW(F$1:F$997)/ISNUMBER('Měsíční rekapitulace'!$L$1:$L$997),'Měsíční rekapitulace'!$L$1:$L$997)=F$4)*('Měsíční rekapitulace'!$A$3:$A$999=$A112)*TEXT('Měsíční rekapitulace'!$Q$3:$Q$999,\"0,0;0;0;\\0\")))","v":0},{"$f":"IF($A112=\"\",,SUMPRODUCT((LOOKUP(ROW(G$1:G$997),ROW(G$1:G$997)/ISNUMBER('Měsíční rekapitulace'!$L$1:$L$997),'Měsíční rekapitulace'!$L$1:$L$997)=G$4)*('Měsíční rekapitulace'!$A$3:$A$999=$A112)*TEXT('Měsíční rekapitulace'!$Q$3:$Q$999,\"0,0;0;0;\\0\")))","v":0},{"$f":"IF($A112=\"\",,SUMPRODUCT((LOOKUP(ROW(H$1:H$997),ROW(H$1:H$997)/ISNUMBER('Měsíční rekapitulace'!$L$1:$L$997),'Měsíční rekapitulace'!$L$1:$L$997)=H$4)*('Měsíční rekapitulace'!$A$3:$A$999=$A112)*TEXT('Měsíční rekapitulace'!$Q$3:$Q$999,\"0,0;0;0;\\0\")))","v":0},{"$f":"IF($A112=\"\",,SUMPRODUCT((LOOKUP(ROW(I$1:I$997),ROW(I$1:I$997)/ISNUMBER('Měsíční rekapitulace'!$L$1:$L$997),'Měsíční rekapitulace'!$L$1:$L$997)=I$4)*('Měsíční rekapitulace'!$A$3:$A$999=$A112)*TEXT('Měsíční rekapitulace'!$Q$3:$Q$999,\"0,0;0;0;\\0\")))","v":0},{"$f":"IF($A112=\"\",,SUMPRODUCT((LOOKUP(ROW(J$1:J$997),ROW(J$1:J$997)/ISNUMBER('Měsíční rekapitulace'!$L$1:$L$997),'Měsíční rekapitulace'!$L$1:$L$997)=J$4)*('Měsíční rekapitulace'!$A$3:$A$999=$A112)*TEXT('Měsíční rekapitulace'!$Q$3:$Q$999,\"0,0;0;0;\\0\")))","v":0},{"$f":"IF($A112=\"\",,SUMPRODUCT((LOOKUP(ROW(K$1:K$997),ROW(K$1:K$997)/ISNUMBER('Měsíční rekapitulace'!$L$1:$L$997),'Měsíční rekapitulace'!$L$1:$L$997)=K$4)*('Měsíční rekapitulace'!$A$3:$A$999=$A112)*TEXT('Měsíční rekapitulace'!$Q$3:$Q$999,\"0,0;0;0;\\0\")))","v":0},{"$f":"IF($A112=\"\",,SUMPRODUCT((LOOKUP(ROW(L$1:L$997),ROW(L$1:L$997)/ISNUMBER('Měsíční rekapitulace'!$L$1:$L$997),'Měsíční rekapitulace'!$L$1:$L$997)=L$4)*('Měsíční rekapitulace'!$A$3:$A$999=$A112)*TEXT('Měsíční rekapitulace'!$Q$3:$Q$999,\"0,0;0;0;\\0\")))","v":0},{"$f":"IF($A112=\"\",,SUMPRODUCT((LOOKUP(ROW(M$1:M$997),ROW(M$1:M$997)/ISNUMBER('Měsíční rekapitulace'!$L$1:$L$997),'Měsíční rekapitulace'!$L$1:$L$997)=M$4)*('Měsíční rekapitulace'!$A$3:$A$999=$A112)*TEXT('Měsíční rekapitulace'!$Q$3:$Q$999,\"0,0;0;0;\\0\")))","v":0},{"$f":"IF($A112=\"\",,SUMPRODUCT((LOOKUP(ROW(N$1:N$997),ROW(N$1:N$997)/ISNUMBER('Měsíční rekapitulace'!$L$1:$L$997),'Měsíční rekapitulace'!$L$1:$L$997)=N$4)*('Měsíční rekapitulace'!$A$3:$A$999=$A112)*TEXT('Měsíční rekapitulace'!$Q$3:$Q$999,\"0,0;0;0;\\0\")))","v":0},{"$f":"IF($A112=\"\",,SUMPRODUCT((LOOKUP(ROW(O$1:O$997),ROW(O$1:O$997)/ISNUMBER('Měsíční rekapitulace'!$L$1:$L$997),'Měsíční rekapitulace'!$L$1:$L$997)=O$4)*('Měsíční rekapitulace'!$A$3:$A$999=$A112)*TEXT('Měsíční rekapitulace'!$Q$3:$Q$999,\"0,0;0;0;\\0\")))","v":0},0]
[{"$f":"IFERROR(INDEX('Měsíční rekapitulace'!A$3:A$999,SMALL(IF(('Měsíční rekapitulace'!A$3:A$999<>\"\")*('Měsíční rekapitulace'!A$3:A$999<>'Měsíční rekapitulace'!$A$2)*(COUNTIF(A$5:A112,'Měsíční rekapitulace'!A$3:A$999)=0),ROW('Měsíční rekapitulace'!A$3:A$999)-2),1)),\"\")","v":""},{"$f":"IFERROR(INDEX('Měsíční rekapitulace'!E$3:E$999,MATCH(A113,'Měsíční rekapitulace'!A$3:A$999,)),\"\")","v":""},null,{"$f":"IF($A113=\"\",,SUMPRODUCT((LOOKUP(ROW(D$1:D$997),ROW(D$1:D$997)/ISNUMBER('Měsíční rekapitulace'!$L$1:$L$997),'Měsíční rekapitulace'!$L$1:$L$997)=D$4)*('Měsíční rekapitulace'!$A$3:$A$999=$A113)*TEXT('Měsíční rekapitulace'!$Q$3:$Q$999,\"0,0;0;0;\\0\")))","v":0},{"$f":"IF($A113=\"\",,SUMPRODUCT((LOOKUP(ROW(E$1:E$997),ROW(E$1:E$997)/ISNUMBER('Měsíční rekapitulace'!$L$1:$L$997),'Měsíční rekapitulace'!$L$1:$L$997)=E$4)*('Měsíční rekapitulace'!$A$3:$A$999=$A113)*TEXT('Měsíční rekapitulace'!$Q$3:$Q$999,\"0,0;0;0;\\0\")))","v":0},{"$f":"IF($A113=\"\",,SUMPRODUCT((LOOKUP(ROW(F$1:F$997),ROW(F$1:F$997)/ISNUMBER('Měsíční rekapitulace'!$L$1:$L$997),'Měsíční rekapitulace'!$L$1:$L$997)=F$4)*('Měsíční rekapitulace'!$A$3:$A$999=$A113)*TEXT('Měsíční rekapitulace'!$Q$3:$Q$999,\"0,0;0;0;\\0\")))","v":0},{"$f":"IF($A113=\"\",,SUMPRODUCT((LOOKUP(ROW(G$1:G$997),ROW(G$1:G$997)/ISNUMBER('Měsíční rekapitulace'!$L$1:$L$997),'Měsíční rekapitulace'!$L$1:$L$997)=G$4)*('Měsíční rekapitulace'!$A$3:$A$999=$A113)*TEXT('Měsíční rekapitulace'!$Q$3:$Q$999,\"0,0;0;0;\\0\")))","v":0},{"$f":"IF($A113=\"\",,SUMPRODUCT((LOOKUP(ROW(H$1:H$997),ROW(H$1:H$997)/ISNUMBER('Měsíční rekapitulace'!$L$1:$L$997),'Měsíční rekapitulace'!$L$1:$L$997)=H$4)*('Měsíční rekapitulace'!$A$3:$A$999=$A113)*TEXT('Měsíční rekapitulace'!$Q$3:$Q$999,\"0,0;0;0;\\0\")))","v":0},{"$f":"IF($A113=\"\",,SUMPRODUCT((LOOKUP(ROW(I$1:I$997),ROW(I$1:I$997)/ISNUMBER('Měsíční rekapitulace'!$L$1:$L$997),'Měsíční rekapitulace'!$L$1:$L$997)=I$4)*('Měsíční rekapitulace'!$A$3:$A$999=$A113)*TEXT('Měsíční rekapitulace'!$Q$3:$Q$999,\"0,0;0;0;\\0\")))","v":0},{"$f":"IF($A113=\"\",,SUMPRODUCT((LOOKUP(ROW(J$1:J$997),ROW(J$1:J$997)/ISNUMBER('Měsíční rekapitulace'!$L$1:$L$997),'Měsíční rekapitulace'!$L$1:$L$997)=J$4)*('Měsíční rekapitulace'!$A$3:$A$999=$A113)*TEXT('Měsíční rekapitulace'!$Q$3:$Q$999,\"0,0;0;0;\\0\")))","v":0},{"$f":"IF($A113=\"\",,SUMPRODUCT((LOOKUP(ROW(K$1:K$997),ROW(K$1:K$997)/ISNUMBER('Měsíční rekapitulace'!$L$1:$L$997),'Měsíční rekapitulace'!$L$1:$L$997)=K$4)*('Měsíční rekapitulace'!$A$3:$A$999=$A113)*TEXT('Měsíční rekapitulace'!$Q$3:$Q$999,\"0,0;0;0;\\0\")))","v":0},{"$f":"IF($A113=\"\",,SUMPRODUCT((LOOKUP(ROW(L$1:L$997),ROW(L$1:L$997)/ISNUMBER('Měsíční rekapitulace'!$L$1:$L$997),'Měsíční rekapitulace'!$L$1:$L$997)=L$4)*('Měsíční rekapitulace'!$A$3:$A$999=$A113)*TEXT('Měsíční rekapitulace'!$Q$3:$Q$999,\"0,0;0;0;\\0\")))","v":0},{"$f":"IF($A113=\"\",,SUMPRODUCT((LOOKUP(ROW(M$1:M$997),ROW(M$1:M$997)/ISNUMBER('Měsíční rekapitulace'!$L$1:$L$997),'Měsíční rekapitulace'!$L$1:$L$997)=M$4)*('Měsíční rekapitulace'!$A$3:$A$999=$A113)*TEXT('Měsíční rekapitulace'!$Q$3:$Q$999,\"0,0;0;0;\\0\")))","v":0},{"$f":"IF($A113=\"\",,SUMPRODUCT((LOOKUP(ROW(N$1:N$997),ROW(N$1:N$997)/ISNUMBER('Měsíční rekapitulace'!$L$1:$L$997),'Měsíční rekapitulace'!$L$1:$L$997)=N$4)*('Měsíční rekapitulace'!$A$3:$A$999=$A113)*TEXT('Měsíční rekapitulace'!$Q$3:$Q$999,\"0,0;0;0;\\0\")))","v":0},{"$f":"IF($A113=\"\",,SUMPRODUCT((LOOKUP(ROW(O$1:O$997),ROW(O$1:O$997)/ISNUMBER('Měsíční rekapitulace'!$L$1:$L$997),'Měsíční rekapitulace'!$L$1:$L$997)=O$4)*('Měsíční rekapitulace'!$A$3:$A$999=$A113)*TEXT('Měsíční rekapitulace'!$Q$3:$Q$999,\"0,0;0;0;\\0\")))","v":0},0]
[{"$f":"IFERROR(INDEX('Měsíční rekapitulace'!A$3:A$999,SMALL(IF(('Měsíční rekapitulace'!A$3:A$999<>\"\")*('Měsíční rekapitulace'!A$3:A$999<>'Měsíční rekapitulace'!$A$2)*(COUNTIF(A$5:A113,'Měsíční rekapitulace'!A$3:A$999)=0),ROW('Měsíční rekapitulace'!A$3:A$999)-2),1)),\"\")","v":""},{"$f":"IFERROR(INDEX('Měsíční rekapitulace'!E$3:E$999,MATCH(A114,'Měsíční rekapitulace'!A$3:A$999,)),\"\")","v":""},null,{"$f":"IF($A114=\"\",,SUMPRODUCT((LOOKUP(ROW(D$1:D$997),ROW(D$1:D$997)/ISNUMBER('Měsíční rekapitulace'!$L$1:$L$997),'Měsíční rekapitulace'!$L$1:$L$997)=D$4)*('Měsíční rekapitulace'!$A$3:$A$999=$A114)*TEXT('Měsíční rekapitulace'!$Q$3:$Q$999,\"0,0;0;0;\\0\")))","v":0},{"$f":"IF($A114=\"\",,SUMPRODUCT((LOOKUP(ROW(E$1:E$997),ROW(E$1:E$997)/ISNUMBER('Měsíční rekapitulace'!$L$1:$L$997),'Měsíční rekapitulace'!$L$1:$L$997)=E$4)*('Měsíční rekapitulace'!$A$3:$A$999=$A114)*TEXT('Měsíční rekapitulace'!$Q$3:$Q$999,\"0,0;0;0;\\0\")))","v":0},{"$f":"IF($A114=\"\",,SUMPRODUCT((LOOKUP(ROW(F$1:F$997),ROW(F$1:F$997)/ISNUMBER('Měsíční rekapitulace'!$L$1:$L$997),'Měsíční rekapitulace'!$L$1:$L$997)=F$4)*('Měsíční rekapitulace'!$A$3:$A$999=$A114)*TEXT('Měsíční rekapitulace'!$Q$3:$Q$999,\"0,0;0;0;\\0\")))","v":0},{"$f":"IF($A114=\"\",,SUMPRODUCT((LOOKUP(ROW(G$1:G$997),ROW(G$1:G$997)/ISNUMBER('Měsíční rekapitulace'!$L$1:$L$997),'Měsíční rekapitulace'!$L$1:$L$997)=G$4)*('Měsíční rekapitulace'!$A$3:$A$999=$A114)*TEXT('Měsíční rekapitulace'!$Q$3:$Q$999,\"0,0;0;0;\\0\")))","v":0},{"$f":"IF($A114=\"\",,SUMPRODUCT((LOOKUP(ROW(H$1:H$997),ROW(H$1:H$997)/ISNUMBER('Měsíční rekapitulace'!$L$1:$L$997),'Měsíční rekapitulace'!$L$1:$L$997)=H$4)*('Měsíční rekapitulace'!$A$3:$A$999=$A114)*TEXT('Měsíční rekapitulace'!$Q$3:$Q$999,\"0,0;0;0;\\0\")))","v":0},{"$f":"IF($A114=\"\",,SUMPRODUCT((LOOKUP(ROW(I$1:I$997),ROW(I$1:I$997)/ISNUMBER('Měsíční rekapitulace'!$L$1:$L$997),'Měsíční rekapitulace'!$L$1:$L$997)=I$4)*('Měsíční rekapitulace'!$A$3:$A$999=$A114)*TEXT('Měsíční rekapitulace'!$Q$3:$Q$999,\"0,0;0;0;\\0\")))","v":0},{"$f":"IF($A114=\"\",,SUMPRODUCT((LOOKUP(ROW(J$1:J$997),ROW(J$1:J$997)/ISNUMBER('Měsíční rekapitulace'!$L$1:$L$997),'Měsíční rekapitulace'!$L$1:$L$997)=J$4)*('Měsíční rekapitulace'!$A$3:$A$999=$A114)*TEXT('Měsíční rekapitulace'!$Q$3:$Q$999,\"0,0;0;0;\\0\")))","v":0},{"$f":"IF($A114=\"\",,SUMPRODUCT((LOOKUP(ROW(K$1:K$997),ROW(K$1:K$997)/ISNUMBER('Měsíční rekapitulace'!$L$1:$L$997),'Měsíční rekapitulace'!$L$1:$L$997)=K$4)*('Měsíční rekapitulace'!$A$3:$A$999=$A114)*TEXT('Měsíční rekapitulace'!$Q$3:$Q$999,\"0,0;0;0;\\0\")))","v":0},{"$f":"IF($A114=\"\",,SUMPRODUCT((LOOKUP(ROW(L$1:L$997),ROW(L$1:L$997)/ISNUMBER('Měsíční rekapitulace'!$L$1:$L$997),'Měsíční rekapitulace'!$L$1:$L$997)=L$4)*('Měsíční rekapitulace'!$A$3:$A$999=$A114)*TEXT('Měsíční rekapitulace'!$Q$3:$Q$999,\"0,0;0;0;\\0\")))","v":0},{"$f":"IF($A114=\"\",,SUMPRODUCT((LOOKUP(ROW(M$1:M$997),ROW(M$1:M$997)/ISNUMBER('Měsíční rekapitulace'!$L$1:$L$997),'Měsíční rekapitulace'!$L$1:$L$997)=M$4)*('Měsíční rekapitulace'!$A$3:$A$999=$A114)*TEXT('Měsíční rekapitulace'!$Q$3:$Q$999,\"0,0;0;0;\\0\")))","v":0},{"$f":"IF($A114=\"\",,SUMPRODUCT((LOOKUP(ROW(N$1:N$997),ROW(N$1:N$997)/ISNUMBER('Měsíční rekapitulace'!$L$1:$L$997),'Měsíční rekapitulace'!$L$1:$L$997)=N$4)*('Měsíční rekapitulace'!$A$3:$A$999=$A114)*TEXT('Měsíční rekapitulace'!$Q$3:$Q$999,\"0,0;0;0;\\0\")))","v":0},{"$f":"IF($A114=\"\",,SUMPRODUCT((LOOKUP(ROW(O$1:O$997),ROW(O$1:O$997)/ISNUMBER('Měsíční rekapitulace'!$L$1:$L$997),'Měsíční rekapitulace'!$L$1:$L$997)=O$4)*('Měsíční rekapitulace'!$A$3:$A$999=$A114)*TEXT('Měsíční rekapitulace'!$Q$3:$Q$999,\"0,0;0;0;\\0\")))","v":0},{"$f":"SUM(D114:O114)","v":0}]
[{"$f":"IFERROR(INDEX('Měsíční rekapitulace'!A$3:A$999,SMALL(IF(('Měsíční rekapitulace'!A$3:A$999<>\"\")*('Měsíční rekapitulace'!A$3:A$999<>'Měsíční rekapitulace'!$A$2)*(COUNTIF(A$5:A114,'Měsíční rekapitulace'!A$3:A$999)=0),ROW('Měsíční rekapitulace'!A$3:A$999)-2),1)),\"\")","v":""},{"$f":"IFERROR(INDEX('Měsíční rekapitulace'!E$3:E$999,MATCH(A115,'Měsíční rekapitulace'!A$3:A$999,)),\"\")","v":""},null,{"$f":"IF($A115=\"\",,SUMPRODUCT((LOOKUP(ROW(D$1:D$997),ROW(D$1:D$997)/ISNUMBER('Měsíční rekapitulace'!$L$1:$L$997),'Měsíční rekapitulace'!$L$1:$L$997)=D$4)*('Měsíční rekapitulace'!$A$3:$A$999=$A115)*TEXT('Měsíční rekapitulace'!$Q$3:$Q$999,\"0,0;0;0;\\0\")))","v":0},{"$f":"IF($A115=\"\",,SUMPRODUCT((LOOKUP(ROW(E$1:E$997),ROW(E$1:E$997)/ISNUMBER('Měsíční rekapitulace'!$L$1:$L$997),'Měsíční rekapitulace'!$L$1:$L$997)=E$4)*('Měsíční rekapitulace'!$A$3:$A$999=$A115)*TEXT('Měsíční rekapitulace'!$Q$3:$Q$999,\"0,0;0;0;\\0\")))","v":0},{"$f":"IF($A115=\"\",,SUMPRODUCT((LOOKUP(ROW(F$1:F$997),ROW(F$1:F$997)/ISNUMBER('Měsíční rekapitulace'!$L$1:$L$997),'Měsíční rekapitulace'!$L$1:$L$997)=F$4)*('Měsíční rekapitulace'!$A$3:$A$999=$A115)*TEXT('Měsíční rekapitulace'!$Q$3:$Q$999,\"0,0;0;0;\\0\")))","v":0},{"$f":"IF($A115=\"\",,SUMPRODUCT((LOOKUP(ROW(G$1:G$997),ROW(G$1:G$997)/ISNUMBER('Měsíční rekapitulace'!$L$1:$L$997),'Měsíční rekapitulace'!$L$1:$L$997)=G$4)*('Měsíční rekapitulace'!$A$3:$A$999=$A115)*TEXT('Měsíční rekapitulace'!$Q$3:$Q$999,\"0,0;0;0;\\0\")))","v":0},{"$f":"IF($A115=\"\",,SUMPRODUCT((LOOKUP(ROW(H$1:H$997),ROW(H$1:H$997)/ISNUMBER('Měsíční rekapitulace'!$L$1:$L$997),'Měsíční rekapitulace'!$L$1:$L$997)=H$4)*('Měsíční rekapitulace'!$A$3:$A$999=$A115)*TEXT('Měsíční rekapitulace'!$Q$3:$Q$999,\"0,0;0;0;\\0\")))","v":0},{"$f":"IF($A115=\"\",,SUMPRODUCT((LOOKUP(ROW(I$1:I$997),ROW(I$1:I$997)/ISNUMBER('Měsíční rekapitulace'!$L$1:$L$997),'Měsíční rekapitulace'!$L$1:$L$997)=I$4)*('Měsíční rekapitulace'!$A$3:$A$999=$A115)*TEXT('Měsíční rekapitulace'!$Q$3:$Q$999,\"0,0;0;0;\\0\")))","v":0},{"$f":"IF($A115=\"\",,SUMPRODUCT((LOOKUP(ROW(J$1:J$997),ROW(J$1:J$997)/ISNUMBER('Měsíční rekapitulace'!$L$1:$L$997),'Měsíční rekapitulace'!$L$1:$L$997)=J$4)*('Měsíční rekapitulace'!$A$3:$A$999=$A115)*TEXT('Měsíční rekapitulace'!$Q$3:$Q$999,\"0,0;0;0;\\0\")))","v":0},{"$f":"IF($A115=\"\",,SUMPRODUCT((LOOKUP(ROW(K$1:K$997),ROW(K$1:K$997)/ISNUMBER('Měsíční rekapitulace'!$L$1:$L$997),'Měsíční rekapitulace'!$L$1:$L$997)=K$4)*('Měsíční rekapitulace'!$A$3:$A$999=$A115)*TEXT('Měsíční rekapitulace'!$Q$3:$Q$999,\"0,0;0;0;\\0\")))","v":0},{"$f":"IF($A115=\"\",,SUMPRODUCT((LOOKUP(ROW(L$1:L$997),ROW(L$1:L$997)/ISNUMBER('Měsíční rekapitulace'!$L$1:$L$997),'Měsíční rekapitulace'!$L$1:$L$997)=L$4)*('Měsíční rekapitulace'!$A$3:$A$999=$A115)*TEXT('Měsíční rekapitulace'!$Q$3:$Q$999,\"0,0;0;0;\\0\")))","v":0},{"$f":"IF($A115=\"\",,SUMPRODUCT((LOOKUP(ROW(M$1:M$997),ROW(M$1:M$997)/ISNUMBER('Měsíční rekapitulace'!$L$1:$L$997),'Měsíční rekapitulace'!$L$1:$L$997)=M$4)*('Měsíční rekapitulace'!$A$3:$A$999=$A115)*TEXT('Měsíční rekapitulace'!$Q$3:$Q$999,\"0,0;0;0;\\0\")))","v":0},{"$f":"IF($A115=\"\",,SUMPRODUCT((LOOKUP(ROW(N$1:N$997),ROW(N$1:N$997)/ISNUMBER('Měsíční rekapitulace'!$L$1:$L$997),'Měsíční rekapitulace'!$L$1:$L$997)=N$4)*('Měsíční rekapitulace'!$A$3:$A$999=$A115)*TEXT('Měsíční rekapitulace'!$Q$3:$Q$999,\"0,0;0;0;\\0\")))","v":0},{"$f":"IF($A115=\"\",,SUMPRODUCT((LOOKUP(ROW(O$1:O$997),ROW(O$1:O$997)/ISNUMBER('Měsíční rekapitulace'!$L$1:$L$997),'Měsíční rekapitulace'!$L$1:$L$997)=O$4)*('Měsíční rekapitulace'!$A$3:$A$999=$A115)*TEXT('Měsíční rekapitulace'!$Q$3:$Q$999,\"0,0;0;0;\\0\")))","v":0},0]
[{"$f":"IFERROR(INDEX('Měsíční rekapitulace'!A$3:A$999,SMALL(IF(('Měsíční rekapitulace'!A$3:A$999<>\"\")*('Měsíční rekapitulace'!A$3:A$999<>'Měsíční rekapitulace'!$A$2)*(COUNTIF(A$5:A115,'Měsíční rekapitulace'!A$3:A$999)=0),ROW('Měsíční rekapitulace'!A$3:A$999)-2),1)),\"\")","v":""},{"$f":"IFERROR(INDEX('Měsíční rekapitulace'!E$3:E$999,MATCH(A116,'Měsíční rekapitulace'!A$3:A$999,)),\"\")","v":""},null,{"$f":"IF($A116=\"\",,SUMPRODUCT((LOOKUP(ROW(D$1:D$997),ROW(D$1:D$997)/ISNUMBER('Měsíční rekapitulace'!$L$1:$L$997),'Měsíční rekapitulace'!$L$1:$L$997)=D$4)*('Měsíční rekapitulace'!$A$3:$A$999=$A116)*TEXT('Měsíční rekapitulace'!$Q$3:$Q$999,\"0,0;0;0;\\0\")))","v":0},{"$f":"IF($A116=\"\",,SUMPRODUCT((LOOKUP(ROW(E$1:E$997),ROW(E$1:E$997)/ISNUMBER('Měsíční rekapitulace'!$L$1:$L$997),'Měsíční rekapitulace'!$L$1:$L$997)=E$4)*('Měsíční rekapitulace'!$A$3:$A$999=$A116)*TEXT('Měsíční rekapitulace'!$Q$3:$Q$999,\"0,0;0;0;\\0\")))","v":0},{"$f":"IF($A116=\"\",,SUMPRODUCT((LOOKUP(ROW(F$1:F$997),ROW(F$1:F$997)/ISNUMBER('Měsíční rekapitulace'!$L$1:$L$997),'Měsíční rekapitulace'!$L$1:$L$997)=F$4)*('Měsíční rekapitulace'!$A$3:$A$999=$A116)*TEXT('Měsíční rekapitulace'!$Q$3:$Q$999,\"0,0;0;0;\\0\")))","v":0},{"$f":"IF($A116=\"\",,SUMPRODUCT((LOOKUP(ROW(G$1:G$997),ROW(G$1:G$997)/ISNUMBER('Měsíční rekapitulace'!$L$1:$L$997),'Měsíční rekapitulace'!$L$1:$L$997)=G$4)*('Měsíční rekapitulace'!$A$3:$A$999=$A116)*TEXT('Měsíční rekapitulace'!$Q$3:$Q$999,\"0,0;0;0;\\0\")))","v":0},{"$f":"IF($A116=\"\",,SUMPRODUCT((LOOKUP(ROW(H$1:H$997),ROW(H$1:H$997)/ISNUMBER('Měsíční rekapitulace'!$L$1:$L$997),'Měsíční rekapitulace'!$L$1:$L$997)=H$4)*('Měsíční rekapitulace'!$A$3:$A$999=$A116)*TEXT('Měsíční rekapitulace'!$Q$3:$Q$999,\"0,0;0;0;\\0\")))","v":0},{"$f":"IF($A116=\"\",,SUMPRODUCT((LOOKUP(ROW(I$1:I$997),ROW(I$1:I$997)/ISNUMBER('Měsíční rekapitulace'!$L$1:$L$997),'Měsíční rekapitulace'!$L$1:$L$997)=I$4)*('Měsíční rekapitulace'!$A$3:$A$999=$A116)*TEXT('Měsíční rekapitulace'!$Q$3:$Q$999,\"0,0;0;0;\\0\")))","v":0},{"$f":"IF($A116=\"\",,SUMPRODUCT((LOOKUP(ROW(J$1:J$997),ROW(J$1:J$997)/ISNUMBER('Měsíční rekapitulace'!$L$1:$L$997),'Měsíční rekapitulace'!$L$1:$L$997)=J$4)*('Měsíční rekapitulace'!$A$3:$A$999=$A116)*TEXT('Měsíční rekapitulace'!$Q$3:$Q$999,\"0,0;0;0;\\0\")))","v":0},{"$f":"IF($A116=\"\",,SUMPRODUCT((LOOKUP(ROW(K$1:K$997),ROW(K$1:K$997)/ISNUMBER('Měsíční rekapitulace'!$L$1:$L$997),'Měsíční rekapitulace'!$L$1:$L$997)=K$4)*('Měsíční rekapitulace'!$A$3:$A$999=$A116)*TEXT('Měsíční rekapitulace'!$Q$3:$Q$999,\"0,0;0;0;\\0\")))","v":0},{"$f":"IF($A116=\"\",,SUMPRODUCT((LOOKUP(ROW(L$1:L$997),ROW(L$1:L$997)/ISNUMBER('Měsíční rekapitulace'!$L$1:$L$997),'Měsíční rekapitulace'!$L$1:$L$997)=L$4)*('Měsíční rekapitulace'!$A$3:$A$999=$A116)*TEXT('Měsíční rekapitulace'!$Q$3:$Q$999,\"0,0;0;0;\\0\")))","v":0},{"$f":"IF($A116=\"\",,SUMPRODUCT((LOOKUP(ROW(M$1:M$997),ROW(M$1:M$997)/ISNUMBER('Měsíční rekapitulace'!$L$1:$L$997),'Měsíční rekapitulace'!$L$1:$L$997)=M$4)*('Měsíční rekapitulace'!$A$3:$A$999=$A116)*TEXT('Měsíční rekapitulace'!$Q$3:$Q$999,\"0,0;0;0;\\0\")))","v":0},{"$f":"IF($A116=\"\",,SUMPRODUCT((LOOKUP(ROW(N$1:N$997),ROW(N$1:N$997)/ISNUMBER('Měsíční rekapitulace'!$L$1:$L$997),'Měsíční rekapitulace'!$L$1:$L$997)=N$4)*('Měsíční rekapitulace'!$A$3:$A$999=$A116)*TEXT('Měsíční rekapitulace'!$Q$3:$Q$999,\"0,0;0;0;\\0\")))","v":0},{"$f":"IF($A116=\"\",,SUMPRODUCT((LOOKUP(ROW(O$1:O$997),ROW(O$1:O$997)/ISNUMBER('Měsíční rekapitulace'!$L$1:$L$997),'Měsíční rekapitulace'!$L$1:$L$997)=O$4)*('Měsíční rekapitulace'!$A$3:$A$999=$A116)*TEXT('Měsíční rekapitulace'!$Q$3:$Q$999,\"0,0;0;0;\\0\")))","v":0},0]
[{"$f":"IFERROR(INDEX('Měsíční rekapitulace'!A$3:A$999,SMALL(IF(('Měsíční rekapitulace'!A$3:A$999<>\"\")*('Měsíční rekapitulace'!A$3:A$999<>'Měsíční rekapitulace'!$A$2)*(COUNTIF(A$5:A116,'Měsíční rekapitulace'!A$3:A$999)=0),ROW('Měsíční rekapitulace'!A$3:A$999)-2),1)),\"\")","v":""},{"$f":"IFERROR(INDEX('Měsíční rekapitulace'!E$3:E$999,MATCH(A117,'Měsíční rekapitulace'!A$3:A$999,)),\"\")","v":""},null,{"$f":"IF($A117=\"\",,SUMPRODUCT((LOOKUP(ROW(D$1:D$997),ROW(D$1:D$997)/ISNUMBER('Měsíční rekapitulace'!$L$1:$L$997),'Měsíční rekapitulace'!$L$1:$L$997)=D$4)*('Měsíční rekapitulace'!$A$3:$A$999=$A117)*TEXT('Měsíční rekapitulace'!$Q$3:$Q$999,\"0,0;0;0;\\0\")))","v":0},{"$f":"IF($A117=\"\",,SUMPRODUCT((LOOKUP(ROW(E$1:E$997),ROW(E$1:E$997)/ISNUMBER('Měsíční rekapitulace'!$L$1:$L$997),'Měsíční rekapitulace'!$L$1:$L$997)=E$4)*('Měsíční rekapitulace'!$A$3:$A$999=$A117)*TEXT('Měsíční rekapitulace'!$Q$3:$Q$999,\"0,0;0;0;\\0\")))","v":0},{"$f":"IF($A117=\"\",,SUMPRODUCT((LOOKUP(ROW(F$1:F$997),ROW(F$1:F$997)/ISNUMBER('Měsíční rekapitulace'!$L$1:$L$997),'Měsíční rekapitulace'!$L$1:$L$997)=F$4)*('Měsíční rekapitulace'!$A$3:$A$999=$A117)*TEXT('Měsíční rekapitulace'!$Q$3:$Q$999,\"0,0;0;0;\\0\")))","v":0},{"$f":"IF($A117=\"\",,SUMPRODUCT((LOOKUP(ROW(G$1:G$997),ROW(G$1:G$997)/ISNUMBER('Měsíční rekapitulace'!$L$1:$L$997),'Měsíční rekapitulace'!$L$1:$L$997)=G$4)*('Měsíční rekapitulace'!$A$3:$A$999=$A117)*TEXT('Měsíční rekapitulace'!$Q$3:$Q$999,\"0,0;0;0;\\0\")))","v":0},{"$f":"IF($A117=\"\",,SUMPRODUCT((LOOKUP(ROW(H$1:H$997),ROW(H$1:H$997)/ISNUMBER('Měsíční rekapitulace'!$L$1:$L$997),'Měsíční rekapitulace'!$L$1:$L$997)=H$4)*('Měsíční rekapitulace'!$A$3:$A$999=$A117)*TEXT('Měsíční rekapitulace'!$Q$3:$Q$999,\"0,0;0;0;\\0\")))","v":0},{"$f":"IF($A117=\"\",,SUMPRODUCT((LOOKUP(ROW(I$1:I$997),ROW(I$1:I$997)/ISNUMBER('Měsíční rekapitulace'!$L$1:$L$997),'Měsíční rekapitulace'!$L$1:$L$997)=I$4)*('Měsíční rekapitulace'!$A$3:$A$999=$A117)*TEXT('Měsíční rekapitulace'!$Q$3:$Q$999,\"0,0;0;0;\\0\")))","v":0},{"$f":"IF($A117=\"\",,SUMPRODUCT((LOOKUP(ROW(J$1:J$997),ROW(J$1:J$997)/ISNUMBER('Měsíční rekapitulace'!$L$1:$L$997),'Měsíční rekapitulace'!$L$1:$L$997)=J$4)*('Měsíční rekapitulace'!$A$3:$A$999=$A117)*TEXT('Měsíční rekapitulace'!$Q$3:$Q$999,\"0,0;0;0;\\0\")))","v":0},{"$f":"IF($A117=\"\",,SUMPRODUCT((LOOKUP(ROW(K$1:K$997),ROW(K$1:K$997)/ISNUMBER('Měsíční rekapitulace'!$L$1:$L$997),'Měsíční rekapitulace'!$L$1:$L$997)=K$4)*('Měsíční rekapitulace'!$A$3:$A$999=$A117)*TEXT('Měsíční rekapitulace'!$Q$3:$Q$999,\"0,0;0;0;\\0\")))","v":0},{"$f":"IF($A117=\"\",,SUMPRODUCT((LOOKUP(ROW(L$1:L$997),ROW(L$1:L$997)/ISNUMBER('Měsíční rekapitulace'!$L$1:$L$997),'Měsíční rekapitulace'!$L$1:$L$997)=L$4)*('Měsíční rekapitulace'!$A$3:$A$999=$A117)*TEXT('Měsíční rekapitulace'!$Q$3:$Q$999,\"0,0;0;0;\\0\")))","v":0},{"$f":"IF($A117=\"\",,SUMPRODUCT((LOOKUP(ROW(M$1:M$997),ROW(M$1:M$997)/ISNUMBER('Měsíční rekapitulace'!$L$1:$L$997),'Měsíční rekapitulace'!$L$1:$L$997)=M$4)*('Měsíční rekapitulace'!$A$3:$A$999=$A117)*TEXT('Měsíční rekapitulace'!$Q$3:$Q$999,\"0,0;0;0;\\0\")))","v":0},{"$f":"IF($A117=\"\",,SUMPRODUCT((LOOKUP(ROW(N$1:N$997),ROW(N$1:N$997)/ISNUMBER('Měsíční rekapitulace'!$L$1:$L$997),'Měsíční rekapitulace'!$L$1:$L$997)=N$4)*('Měsíční rekapitulace'!$A$3:$A$999=$A117)*TEXT('Měsíční rekapitulace'!$Q$3:$Q$999,\"0,0;0;0;\\0\")))","v":0},{"$f":"IF($A117=\"\",,SUMPRODUCT((LOOKUP(ROW(O$1:O$997),ROW(O$1:O$997)/ISNUMBER('Měsíční rekapitulace'!$L$1:$L$997),'Měsíční rekapitulace'!$L$1:$L$997)=O$4)*('Měsíční rekapitulace'!$A$3:$A$999=$A117)*TEXT('Měsíční rekapitulace'!$Q$3:$Q$999,\"0,0;0;0;\\0\")))","v":0},0]
[{"$f":"IFERROR(INDEX('Měsíční rekapitulace'!A$3:A$999,SMALL(IF(('Měsíční rekapitulace'!A$3:A$999<>\"\")*('Měsíční rekapitulace'!A$3:A$999<>'Měsíční rekapitulace'!$A$2)*(COUNTIF(A$5:A117,'Měsíční rekapitulace'!A$3:A$999)=0),ROW('Měsíční rekapitulace'!A$3:A$999)-2),1)),\"\")","v":""},{"$f":"IFERROR(INDEX('Měsíční rekapitulace'!E$3:E$999,MATCH(A118,'Měsíční rekapitulace'!A$3:A$999,)),\"\")","v":""},null,{"$f":"IF($A118=\"\",,SUMPRODUCT((LOOKUP(ROW(D$1:D$997),ROW(D$1:D$997)/ISNUMBER('Měsíční rekapitulace'!$L$1:$L$997),'Měsíční rekapitulace'!$L$1:$L$997)=D$4)*('Měsíční rekapitulace'!$A$3:$A$999=$A118)*TEXT('Měsíční rekapitulace'!$Q$3:$Q$999,\"0,0;0;0;\\0\")))","v":0},{"$f":"IF($A118=\"\",,SUMPRODUCT((LOOKUP(ROW(E$1:E$997),ROW(E$1:E$997)/ISNUMBER('Měsíční rekapitulace'!$L$1:$L$997),'Měsíční rekapitulace'!$L$1:$L$997)=E$4)*('Měsíční rekapitulace'!$A$3:$A$999=$A118)*TEXT('Měsíční rekapitulace'!$Q$3:$Q$999,\"0,0;0;0;\\0\")))","v":0},{"$f":"IF($A118=\"\",,SUMPRODUCT((LOOKUP(ROW(F$1:F$997),ROW(F$1:F$997)/ISNUMBER('Měsíční rekapitulace'!$L$1:$L$997),'Měsíční rekapitulace'!$L$1:$L$997)=F$4)*('Měsíční rekapitulace'!$A$3:$A$999=$A118)*TEXT('Měsíční rekapitulace'!$Q$3:$Q$999,\"0,0;0;0;\\0\")))","v":0},{"$f":"IF($A118=\"\",,SUMPRODUCT((LOOKUP(ROW(G$1:G$997),ROW(G$1:G$997)/ISNUMBER('Měsíční rekapitulace'!$L$1:$L$997),'Měsíční rekapitulace'!$L$1:$L$997)=G$4)*('Měsíční rekapitulace'!$A$3:$A$999=$A118)*TEXT('Měsíční rekapitulace'!$Q$3:$Q$999,\"0,0;0;0;\\0\")))","v":0},{"$f":"IF($A118=\"\",,SUMPRODUCT((LOOKUP(ROW(H$1:H$997),ROW(H$1:H$997)/ISNUMBER('Měsíční rekapitulace'!$L$1:$L$997),'Měsíční rekapitulace'!$L$1:$L$997)=H$4)*('Měsíční rekapitulace'!$A$3:$A$999=$A118)*TEXT('Měsíční rekapitulace'!$Q$3:$Q$999,\"0,0;0;0;\\0\")))","v":0},{"$f":"IF($A118=\"\",,SUMPRODUCT((LOOKUP(ROW(I$1:I$997),ROW(I$1:I$997)/ISNUMBER('Měsíční rekapitulace'!$L$1:$L$997),'Měsíční rekapitulace'!$L$1:$L$997)=I$4)*('Měsíční rekapitulace'!$A$3:$A$999=$A118)*TEXT('Měsíční rekapitulace'!$Q$3:$Q$999,\"0,0;0;0;\\0\")))","v":0},{"$f":"IF($A118=\"\",,SUMPRODUCT((LOOKUP(ROW(J$1:J$997),ROW(J$1:J$997)/ISNUMBER('Měsíční rekapitulace'!$L$1:$L$997),'Měsíční rekapitulace'!$L$1:$L$997)=J$4)*('Měsíční rekapitulace'!$A$3:$A$999=$A118)*TEXT('Měsíční rekapitulace'!$Q$3:$Q$999,\"0,0;0;0;\\0\")))","v":0},{"$f":"IF($A118=\"\",,SUMPRODUCT((LOOKUP(ROW(K$1:K$997),ROW(K$1:K$997)/ISNUMBER('Měsíční rekapitulace'!$L$1:$L$997),'Měsíční rekapitulace'!$L$1:$L$997)=K$4)*('Měsíční rekapitulace'!$A$3:$A$999=$A118)*TEXT('Měsíční rekapitulace'!$Q$3:$Q$999,\"0,0;0;0;\\0\")))","v":0},{"$f":"IF($A118=\"\",,SUMPRODUCT((LOOKUP(ROW(L$1:L$997),ROW(L$1:L$997)/ISNUMBER('Měsíční rekapitulace'!$L$1:$L$997),'Měsíční rekapitulace'!$L$1:$L$997)=L$4)*('Měsíční rekapitulace'!$A$3:$A$999=$A118)*TEXT('Měsíční rekapitulace'!$Q$3:$Q$999,\"0,0;0;0;\\0\")))","v":0},{"$f":"IF($A118=\"\",,SUMPRODUCT((LOOKUP(ROW(M$1:M$997),ROW(M$1:M$997)/ISNUMBER('Měsíční rekapitulace'!$L$1:$L$997),'Měsíční rekapitulace'!$L$1:$L$997)=M$4)*('Měsíční rekapitulace'!$A$3:$A$999=$A118)*TEXT('Měsíční rekapitulace'!$Q$3:$Q$999,\"0,0;0;0;\\0\")))","v":0},{"$f":"IF($A118=\"\",,SUMPRODUCT((LOOKUP(ROW(N$1:N$997),ROW(N$1:N$997)/ISNUMBER('Měsíční rekapitulace'!$L$1:$L$997),'Měsíční rekapitulace'!$L$1:$L$997)=N$4)*('Měsíční rekapitulace'!$A$3:$A$999=$A118)*TEXT('Měsíční rekapitulace'!$Q$3:$Q$999,\"0,0;0;0;\\0\")))","v":0},{"$f":"IF($A118=\"\",,SUMPRODUCT((LOOKUP(ROW(O$1:O$997),ROW(O$1:O$997)/ISNUMBER('Měsíční rekapitulace'!$L$1:$L$997),'Měsíční rekapitulace'!$L$1:$L$997)=O$4)*('Měsíční rekapitulace'!$A$3:$A$999=$A118)*TEXT('Měsíční rekapitulace'!$Q$3:$Q$999,\"0,0;0;0;\\0\")))","v":0},0]
[{"$f":"IFERROR(INDEX('Měsíční rekapitulace'!A$3:A$999,SMALL(IF(('Měsíční rekapitulace'!A$3:A$999<>\"\")*('Měsíční rekapitulace'!A$3:A$999<>'Měsíční rekapitulace'!$A$2)*(COUNTIF(A$5:A118,'Měsíční rekapitulace'!A$3:A$999)=0),ROW('Měsíční rekapitulace'!A$3:A$999)-2),1)),\"\")","v":""},{"$f":"IFERROR(INDEX('Měsíční rekapitulace'!E$3:E$999,MATCH(A119,'Měsíční rekapitulace'!A$3:A$999,)),\"\")","v":""},null,{"$f":"IF($A119=\"\",,SUMPRODUCT((LOOKUP(ROW(D$1:D$997),ROW(D$1:D$997)/ISNUMBER('Měsíční rekapitulace'!$L$1:$L$997),'Měsíční rekapitulace'!$L$1:$L$997)=D$4)*('Měsíční rekapitulace'!$A$3:$A$999=$A119)*TEXT('Měsíční rekapitulace'!$Q$3:$Q$999,\"0,0;0;0;\\0\")))","v":0},{"$f":"IF($A119=\"\",,SUMPRODUCT((LOOKUP(ROW(E$1:E$997),ROW(E$1:E$997)/ISNUMBER('Měsíční rekapitulace'!$L$1:$L$997),'Měsíční rekapitulace'!$L$1:$L$997)=E$4)*('Měsíční rekapitulace'!$A$3:$A$999=$A119)*TEXT('Měsíční rekapitulace'!$Q$3:$Q$999,\"0,0;0;0;\\0\")))","v":0},{"$f":"IF($A119=\"\",,SUMPRODUCT((LOOKUP(ROW(F$1:F$997),ROW(F$1:F$997)/ISNUMBER('Měsíční rekapitulace'!$L$1:$L$997),'Měsíční rekapitulace'!$L$1:$L$997)=F$4)*('Měsíční rekapitulace'!$A$3:$A$999=$A119)*TEXT('Měsíční rekapitulace'!$Q$3:$Q$999,\"0,0;0;0;\\0\")))","v":0},{"$f":"IF($A119=\"\",,SUMPRODUCT((LOOKUP(ROW(G$1:G$997),ROW(G$1:G$997)/ISNUMBER('Měsíční rekapitulace'!$L$1:$L$997),'Měsíční rekapitulace'!$L$1:$L$997)=G$4)*('Měsíční rekapitulace'!$A$3:$A$999=$A119)*TEXT('Měsíční rekapitulace'!$Q$3:$Q$999,\"0,0;0;0;\\0\")))","v":0},{"$f":"IF($A119=\"\",,SUMPRODUCT((LOOKUP(ROW(H$1:H$997),ROW(H$1:H$997)/ISNUMBER('Měsíční rekapitulace'!$L$1:$L$997),'Měsíční rekapitulace'!$L$1:$L$997)=H$4)*('Měsíční rekapitulace'!$A$3:$A$999=$A119)*TEXT('Měsíční rekapitulace'!$Q$3:$Q$999,\"0,0;0;0;\\0\")))","v":0},{"$f":"IF($A119=\"\",,SUMPRODUCT((LOOKUP(ROW(I$1:I$997),ROW(I$1:I$997)/ISNUMBER('Měsíční rekapitulace'!$L$1:$L$997),'Měsíční rekapitulace'!$L$1:$L$997)=I$4)*('Měsíční rekapitulace'!$A$3:$A$999=$A119)*TEXT('Měsíční rekapitulace'!$Q$3:$Q$999,\"0,0;0;0;\\0\")))","v":0},{"$f":"IF($A119=\"\",,SUMPRODUCT((LOOKUP(ROW(J$1:J$997),ROW(J$1:J$997)/ISNUMBER('Měsíční rekapitulace'!$L$1:$L$997),'Měsíční rekapitulace'!$L$1:$L$997)=J$4)*('Měsíční rekapitulace'!$A$3:$A$999=$A119)*TEXT('Měsíční rekapitulace'!$Q$3:$Q$999,\"0,0;0;0;\\0\")))","v":0},{"$f":"IF($A119=\"\",,SUMPRODUCT((LOOKUP(ROW(K$1:K$997),ROW(K$1:K$997)/ISNUMBER('Měsíční rekapitulace'!$L$1:$L$997),'Měsíční rekapitulace'!$L$1:$L$997)=K$4)*('Měsíční rekapitulace'!$A$3:$A$999=$A119)*TEXT('Měsíční rekapitulace'!$Q$3:$Q$999,\"0,0;0;0;\\0\")))","v":0},{"$f":"IF($A119=\"\",,SUMPRODUCT((LOOKUP(ROW(L$1:L$997),ROW(L$1:L$997)/ISNUMBER('Měsíční rekapitulace'!$L$1:$L$997),'Měsíční rekapitulace'!$L$1:$L$997)=L$4)*('Měsíční rekapitulace'!$A$3:$A$999=$A119)*TEXT('Měsíční rekapitulace'!$Q$3:$Q$999,\"0,0;0;0;\\0\")))","v":0},{"$f":"IF($A119=\"\",,SUMPRODUCT((LOOKUP(ROW(M$1:M$997),ROW(M$1:M$997)/ISNUMBER('Měsíční rekapitulace'!$L$1:$L$997),'Měsíční rekapitulace'!$L$1:$L$997)=M$4)*('Měsíční rekapitulace'!$A$3:$A$999=$A119)*TEXT('Měsíční rekapitulace'!$Q$3:$Q$999,\"0,0;0;0;\\0\")))","v":0},{"$f":"IF($A119=\"\",,SUMPRODUCT((LOOKUP(ROW(N$1:N$997),ROW(N$1:N$997)/ISNUMBER('Měsíční rekapitulace'!$L$1:$L$997),'Měsíční rekapitulace'!$L$1:$L$997)=N$4)*('Měsíční rekapitulace'!$A$3:$A$999=$A119)*TEXT('Měsíční rekapitulace'!$Q$3:$Q$999,\"0,0;0;0;\\0\")))","v":0},{"$f":"IF($A119=\"\",,SUMPRODUCT((LOOKUP(ROW(O$1:O$997),ROW(O$1:O$997)/ISNUMBER('Měsíční rekapitulace'!$L$1:$L$997),'Měsíční rekapitulace'!$L$1:$L$997)=O$4)*('Měsíční rekapitulace'!$A$3:$A$999=$A119)*TEXT('Měsíční rekapitulace'!$Q$3:$Q$999,\"0,0;0;0;\\0\")))","v":0},0]
[{"$f":"IFERROR(INDEX('Měsíční rekapitulace'!A$3:A$999,SMALL(IF(('Měsíční rekapitulace'!A$3:A$999<>\"\")*('Měsíční rekapitulace'!A$3:A$999<>'Měsíční rekapitulace'!$A$2)*(COUNTIF(A$5:A119,'Měsíční rekapitulace'!A$3:A$999)=0),ROW('Měsíční rekapitulace'!A$3:A$999)-2),1)),\"\")","v":""},{"$f":"IFERROR(INDEX('Měsíční rekapitulace'!E$3:E$999,MATCH(A120,'Měsíční rekapitulace'!A$3:A$999,)),\"\")","v":""},null,{"$f":"IF($A120=\"\",,SUMPRODUCT((LOOKUP(ROW(D$1:D$997),ROW(D$1:D$997)/ISNUMBER('Měsíční rekapitulace'!$L$1:$L$997),'Měsíční rekapitulace'!$L$1:$L$997)=D$4)*('Měsíční rekapitulace'!$A$3:$A$999=$A120)*TEXT('Měsíční rekapitulace'!$Q$3:$Q$999,\"0,0;0;0;\\0\")))","v":0},{"$f":"IF($A120=\"\",,SUMPRODUCT((LOOKUP(ROW(E$1:E$997),ROW(E$1:E$997)/ISNUMBER('Měsíční rekapitulace'!$L$1:$L$997),'Měsíční rekapitulace'!$L$1:$L$997)=E$4)*('Měsíční rekapitulace'!$A$3:$A$999=$A120)*TEXT('Měsíční rekapitulace'!$Q$3:$Q$999,\"0,0;0;0;\\0\")))","v":0},{"$f":"IF($A120=\"\",,SUMPRODUCT((LOOKUP(ROW(F$1:F$997),ROW(F$1:F$997)/ISNUMBER('Měsíční rekapitulace'!$L$1:$L$997),'Měsíční rekapitulace'!$L$1:$L$997)=F$4)*('Měsíční rekapitulace'!$A$3:$A$999=$A120)*TEXT('Měsíční rekapitulace'!$Q$3:$Q$999,\"0,0;0;0;\\0\")))","v":0},{"$f":"IF($A120=\"\",,SUMPRODUCT((LOOKUP(ROW(G$1:G$997),ROW(G$1:G$997)/ISNUMBER('Měsíční rekapitulace'!$L$1:$L$997),'Měsíční rekapitulace'!$L$1:$L$997)=G$4)*('Měsíční rekapitulace'!$A$3:$A$999=$A120)*TEXT('Měsíční rekapitulace'!$Q$3:$Q$999,\"0,0;0;0;\\0\")))","v":0},{"$f":"IF($A120=\"\",,SUMPRODUCT((LOOKUP(ROW(H$1:H$997),ROW(H$1:H$997)/ISNUMBER('Měsíční rekapitulace'!$L$1:$L$997),'Měsíční rekapitulace'!$L$1:$L$997)=H$4)*('Měsíční rekapitulace'!$A$3:$A$999=$A120)*TEXT('Měsíční rekapitulace'!$Q$3:$Q$999,\"0,0;0;0;\\0\")))","v":0},{"$f":"IF($A120=\"\",,SUMPRODUCT((LOOKUP(ROW(I$1:I$997),ROW(I$1:I$997)/ISNUMBER('Měsíční rekapitulace'!$L$1:$L$997),'Měsíční rekapitulace'!$L$1:$L$997)=I$4)*('Měsíční rekapitulace'!$A$3:$A$999=$A120)*TEXT('Měsíční rekapitulace'!$Q$3:$Q$999,\"0,0;0;0;\\0\")))","v":0},{"$f":"IF($A120=\"\",,SUMPRODUCT((LOOKUP(ROW(J$1:J$997),ROW(J$1:J$997)/ISNUMBER('Měsíční rekapitulace'!$L$1:$L$997),'Měsíční rekapitulace'!$L$1:$L$997)=J$4)*('Měsíční rekapitulace'!$A$3:$A$999=$A120)*TEXT('Měsíční rekapitulace'!$Q$3:$Q$999,\"0,0;0;0;\\0\")))","v":0},{"$f":"IF($A120=\"\",,SUMPRODUCT((LOOKUP(ROW(K$1:K$997),ROW(K$1:K$997)/ISNUMBER('Měsíční rekapitulace'!$L$1:$L$997),'Měsíční rekapitulace'!$L$1:$L$997)=K$4)*('Měsíční rekapitulace'!$A$3:$A$999=$A120)*TEXT('Měsíční rekapitulace'!$Q$3:$Q$999,\"0,0;0;0;\\0\")))","v":0},{"$f":"IF($A120=\"\",,SUMPRODUCT((LOOKUP(ROW(L$1:L$997),ROW(L$1:L$997)/ISNUMBER('Měsíční rekapitulace'!$L$1:$L$997),'Měsíční rekapitulace'!$L$1:$L$997)=L$4)*('Měsíční rekapitulace'!$A$3:$A$999=$A120)*TEXT('Měsíční rekapitulace'!$Q$3:$Q$999,\"0,0;0;0;\\0\")))","v":0},{"$f":"IF($A120=\"\",,SUMPRODUCT((LOOKUP(ROW(M$1:M$997),ROW(M$1:M$997)/ISNUMBER('Měsíční rekapitulace'!$L$1:$L$997),'Měsíční rekapitulace'!$L$1:$L$997)=M$4)*('Měsíční rekapitulace'!$A$3:$A$999=$A120)*TEXT('Měsíční rekapitulace'!$Q$3:$Q$999,\"0,0;0;0;\\0\")))","v":0},{"$f":"IF($A120=\"\",,SUMPRODUCT((LOOKUP(ROW(N$1:N$997),ROW(N$1:N$997)/ISNUMBER('Měsíční rekapitulace'!$L$1:$L$997),'Měsíční rekapitulace'!$L$1:$L$997)=N$4)*('Měsíční rekapitulace'!$A$3:$A$999=$A120)*TEXT('Měsíční rekapitulace'!$Q$3:$Q$999,\"0,0;0;0;\\0\")))","v":0},{"$f":"IF($A120=\"\",,SUMPRODUCT((LOOKUP(ROW(O$1:O$997),ROW(O$1:O$997)/ISNUMBER('Měsíční rekapitulace'!$L$1:$L$997),'Měsíční rekapitulace'!$L$1:$L$997)=O$4)*('Měsíční rekapitulace'!$A$3:$A$999=$A120)*TEXT('Měsíční rekapitulace'!$Q$3:$Q$999,\"0,0;0;0;\\0\")))","v":0},0]
[{"$f":"IFERROR(INDEX('Měsíční rekapitulace'!A$3:A$999,SMALL(IF(('Měsíční rekapitulace'!A$3:A$999<>\"\")*('Měsíční rekapitulace'!A$3:A$999<>'Měsíční rekapitulace'!$A$2)*(COUNTIF(A$5:A120,'Měsíční rekapitulace'!A$3:A$999)=0),ROW('Měsíční rekapitulace'!A$3:A$999)-2),1)),\"\")","v":""},{"$f":"IFERROR(INDEX('Měsíční rekapitulace'!E$3:E$999,MATCH(A121,'Měsíční rekapitulace'!A$3:A$999,)),\"\")","v":""},null,{"$f":"IF($A121=\"\",,SUMPRODUCT((LOOKUP(ROW(D$1:D$997),ROW(D$1:D$997)/ISNUMBER('Měsíční rekapitulace'!$L$1:$L$997),'Měsíční rekapitulace'!$L$1:$L$997)=D$4)*('Měsíční rekapitulace'!$A$3:$A$999=$A121)*TEXT('Měsíční rekapitulace'!$Q$3:$Q$999,\"0,0;0;0;\\0\")))","v":0},{"$f":"IF($A121=\"\",,SUMPRODUCT((LOOKUP(ROW(E$1:E$997),ROW(E$1:E$997)/ISNUMBER('Měsíční rekapitulace'!$L$1:$L$997),'Měsíční rekapitulace'!$L$1:$L$997)=E$4)*('Měsíční rekapitulace'!$A$3:$A$999=$A121)*TEXT('Měsíční rekapitulace'!$Q$3:$Q$999,\"0,0;0;0;\\0\")))","v":0},{"$f":"IF($A121=\"\",,SUMPRODUCT((LOOKUP(ROW(F$1:F$997),ROW(F$1:F$997)/ISNUMBER('Měsíční rekapitulace'!$L$1:$L$997),'Měsíční rekapitulace'!$L$1:$L$997)=F$4)*('Měsíční rekapitulace'!$A$3:$A$999=$A121)*TEXT('Měsíční rekapitulace'!$Q$3:$Q$999,\"0,0;0;0;\\0\")))","v":0},{"$f":"IF($A121=\"\",,SUMPRODUCT((LOOKUP(ROW(G$1:G$997),ROW(G$1:G$997)/ISNUMBER('Měsíční rekapitulace'!$L$1:$L$997),'Měsíční rekapitulace'!$L$1:$L$997)=G$4)*('Měsíční rekapitulace'!$A$3:$A$999=$A121)*TEXT('Měsíční rekapitulace'!$Q$3:$Q$999,\"0,0;0;0;\\0\")))","v":0},{"$f":"IF($A121=\"\",,SUMPRODUCT((LOOKUP(ROW(H$1:H$997),ROW(H$1:H$997)/ISNUMBER('Měsíční rekapitulace'!$L$1:$L$997),'Měsíční rekapitulace'!$L$1:$L$997)=H$4)*('Měsíční rekapitulace'!$A$3:$A$999=$A121)*TEXT('Měsíční rekapitulace'!$Q$3:$Q$999,\"0,0;0;0;\\0\")))","v":0},{"$f":"IF($A121=\"\",,SUMPRODUCT((LOOKUP(ROW(I$1:I$997),ROW(I$1:I$997)/ISNUMBER('Měsíční rekapitulace'!$L$1:$L$997),'Měsíční rekapitulace'!$L$1:$L$997)=I$4)*('Měsíční rekapitulace'!$A$3:$A$999=$A121)*TEXT('Měsíční rekapitulace'!$Q$3:$Q$999,\"0,0;0;0;\\0\")))","v":0},{"$f":"IF($A121=\"\",,SUMPRODUCT((LOOKUP(ROW(J$1:J$997),ROW(J$1:J$997)/ISNUMBER('Měsíční rekapitulace'!$L$1:$L$997),'Měsíční rekapitulace'!$L$1:$L$997)=J$4)*('Měsíční rekapitulace'!$A$3:$A$999=$A121)*TEXT('Měsíční rekapitulace'!$Q$3:$Q$999,\"0,0;0;0;\\0\")))","v":0},{"$f":"IF($A121=\"\",,SUMPRODUCT((LOOKUP(ROW(K$1:K$997),ROW(K$1:K$997)/ISNUMBER('Měsíční rekapitulace'!$L$1:$L$997),'Měsíční rekapitulace'!$L$1:$L$997)=K$4)*('Měsíční rekapitulace'!$A$3:$A$999=$A121)*TEXT('Měsíční rekapitulace'!$Q$3:$Q$999,\"0,0;0;0;\\0\")))","v":0},{"$f":"IF($A121=\"\",,SUMPRODUCT((LOOKUP(ROW(L$1:L$997),ROW(L$1:L$997)/ISNUMBER('Měsíční rekapitulace'!$L$1:$L$997),'Měsíční rekapitulace'!$L$1:$L$997)=L$4)*('Měsíční rekapitulace'!$A$3:$A$999=$A121)*TEXT('Měsíční rekapitulace'!$Q$3:$Q$999,\"0,0;0;0;\\0\")))","v":0},{"$f":"IF($A121=\"\",,SUMPRODUCT((LOOKUP(ROW(M$1:M$997),ROW(M$1:M$997)/ISNUMBER('Měsíční rekapitulace'!$L$1:$L$997),'Měsíční rekapitulace'!$L$1:$L$997)=M$4)*('Měsíční rekapitulace'!$A$3:$A$999=$A121)*TEXT('Měsíční rekapitulace'!$Q$3:$Q$999,\"0,0;0;0;\\0\")))","v":0},{"$f":"IF($A121=\"\",,SUMPRODUCT((LOOKUP(ROW(N$1:N$997),ROW(N$1:N$997)/ISNUMBER('Měsíční rekapitulace'!$L$1:$L$997),'Měsíční rekapitulace'!$L$1:$L$997)=N$4)*('Měsíční rekapitulace'!$A$3:$A$999=$A121)*TEXT('Měsíční rekapitulace'!$Q$3:$Q$999,\"0,0;0;0;\\0\")))","v":0},{"$f":"IF($A121=\"\",,SUMPRODUCT((LOOKUP(ROW(O$1:O$997),ROW(O$1:O$997)/ISNUMBER('Měsíční rekapitulace'!$L$1:$L$997),'Měsíční rekapitulace'!$L$1:$L$997)=O$4)*('Měsíční rekapitulace'!$A$3:$A$999=$A121)*TEXT('Měsíční rekapitulace'!$Q$3:$Q$999,\"0,0;0;0;\\0\")))","v":0},0]
[{"$f":"IFERROR(INDEX('Měsíční rekapitulace'!A$3:A$999,SMALL(IF(('Měsíční rekapitulace'!A$3:A$999<>\"\")*('Měsíční rekapitulace'!A$3:A$999<>'Měsíční rekapitulace'!$A$2)*(COUNTIF(A$5:A121,'Měsíční rekapitulace'!A$3:A$999)=0),ROW('Měsíční rekapitulace'!A$3:A$999)-2),1)),\"\")","v":""},{"$f":"IFERROR(INDEX('Měsíční rekapitulace'!E$3:E$999,MATCH(A122,'Měsíční rekapitulace'!A$3:A$999,)),\"\")","v":""},null,{"$f":"IF($A122=\"\",,SUMPRODUCT((LOOKUP(ROW(D$1:D$997),ROW(D$1:D$997)/ISNUMBER('Měsíční rekapitulace'!$L$1:$L$997),'Měsíční rekapitulace'!$L$1:$L$997)=D$4)*('Měsíční rekapitulace'!$A$3:$A$999=$A122)*TEXT('Měsíční rekapitulace'!$Q$3:$Q$999,\"0,0;0;0;\\0\")))","v":0},{"$f":"IF($A122=\"\",,SUMPRODUCT((LOOKUP(ROW(E$1:E$997),ROW(E$1:E$997)/ISNUMBER('Měsíční rekapitulace'!$L$1:$L$997),'Měsíční rekapitulace'!$L$1:$L$997)=E$4)*('Měsíční rekapitulace'!$A$3:$A$999=$A122)*TEXT('Měsíční rekapitulace'!$Q$3:$Q$999,\"0,0;0;0;\\0\")))","v":0},{"$f":"IF($A122=\"\",,SUMPRODUCT((LOOKUP(ROW(F$1:F$997),ROW(F$1:F$997)/ISNUMBER('Měsíční rekapitulace'!$L$1:$L$997),'Měsíční rekapitulace'!$L$1:$L$997)=F$4)*('Měsíční rekapitulace'!$A$3:$A$999=$A122)*TEXT('Měsíční rekapitulace'!$Q$3:$Q$999,\"0,0;0;0;\\0\")))","v":0},{"$f":"IF($A122=\"\",,SUMPRODUCT((LOOKUP(ROW(G$1:G$997),ROW(G$1:G$997)/ISNUMBER('Měsíční rekapitulace'!$L$1:$L$997),'Měsíční rekapitulace'!$L$1:$L$997)=G$4)*('Měsíční rekapitulace'!$A$3:$A$999=$A122)*TEXT('Měsíční rekapitulace'!$Q$3:$Q$999,\"0,0;0;0;\\0\")))","v":0},{"$f":"IF($A122=\"\",,SUMPRODUCT((LOOKUP(ROW(H$1:H$997),ROW(H$1:H$997)/ISNUMBER('Měsíční rekapitulace'!$L$1:$L$997),'Měsíční rekapitulace'!$L$1:$L$997)=H$4)*('Měsíční rekapitulace'!$A$3:$A$999=$A122)*TEXT('Měsíční rekapitulace'!$Q$3:$Q$999,\"0,0;0;0;\\0\")))","v":0},{"$f":"IF($A122=\"\",,SUMPRODUCT((LOOKUP(ROW(I$1:I$997),ROW(I$1:I$997)/ISNUMBER('Měsíční rekapitulace'!$L$1:$L$997),'Měsíční rekapitulace'!$L$1:$L$997)=I$4)*('Měsíční rekapitulace'!$A$3:$A$999=$A122)*TEXT('Měsíční rekapitulace'!$Q$3:$Q$999,\"0,0;0;0;\\0\")))","v":0},{"$f":"IF($A122=\"\",,SUMPRODUCT((LOOKUP(ROW(J$1:J$997),ROW(J$1:J$997)/ISNUMBER('Měsíční rekapitulace'!$L$1:$L$997),'Měsíční rekapitulace'!$L$1:$L$997)=J$4)*('Měsíční rekapitulace'!$A$3:$A$999=$A122)*TEXT('Měsíční rekapitulace'!$Q$3:$Q$999,\"0,0;0;0;\\0\")))","v":0},{"$f":"IF($A122=\"\",,SUMPRODUCT((LOOKUP(ROW(K$1:K$997),ROW(K$1:K$997)/ISNUMBER('Měsíční rekapitulace'!$L$1:$L$997),'Měsíční rekapitulace'!$L$1:$L$997)=K$4)*('Měsíční rekapitulace'!$A$3:$A$999=$A122)*TEXT('Měsíční rekapitulace'!$Q$3:$Q$999,\"0,0;0;0;\\0\")))","v":0},{"$f":"IF($A122=\"\",,SUMPRODUCT((LOOKUP(ROW(L$1:L$997),ROW(L$1:L$997)/ISNUMBER('Měsíční rekapitulace'!$L$1:$L$997),'Měsíční rekapitulace'!$L$1:$L$997)=L$4)*('Měsíční rekapitulace'!$A$3:$A$999=$A122)*TEXT('Měsíční rekapitulace'!$Q$3:$Q$999,\"0,0;0;0;\\0\")))","v":0},{"$f":"IF($A122=\"\",,SUMPRODUCT((LOOKUP(ROW(M$1:M$997),ROW(M$1:M$997)/ISNUMBER('Měsíční rekapitulace'!$L$1:$L$997),'Měsíční rekapitulace'!$L$1:$L$997)=M$4)*('Měsíční rekapitulace'!$A$3:$A$999=$A122)*TEXT('Měsíční rekapitulace'!$Q$3:$Q$999,\"0,0;0;0;\\0\")))","v":0},{"$f":"IF($A122=\"\",,SUMPRODUCT((LOOKUP(ROW(N$1:N$997),ROW(N$1:N$997)/ISNUMBER('Měsíční rekapitulace'!$L$1:$L$997),'Měsíční rekapitulace'!$L$1:$L$997)=N$4)*('Měsíční rekapitulace'!$A$3:$A$999=$A122)*TEXT('Měsíční rekapitulace'!$Q$3:$Q$999,\"0,0;0;0;\\0\")))","v":0},{"$f":"IF($A122=\"\",,SUMPRODUCT((LOOKUP(ROW(O$1:O$997),ROW(O$1:O$997)/ISNUMBER('Měsíční rekapitulace'!$L$1:$L$997),'Měsíční rekapitulace'!$L$1:$L$997)=O$4)*('Měsíční rekapitulace'!$A$3:$A$999=$A122)*TEXT('Měsíční rekapitulace'!$Q$3:$Q$999,\"0,0;0;0;\\0\")))","v":0},0]
[{"$f":"IFERROR(INDEX('Měsíční rekapitulace'!A$3:A$999,SMALL(IF(('Měsíční rekapitulace'!A$3:A$999<>\"\")*('Měsíční rekapitulace'!A$3:A$999<>'Měsíční rekapitulace'!$A$2)*(COUNTIF(A$5:A122,'Měsíční rekapitulace'!A$3:A$999)=0),ROW('Měsíční rekapitulace'!A$3:A$999)-2),1)),\"\")","v":""},{"$f":"IFERROR(INDEX('Měsíční rekapitulace'!E$3:E$999,MATCH(A123,'Měsíční rekapitulace'!A$3:A$999,)),\"\")","v":""},null,{"$f":"IF($A123=\"\",,SUMPRODUCT((LOOKUP(ROW(D$1:D$997),ROW(D$1:D$997)/ISNUMBER('Měsíční rekapitulace'!$L$1:$L$997),'Měsíční rekapitulace'!$L$1:$L$997)=D$4)*('Měsíční rekapitulace'!$A$3:$A$999=$A123)*TEXT('Měsíční rekapitulace'!$Q$3:$Q$999,\"0,0;0;0;\\0\")))","v":0},{"$f":"IF($A123=\"\",,SUMPRODUCT((LOOKUP(ROW(E$1:E$997),ROW(E$1:E$997)/ISNUMBER('Měsíční rekapitulace'!$L$1:$L$997),'Měsíční rekapitulace'!$L$1:$L$997)=E$4)*('Měsíční rekapitulace'!$A$3:$A$999=$A123)*TEXT('Měsíční rekapitulace'!$Q$3:$Q$999,\"0,0;0;0;\\0\")))","v":0},{"$f":"IF($A123=\"\",,SUMPRODUCT((LOOKUP(ROW(F$1:F$997),ROW(F$1:F$997)/ISNUMBER('Měsíční rekapitulace'!$L$1:$L$997),'Měsíční rekapitulace'!$L$1:$L$997)=F$4)*('Měsíční rekapitulace'!$A$3:$A$999=$A123)*TEXT('Měsíční rekapitulace'!$Q$3:$Q$999,\"0,0;0;0;\\0\")))","v":0},{"$f":"IF($A123=\"\",,SUMPRODUCT((LOOKUP(ROW(G$1:G$997),ROW(G$1:G$997)/ISNUMBER('Měsíční rekapitulace'!$L$1:$L$997),'Měsíční rekapitulace'!$L$1:$L$997)=G$4)*('Měsíční rekapitulace'!$A$3:$A$999=$A123)*TEXT('Měsíční rekapitulace'!$Q$3:$Q$999,\"0,0;0;0;\\0\")))","v":0},{"$f":"IF($A123=\"\",,SUMPRODUCT((LOOKUP(ROW(H$1:H$997),ROW(H$1:H$997)/ISNUMBER('Měsíční rekapitulace'!$L$1:$L$997),'Měsíční rekapitulace'!$L$1:$L$997)=H$4)*('Měsíční rekapitulace'!$A$3:$A$999=$A123)*TEXT('Měsíční rekapitulace'!$Q$3:$Q$999,\"0,0;0;0;\\0\")))","v":0},{"$f":"IF($A123=\"\",,SUMPRODUCT((LOOKUP(ROW(I$1:I$997),ROW(I$1:I$997)/ISNUMBER('Měsíční rekapitulace'!$L$1:$L$997),'Měsíční rekapitulace'!$L$1:$L$997)=I$4)*('Měsíční rekapitulace'!$A$3:$A$999=$A123)*TEXT('Měsíční rekapitulace'!$Q$3:$Q$999,\"0,0;0;0;\\0\")))","v":0},{"$f":"IF($A123=\"\",,SUMPRODUCT((LOOKUP(ROW(J$1:J$997),ROW(J$1:J$997)/ISNUMBER('Měsíční rekapitulace'!$L$1:$L$997),'Měsíční rekapitulace'!$L$1:$L$997)=J$4)*('Měsíční rekapitulace'!$A$3:$A$999=$A123)*TEXT('Měsíční rekapitulace'!$Q$3:$Q$999,\"0,0;0;0;\\0\")))","v":0},{"$f":"IF($A123=\"\",,SUMPRODUCT((LOOKUP(ROW(K$1:K$997),ROW(K$1:K$997)/ISNUMBER('Měsíční rekapitulace'!$L$1:$L$997),'Měsíční rekapitulace'!$L$1:$L$997)=K$4)*('Měsíční rekapitulace'!$A$3:$A$999=$A123)*TEXT('Měsíční rekapitulace'!$Q$3:$Q$999,\"0,0;0;0;\\0\")))","v":0},{"$f":"IF($A123=\"\",,SUMPRODUCT((LOOKUP(ROW(L$1:L$997),ROW(L$1:L$997)/ISNUMBER('Měsíční rekapitulace'!$L$1:$L$997),'Měsíční rekapitulace'!$L$1:$L$997)=L$4)*('Měsíční rekapitulace'!$A$3:$A$999=$A123)*TEXT('Měsíční rekapitulace'!$Q$3:$Q$999,\"0,0;0;0;\\0\")))","v":0},{"$f":"IF($A123=\"\",,SUMPRODUCT((LOOKUP(ROW(M$1:M$997),ROW(M$1:M$997)/ISNUMBER('Měsíční rekapitulace'!$L$1:$L$997),'Měsíční rekapitulace'!$L$1:$L$997)=M$4)*('Měsíční rekapitulace'!$A$3:$A$999=$A123)*TEXT('Měsíční rekapitulace'!$Q$3:$Q$999,\"0,0;0;0;\\0\")))","v":0},{"$f":"IF($A123=\"\",,SUMPRODUCT((LOOKUP(ROW(N$1:N$997),ROW(N$1:N$997)/ISNUMBER('Měsíční rekapitulace'!$L$1:$L$997),'Měsíční rekapitulace'!$L$1:$L$997)=N$4)*('Měsíční rekapitulace'!$A$3:$A$999=$A123)*TEXT('Měsíční rekapitulace'!$Q$3:$Q$999,\"0,0;0;0;\\0\")))","v":0},{"$f":"IF($A123=\"\",,SUMPRODUCT((LOOKUP(ROW(O$1:O$997),ROW(O$1:O$997)/ISNUMBER('Měsíční rekapitulace'!$L$1:$L$997),'Měsíční rekapitulace'!$L$1:$L$997)=O$4)*('Měsíční rekapitulace'!$A$3:$A$999=$A123)*TEXT('Měsíční rekapitulace'!$Q$3:$Q$999,\"0,0;0;0;\\0\")))","v":0},0]
[{"$f":"IFERROR(INDEX('Měsíční rekapitulace'!A$3:A$999,SMALL(IF(('Měsíční rekapitulace'!A$3:A$999<>\"\")*('Měsíční rekapitulace'!A$3:A$999<>'Měsíční rekapitulace'!$A$2)*(COUNTIF(A$5:A123,'Měsíční rekapitulace'!A$3:A$999)=0),ROW('Měsíční rekapitulace'!A$3:A$999)-2),1)),\"\")","v":""},{"$f":"IFERROR(INDEX('Měsíční rekapitulace'!E$3:E$999,MATCH(A124,'Měsíční rekapitulace'!A$3:A$999,)),\"\")","v":""},null,{"$f":"IF($A124=\"\",,SUMPRODUCT((LOOKUP(ROW(D$1:D$997),ROW(D$1:D$997)/ISNUMBER('Měsíční rekapitulace'!$L$1:$L$997),'Měsíční rekapitulace'!$L$1:$L$997)=D$4)*('Měsíční rekapitulace'!$A$3:$A$999=$A124)*TEXT('Měsíční rekapitulace'!$Q$3:$Q$999,\"0,0;0;0;\\0\")))","v":0},{"$f":"IF($A124=\"\",,SUMPRODUCT((LOOKUP(ROW(E$1:E$997),ROW(E$1:E$997)/ISNUMBER('Měsíční rekapitulace'!$L$1:$L$997),'Měsíční rekapitulace'!$L$1:$L$997)=E$4)*('Měsíční rekapitulace'!$A$3:$A$999=$A124)*TEXT('Měsíční rekapitulace'!$Q$3:$Q$999,\"0,0;0;0;\\0\")))","v":0},{"$f":"IF($A124=\"\",,SUMPRODUCT((LOOKUP(ROW(F$1:F$997),ROW(F$1:F$997)/ISNUMBER('Měsíční rekapitulace'!$L$1:$L$997),'Měsíční rekapitulace'!$L$1:$L$997)=F$4)*('Měsíční rekapitulace'!$A$3:$A$999=$A124)*TEXT('Měsíční rekapitulace'!$Q$3:$Q$999,\"0,0;0;0;\\0\")))","v":0},{"$f":"IF($A124=\"\",,SUMPRODUCT((LOOKUP(ROW(G$1:G$997),ROW(G$1:G$997)/ISNUMBER('Měsíční rekapitulace'!$L$1:$L$997),'Měsíční rekapitulace'!$L$1:$L$997)=G$4)*('Měsíční rekapitulace'!$A$3:$A$999=$A124)*TEXT('Měsíční rekapitulace'!$Q$3:$Q$999,\"0,0;0;0;\\0\")))","v":0},{"$f":"IF($A124=\"\",,SUMPRODUCT((LOOKUP(ROW(H$1:H$997),ROW(H$1:H$997)/ISNUMBER('Měsíční rekapitulace'!$L$1:$L$997),'Měsíční rekapitulace'!$L$1:$L$997)=H$4)*('Měsíční rekapitulace'!$A$3:$A$999=$A124)*TEXT('Měsíční rekapitulace'!$Q$3:$Q$999,\"0,0;0;0;\\0\")))","v":0},{"$f":"IF($A124=\"\",,SUMPRODUCT((LOOKUP(ROW(I$1:I$997),ROW(I$1:I$997)/ISNUMBER('Měsíční rekapitulace'!$L$1:$L$997),'Měsíční rekapitulace'!$L$1:$L$997)=I$4)*('Měsíční rekapitulace'!$A$3:$A$999=$A124)*TEXT('Měsíční rekapitulace'!$Q$3:$Q$999,\"0,0;0;0;\\0\")))","v":0},{"$f":"IF($A124=\"\",,SUMPRODUCT((LOOKUP(ROW(J$1:J$997),ROW(J$1:J$997)/ISNUMBER('Měsíční rekapitulace'!$L$1:$L$997),'Měsíční rekapitulace'!$L$1:$L$997)=J$4)*('Měsíční rekapitulace'!$A$3:$A$999=$A124)*TEXT('Měsíční rekapitulace'!$Q$3:$Q$999,\"0,0;0;0;\\0\")))","v":0},{"$f":"IF($A124=\"\",,SUMPRODUCT((LOOKUP(ROW(K$1:K$997),ROW(K$1:K$997)/ISNUMBER('Měsíční rekapitulace'!$L$1:$L$997),'Měsíční rekapitulace'!$L$1:$L$997)=K$4)*('Měsíční rekapitulace'!$A$3:$A$999=$A124)*TEXT('Měsíční rekapitulace'!$Q$3:$Q$999,\"0,0;0;0;\\0\")))","v":0},{"$f":"IF($A124=\"\",,SUMPRODUCT((LOOKUP(ROW(L$1:L$997),ROW(L$1:L$997)/ISNUMBER('Měsíční rekapitulace'!$L$1:$L$997),'Měsíční rekapitulace'!$L$1:$L$997)=L$4)*('Měsíční rekapitulace'!$A$3:$A$999=$A124)*TEXT('Měsíční rekapitulace'!$Q$3:$Q$999,\"0,0;0;0;\\0\")))","v":0},{"$f":"IF($A124=\"\",,SUMPRODUCT((LOOKUP(ROW(M$1:M$997),ROW(M$1:M$997)/ISNUMBER('Měsíční rekapitulace'!$L$1:$L$997),'Měsíční rekapitulace'!$L$1:$L$997)=M$4)*('Měsíční rekapitulace'!$A$3:$A$999=$A124)*TEXT('Měsíční rekapitulace'!$Q$3:$Q$999,\"0,0;0;0;\\0\")))","v":0},{"$f":"IF($A124=\"\",,SUMPRODUCT((LOOKUP(ROW(N$1:N$997),ROW(N$1:N$997)/ISNUMBER('Měsíční rekapitulace'!$L$1:$L$997),'Měsíční rekapitulace'!$L$1:$L$997)=N$4)*('Měsíční rekapitulace'!$A$3:$A$999=$A124)*TEXT('Měsíční rekapitulace'!$Q$3:$Q$999,\"0,0;0;0;\\0\")))","v":0},{"$f":"IF($A124=\"\",,SUMPRODUCT((LOOKUP(ROW(O$1:O$997),ROW(O$1:O$997)/ISNUMBER('Měsíční rekapitulace'!$L$1:$L$997),'Měsíční rekapitulace'!$L$1:$L$997)=O$4)*('Měsíční rekapitulace'!$A$3:$A$999=$A124)*TEXT('Měsíční rekapitulace'!$Q$3:$Q$999,\"0,0;0;0;\\0\")))","v":0},0]
[{"$f":"IFERROR(INDEX('Měsíční rekapitulace'!A$3:A$999,SMALL(IF(('Měsíční rekapitulace'!A$3:A$999<>\"\")*('Měsíční rekapitulace'!A$3:A$999<>'Měsíční rekapitulace'!$A$2)*(COUNTIF(A$5:A124,'Měsíční rekapitulace'!A$3:A$999)=0),ROW('Měsíční rekapitulace'!A$3:A$999)-2),1)),\"\")","v":""},{"$f":"IFERROR(INDEX('Měsíční rekapitulace'!E$3:E$999,MATCH(A125,'Měsíční rekapitulace'!A$3:A$999,)),\"\")","v":""},null,{"$f":"IF($A125=\"\",,SUMPRODUCT((LOOKUP(ROW(D$1:D$997),ROW(D$1:D$997)/ISNUMBER('Měsíční rekapitulace'!$L$1:$L$997),'Měsíční rekapitulace'!$L$1:$L$997)=D$4)*('Měsíční rekapitulace'!$A$3:$A$999=$A125)*TEXT('Měsíční rekapitulace'!$Q$3:$Q$999,\"0,0;0;0;\\0\")))","v":0},{"$f":"IF($A125=\"\",,SUMPRODUCT((LOOKUP(ROW(E$1:E$997),ROW(E$1:E$997)/ISNUMBER('Měsíční rekapitulace'!$L$1:$L$997),'Měsíční rekapitulace'!$L$1:$L$997)=E$4)*('Měsíční rekapitulace'!$A$3:$A$999=$A125)*TEXT('Měsíční rekapitulace'!$Q$3:$Q$999,\"0,0;0;0;\\0\")))","v":0},{"$f":"IF($A125=\"\",,SUMPRODUCT((LOOKUP(ROW(F$1:F$997),ROW(F$1:F$997)/ISNUMBER('Měsíční rekapitulace'!$L$1:$L$997),'Měsíční rekapitulace'!$L$1:$L$997)=F$4)*('Měsíční rekapitulace'!$A$3:$A$999=$A125)*TEXT('Měsíční rekapitulace'!$Q$3:$Q$999,\"0,0;0;0;\\0\")))","v":0},{"$f":"IF($A125=\"\",,SUMPRODUCT((LOOKUP(ROW(G$1:G$997),ROW(G$1:G$997)/ISNUMBER('Měsíční rekapitulace'!$L$1:$L$997),'Měsíční rekapitulace'!$L$1:$L$997)=G$4)*('Měsíční rekapitulace'!$A$3:$A$999=$A125)*TEXT('Měsíční rekapitulace'!$Q$3:$Q$999,\"0,0;0;0;\\0\")))","v":0},{"$f":"IF($A125=\"\",,SUMPRODUCT((LOOKUP(ROW(H$1:H$997),ROW(H$1:H$997)/ISNUMBER('Měsíční rekapitulace'!$L$1:$L$997),'Měsíční rekapitulace'!$L$1:$L$997)=H$4)*('Měsíční rekapitulace'!$A$3:$A$999=$A125)*TEXT('Měsíční rekapitulace'!$Q$3:$Q$999,\"0,0;0;0;\\0\")))","v":0},{"$f":"IF($A125=\"\",,SUMPRODUCT((LOOKUP(ROW(I$1:I$997),ROW(I$1:I$997)/ISNUMBER('Měsíční rekapitulace'!$L$1:$L$997),'Měsíční rekapitulace'!$L$1:$L$997)=I$4)*('Měsíční rekapitulace'!$A$3:$A$999=$A125)*TEXT('Měsíční rekapitulace'!$Q$3:$Q$999,\"0,0;0;0;\\0\")))","v":0},{"$f":"IF($A125=\"\",,SUMPRODUCT((LOOKUP(ROW(J$1:J$997),ROW(J$1:J$997)/ISNUMBER('Měsíční rekapitulace'!$L$1:$L$997),'Měsíční rekapitulace'!$L$1:$L$997)=J$4)*('Měsíční rekapitulace'!$A$3:$A$999=$A125)*TEXT('Měsíční rekapitulace'!$Q$3:$Q$999,\"0,0;0;0;\\0\")))","v":0},{"$f":"IF($A125=\"\",,SUMPRODUCT((LOOKUP(ROW(K$1:K$997),ROW(K$1:K$997)/ISNUMBER('Měsíční rekapitulace'!$L$1:$L$997),'Měsíční rekapitulace'!$L$1:$L$997)=K$4)*('Měsíční rekapitulace'!$A$3:$A$999=$A125)*TEXT('Měsíční rekapitulace'!$Q$3:$Q$999,\"0,0;0;0;\\0\")))","v":0},{"$f":"IF($A125=\"\",,SUMPRODUCT((LOOKUP(ROW(L$1:L$997),ROW(L$1:L$997)/ISNUMBER('Měsíční rekapitulace'!$L$1:$L$997),'Měsíční rekapitulace'!$L$1:$L$997)=L$4)*('Měsíční rekapitulace'!$A$3:$A$999=$A125)*TEXT('Měsíční rekapitulace'!$Q$3:$Q$999,\"0,0;0;0;\\0\")))","v":0},{"$f":"IF($A125=\"\",,SUMPRODUCT((LOOKUP(ROW(M$1:M$997),ROW(M$1:M$997)/ISNUMBER('Měsíční rekapitulace'!$L$1:$L$997),'Měsíční rekapitulace'!$L$1:$L$997)=M$4)*('Měsíční rekapitulace'!$A$3:$A$999=$A125)*TEXT('Měsíční rekapitulace'!$Q$3:$Q$999,\"0,0;0;0;\\0\")))","v":0},{"$f":"IF($A125=\"\",,SUMPRODUCT((LOOKUP(ROW(N$1:N$997),ROW(N$1:N$997)/ISNUMBER('Měsíční rekapitulace'!$L$1:$L$997),'Měsíční rekapitulace'!$L$1:$L$997)=N$4)*('Měsíční rekapitulace'!$A$3:$A$999=$A125)*TEXT('Měsíční rekapitulace'!$Q$3:$Q$999,\"0,0;0;0;\\0\")))","v":0},{"$f":"IF($A125=\"\",,SUMPRODUCT((LOOKUP(ROW(O$1:O$997),ROW(O$1:O$997)/ISNUMBER('Měsíční rekapitulace'!$L$1:$L$997),'Měsíční rekapitulace'!$L$1:$L$997)=O$4)*('Měsíční rekapitulace'!$A$3:$A$999=$A125)*TEXT('Měsíční rekapitulace'!$Q$3:$Q$999,\"0,0;0;0;\\0\")))","v":0},0]
[{"$f":"IFERROR(INDEX('Měsíční rekapitulace'!A$3:A$999,SMALL(IF(('Měsíční rekapitulace'!A$3:A$999<>\"\")*('Měsíční rekapitulace'!A$3:A$999<>'Měsíční rekapitulace'!$A$2)*(COUNTIF(A$5:A125,'Měsíční rekapitulace'!A$3:A$999)=0),ROW('Měsíční rekapitulace'!A$3:A$999)-2),1)),\"\")","v":""},{"$f":"IFERROR(INDEX('Měsíční rekapitulace'!E$3:E$999,MATCH(A126,'Měsíční rekapitulace'!A$3:A$999,)),\"\")","v":""},null,{"$f":"IF($A126=\"\",,SUMPRODUCT((LOOKUP(ROW(D$1:D$997),ROW(D$1:D$997)/ISNUMBER('Měsíční rekapitulace'!$L$1:$L$997),'Měsíční rekapitulace'!$L$1:$L$997)=D$4)*('Měsíční rekapitulace'!$A$3:$A$999=$A126)*TEXT('Měsíční rekapitulace'!$Q$3:$Q$999,\"0,0;0;0;\\0\")))","v":0},{"$f":"IF($A126=\"\",,SUMPRODUCT((LOOKUP(ROW(E$1:E$997),ROW(E$1:E$997)/ISNUMBER('Měsíční rekapitulace'!$L$1:$L$997),'Měsíční rekapitulace'!$L$1:$L$997)=E$4)*('Měsíční rekapitulace'!$A$3:$A$999=$A126)*TEXT('Měsíční rekapitulace'!$Q$3:$Q$999,\"0,0;0;0;\\0\")))","v":0},{"$f":"IF($A126=\"\",,SUMPRODUCT((LOOKUP(ROW(F$1:F$997),ROW(F$1:F$997)/ISNUMBER('Měsíční rekapitulace'!$L$1:$L$997),'Měsíční rekapitulace'!$L$1:$L$997)=F$4)*('Měsíční rekapitulace'!$A$3:$A$999=$A126)*TEXT('Měsíční rekapitulace'!$Q$3:$Q$999,\"0,0;0;0;\\0\")))","v":0},{"$f":"IF($A126=\"\",,SUMPRODUCT((LOOKUP(ROW(G$1:G$997),ROW(G$1:G$997)/ISNUMBER('Měsíční rekapitulace'!$L$1:$L$997),'Měsíční rekapitulace'!$L$1:$L$997)=G$4)*('Měsíční rekapitulace'!$A$3:$A$999=$A126)*TEXT('Měsíční rekapitulace'!$Q$3:$Q$999,\"0,0;0;0;\\0\")))","v":0},{"$f":"IF($A126=\"\",,SUMPRODUCT((LOOKUP(ROW(H$1:H$997),ROW(H$1:H$997)/ISNUMBER('Měsíční rekapitulace'!$L$1:$L$997),'Měsíční rekapitulace'!$L$1:$L$997)=H$4)*('Měsíční rekapitulace'!$A$3:$A$999=$A126)*TEXT('Měsíční rekapitulace'!$Q$3:$Q$999,\"0,0;0;0;\\0\")))","v":0},{"$f":"IF($A126=\"\",,SUMPRODUCT((LOOKUP(ROW(I$1:I$997),ROW(I$1:I$997)/ISNUMBER('Měsíční rekapitulace'!$L$1:$L$997),'Měsíční rekapitulace'!$L$1:$L$997)=I$4)*('Měsíční rekapitulace'!$A$3:$A$999=$A126)*TEXT('Měsíční rekapitulace'!$Q$3:$Q$999,\"0,0;0;0;\\0\")))","v":0},{"$f":"IF($A126=\"\",,SUMPRODUCT((LOOKUP(ROW(J$1:J$997),ROW(J$1:J$997)/ISNUMBER('Měsíční rekapitulace'!$L$1:$L$997),'Měsíční rekapitulace'!$L$1:$L$997)=J$4)*('Měsíční rekapitulace'!$A$3:$A$999=$A126)*TEXT('Měsíční rekapitulace'!$Q$3:$Q$999,\"0,0;0;0;\\0\")))","v":0},{"$f":"IF($A126=\"\",,SUMPRODUCT((LOOKUP(ROW(K$1:K$997),ROW(K$1:K$997)/ISNUMBER('Měsíční rekapitulace'!$L$1:$L$997),'Měsíční rekapitulace'!$L$1:$L$997)=K$4)*('Měsíční rekapitulace'!$A$3:$A$999=$A126)*TEXT('Měsíční rekapitulace'!$Q$3:$Q$999,\"0,0;0;0;\\0\")))","v":0},{"$f":"IF($A126=\"\",,SUMPRODUCT((LOOKUP(ROW(L$1:L$997),ROW(L$1:L$997)/ISNUMBER('Měsíční rekapitulace'!$L$1:$L$997),'Měsíční rekapitulace'!$L$1:$L$997)=L$4)*('Měsíční rekapitulace'!$A$3:$A$999=$A126)*TEXT('Měsíční rekapitulace'!$Q$3:$Q$999,\"0,0;0;0;\\0\")))","v":0},{"$f":"IF($A126=\"\",,SUMPRODUCT((LOOKUP(ROW(M$1:M$997),ROW(M$1:M$997)/ISNUMBER('Měsíční rekapitulace'!$L$1:$L$997),'Měsíční rekapitulace'!$L$1:$L$997)=M$4)*('Měsíční rekapitulace'!$A$3:$A$999=$A126)*TEXT('Měsíční rekapitulace'!$Q$3:$Q$999,\"0,0;0;0;\\0\")))","v":0},{"$f":"IF($A126=\"\",,SUMPRODUCT((LOOKUP(ROW(N$1:N$997),ROW(N$1:N$997)/ISNUMBER('Měsíční rekapitulace'!$L$1:$L$997),'Měsíční rekapitulace'!$L$1:$L$997)=N$4)*('Měsíční rekapitulace'!$A$3:$A$999=$A126)*TEXT('Měsíční rekapitulace'!$Q$3:$Q$999,\"0,0;0;0;\\0\")))","v":0},{"$f":"IF($A126=\"\",,SUMPRODUCT((LOOKUP(ROW(O$1:O$997),ROW(O$1:O$997)/ISNUMBER('Měsíční rekapitulace'!$L$1:$L$997),'Měsíční rekapitulace'!$L$1:$L$997)=O$4)*('Měsíční rekapitulace'!$A$3:$A$999=$A126)*TEXT('Měsíční rekapitulace'!$Q$3:$Q$999,\"0,0;0;0;\\0\")))","v":0},0]
[{"$f":"IFERROR(INDEX('Měsíční rekapitulace'!A$3:A$999,SMALL(IF(('Měsíční rekapitulace'!A$3:A$999<>\"\")*('Měsíční rekapitulace'!A$3:A$999<>'Měsíční rekapitulace'!$A$2)*(COUNTIF(A$5:A126,'Měsíční rekapitulace'!A$3:A$999)=0),ROW('Měsíční rekapitulace'!A$3:A$999)-2),1)),\"\")","v":""},{"$f":"IFERROR(INDEX('Měsíční rekapitulace'!E$3:E$999,MATCH(A127,'Měsíční rekapitulace'!A$3:A$999,)),\"\")","v":""},null,{"$f":"IF($A127=\"\",,SUMPRODUCT((LOOKUP(ROW(D$1:D$997),ROW(D$1:D$997)/ISNUMBER('Měsíční rekapitulace'!$L$1:$L$997),'Měsíční rekapitulace'!$L$1:$L$997)=D$4)*('Měsíční rekapitulace'!$A$3:$A$999=$A127)*TEXT('Měsíční rekapitulace'!$Q$3:$Q$999,\"0,0;0;0;\\0\")))","v":0},{"$f":"IF($A127=\"\",,SUMPRODUCT((LOOKUP(ROW(E$1:E$997),ROW(E$1:E$997)/ISNUMBER('Měsíční rekapitulace'!$L$1:$L$997),'Měsíční rekapitulace'!$L$1:$L$997)=E$4)*('Měsíční rekapitulace'!$A$3:$A$999=$A127)*TEXT('Měsíční rekapitulace'!$Q$3:$Q$999,\"0,0;0;0;\\0\")))","v":0},{"$f":"IF($A127=\"\",,SUMPRODUCT((LOOKUP(ROW(F$1:F$997),ROW(F$1:F$997)/ISNUMBER('Měsíční rekapitulace'!$L$1:$L$997),'Měsíční rekapitulace'!$L$1:$L$997)=F$4)*('Měsíční rekapitulace'!$A$3:$A$999=$A127)*TEXT('Měsíční rekapitulace'!$Q$3:$Q$999,\"0,0;0;0;\\0\")))","v":0},{"$f":"IF($A127=\"\",,SUMPRODUCT((LOOKUP(ROW(G$1:G$997),ROW(G$1:G$997)/ISNUMBER('Měsíční rekapitulace'!$L$1:$L$997),'Měsíční rekapitulace'!$L$1:$L$997)=G$4)*('Měsíční rekapitulace'!$A$3:$A$999=$A127)*TEXT('Měsíční rekapitulace'!$Q$3:$Q$999,\"0,0;0;0;\\0\")))","v":0},{"$f":"IF($A127=\"\",,SUMPRODUCT((LOOKUP(ROW(H$1:H$997),ROW(H$1:H$997)/ISNUMBER('Měsíční rekapitulace'!$L$1:$L$997),'Měsíční rekapitulace'!$L$1:$L$997)=H$4)*('Měsíční rekapitulace'!$A$3:$A$999=$A127)*TEXT('Měsíční rekapitulace'!$Q$3:$Q$999,\"0,0;0;0;\\0\")))","v":0},{"$f":"IF($A127=\"\",,SUMPRODUCT((LOOKUP(ROW(I$1:I$997),ROW(I$1:I$997)/ISNUMBER('Měsíční rekapitulace'!$L$1:$L$997),'Měsíční rekapitulace'!$L$1:$L$997)=I$4)*('Měsíční rekapitulace'!$A$3:$A$999=$A127)*TEXT('Měsíční rekapitulace'!$Q$3:$Q$999,\"0,0;0;0;\\0\")))","v":0},{"$f":"IF($A127=\"\",,SUMPRODUCT((LOOKUP(ROW(J$1:J$997),ROW(J$1:J$997)/ISNUMBER('Měsíční rekapitulace'!$L$1:$L$997),'Měsíční rekapitulace'!$L$1:$L$997)=J$4)*('Měsíční rekapitulace'!$A$3:$A$999=$A127)*TEXT('Měsíční rekapitulace'!$Q$3:$Q$999,\"0,0;0;0;\\0\")))","v":0},{"$f":"IF($A127=\"\",,SUMPRODUCT((LOOKUP(ROW(K$1:K$997),ROW(K$1:K$997)/ISNUMBER('Měsíční rekapitulace'!$L$1:$L$997),'Měsíční rekapitulace'!$L$1:$L$997)=K$4)*('Měsíční rekapitulace'!$A$3:$A$999=$A127)*TEXT('Měsíční rekapitulace'!$Q$3:$Q$999,\"0,0;0;0;\\0\")))","v":0},{"$f":"IF($A127=\"\",,SUMPRODUCT((LOOKUP(ROW(L$1:L$997),ROW(L$1:L$997)/ISNUMBER('Měsíční rekapitulace'!$L$1:$L$997),'Měsíční rekapitulace'!$L$1:$L$997)=L$4)*('Měsíční rekapitulace'!$A$3:$A$999=$A127)*TEXT('Měsíční rekapitulace'!$Q$3:$Q$999,\"0,0;0;0;\\0\")))","v":0},{"$f":"IF($A127=\"\",,SUMPRODUCT((LOOKUP(ROW(M$1:M$997),ROW(M$1:M$997)/ISNUMBER('Měsíční rekapitulace'!$L$1:$L$997),'Měsíční rekapitulace'!$L$1:$L$997)=M$4)*('Měsíční rekapitulace'!$A$3:$A$999=$A127)*TEXT('Měsíční rekapitulace'!$Q$3:$Q$999,\"0,0;0;0;\\0\")))","v":0},{"$f":"IF($A127=\"\",,SUMPRODUCT((LOOKUP(ROW(N$1:N$997),ROW(N$1:N$997)/ISNUMBER('Měsíční rekapitulace'!$L$1:$L$997),'Měsíční rekapitulace'!$L$1:$L$997)=N$4)*('Měsíční rekapitulace'!$A$3:$A$999=$A127)*TEXT('Měsíční rekapitulace'!$Q$3:$Q$999,\"0,0;0;0;\\0\")))","v":0},{"$f":"IF($A127=\"\",,SUMPRODUCT((LOOKUP(ROW(O$1:O$997),ROW(O$1:O$997)/ISNUMBER('Měsíční rekapitulace'!$L$1:$L$997),'Měsíční rekapitulace'!$L$1:$L$997)=O$4)*('Měsíční rekapitulace'!$A$3:$A$999=$A127)*TEXT('Měsíční rekapitulace'!$Q$3:$Q$999,\"0,0;0;0;\\0\")))","v":0},0]
[{"$f":"IFERROR(INDEX('Měsíční rekapitulace'!A$3:A$999,SMALL(IF(('Měsíční rekapitulace'!A$3:A$999<>\"\")*('Měsíční rekapitulace'!A$3:A$999<>'Měsíční rekapitulace'!$A$2)*(COUNTIF(A$5:A127,'Měsíční rekapitulace'!A$3:A$999)=0),ROW('Měsíční rekapitulace'!A$3:A$999)-2),1)),\"\")","v":""},{"$f":"IFERROR(INDEX('Měsíční rekapitulace'!E$3:E$999,MATCH(A128,'Měsíční rekapitulace'!A$3:A$999,)),\"\")","v":""},null,{"$f":"IF($A128=\"\",,SUMPRODUCT((LOOKUP(ROW(D$1:D$997),ROW(D$1:D$997)/ISNUMBER('Měsíční rekapitulace'!$L$1:$L$997),'Měsíční rekapitulace'!$L$1:$L$997)=D$4)*('Měsíční rekapitulace'!$A$3:$A$999=$A128)*TEXT('Měsíční rekapitulace'!$Q$3:$Q$999,\"0,0;0;0;\\0\")))","v":0},{"$f":"IF($A128=\"\",,SUMPRODUCT((LOOKUP(ROW(E$1:E$997),ROW(E$1:E$997)/ISNUMBER('Měsíční rekapitulace'!$L$1:$L$997),'Měsíční rekapitulace'!$L$1:$L$997)=E$4)*('Měsíční rekapitulace'!$A$3:$A$999=$A128)*TEXT('Měsíční rekapitulace'!$Q$3:$Q$999,\"0,0;0;0;\\0\")))","v":0},{"$f":"IF($A128=\"\",,SUMPRODUCT((LOOKUP(ROW(F$1:F$997),ROW(F$1:F$997)/ISNUMBER('Měsíční rekapitulace'!$L$1:$L$997),'Měsíční rekapitulace'!$L$1:$L$997)=F$4)*('Měsíční rekapitulace'!$A$3:$A$999=$A128)*TEXT('Měsíční rekapitulace'!$Q$3:$Q$999,\"0,0;0;0;\\0\")))","v":0},{"$f":"IF($A128=\"\",,SUMPRODUCT((LOOKUP(ROW(G$1:G$997),ROW(G$1:G$997)/ISNUMBER('Měsíční rekapitulace'!$L$1:$L$997),'Měsíční rekapitulace'!$L$1:$L$997)=G$4)*('Měsíční rekapitulace'!$A$3:$A$999=$A128)*TEXT('Měsíční rekapitulace'!$Q$3:$Q$999,\"0,0;0;0;\\0\")))","v":0},{"$f":"IF($A128=\"\",,SUMPRODUCT((LOOKUP(ROW(H$1:H$997),ROW(H$1:H$997)/ISNUMBER('Měsíční rekapitulace'!$L$1:$L$997),'Měsíční rekapitulace'!$L$1:$L$997)=H$4)*('Měsíční rekapitulace'!$A$3:$A$999=$A128)*TEXT('Měsíční rekapitulace'!$Q$3:$Q$999,\"0,0;0;0;\\0\")))","v":0},{"$f":"IF($A128=\"\",,SUMPRODUCT((LOOKUP(ROW(I$1:I$997),ROW(I$1:I$997)/ISNUMBER('Měsíční rekapitulace'!$L$1:$L$997),'Měsíční rekapitulace'!$L$1:$L$997)=I$4)*('Měsíční rekapitulace'!$A$3:$A$999=$A128)*TEXT('Měsíční rekapitulace'!$Q$3:$Q$999,\"0,0;0;0;\\0\")))","v":0},{"$f":"IF($A128=\"\",,SUMPRODUCT((LOOKUP(ROW(J$1:J$997),ROW(J$1:J$997)/ISNUMBER('Měsíční rekapitulace'!$L$1:$L$997),'Měsíční rekapitulace'!$L$1:$L$997)=J$4)*('Měsíční rekapitulace'!$A$3:$A$999=$A128)*TEXT('Měsíční rekapitulace'!$Q$3:$Q$999,\"0,0;0;0;\\0\")))","v":0},{"$f":"IF($A128=\"\",,SUMPRODUCT((LOOKUP(ROW(K$1:K$997),ROW(K$1:K$997)/ISNUMBER('Měsíční rekapitulace'!$L$1:$L$997),'Měsíční rekapitulace'!$L$1:$L$997)=K$4)*('Měsíční rekapitulace'!$A$3:$A$999=$A128)*TEXT('Měsíční rekapitulace'!$Q$3:$Q$999,\"0,0;0;0;\\0\")))","v":0},{"$f":"IF($A128=\"\",,SUMPRODUCT((LOOKUP(ROW(L$1:L$997),ROW(L$1:L$997)/ISNUMBER('Měsíční rekapitulace'!$L$1:$L$997),'Měsíční rekapitulace'!$L$1:$L$997)=L$4)*('Měsíční rekapitulace'!$A$3:$A$999=$A128)*TEXT('Měsíční rekapitulace'!$Q$3:$Q$999,\"0,0;0;0;\\0\")))","v":0},{"$f":"IF($A128=\"\",,SUMPRODUCT((LOOKUP(ROW(M$1:M$997),ROW(M$1:M$997)/ISNUMBER('Měsíční rekapitulace'!$L$1:$L$997),'Měsíční rekapitulace'!$L$1:$L$997)=M$4)*('Měsíční rekapitulace'!$A$3:$A$999=$A128)*TEXT('Měsíční rekapitulace'!$Q$3:$Q$999,\"0,0;0;0;\\0\")))","v":0},{"$f":"IF($A128=\"\",,SUMPRODUCT((LOOKUP(ROW(N$1:N$997),ROW(N$1:N$997)/ISNUMBER('Měsíční rekapitulace'!$L$1:$L$997),'Měsíční rekapitulace'!$L$1:$L$997)=N$4)*('Měsíční rekapitulace'!$A$3:$A$999=$A128)*TEXT('Měsíční rekapitulace'!$Q$3:$Q$999,\"0,0;0;0;\\0\")))","v":0},{"$f":"IF($A128=\"\",,SUMPRODUCT((LOOKUP(ROW(O$1:O$997),ROW(O$1:O$997)/ISNUMBER('Měsíční rekapitulace'!$L$1:$L$997),'Měsíční rekapitulace'!$L$1:$L$997)=O$4)*('Měsíční rekapitulace'!$A$3:$A$999=$A128)*TEXT('Měsíční rekapitulace'!$Q$3:$Q$999,\"0,0;0;0;\\0\")))","v":0},0]
[{"$f":"IFERROR(INDEX('Měsíční rekapitulace'!A$3:A$999,SMALL(IF(('Měsíční rekapitulace'!A$3:A$999<>\"\")*('Měsíční rekapitulace'!A$3:A$999<>'Měsíční rekapitulace'!$A$2)*(COUNTIF(A$5:A128,'Měsíční rekapitulace'!A$3:A$999)=0),ROW('Měsíční rekapitulace'!A$3:A$999)-2),1)),\"\")","v":""},{"$f":"IFERROR(INDEX('Měsíční rekapitulace'!E$3:E$999,MATCH(A129,'Měsíční rekapitulace'!A$3:A$999,)),\"\")","v":""},null,{"$f":"IF($A129=\"\",,SUMPRODUCT((LOOKUP(ROW(D$1:D$997),ROW(D$1:D$997)/ISNUMBER('Měsíční rekapitulace'!$L$1:$L$997),'Měsíční rekapitulace'!$L$1:$L$997)=D$4)*('Měsíční rekapitulace'!$A$3:$A$999=$A129)*TEXT('Měsíční rekapitulace'!$Q$3:$Q$999,\"0,0;0;0;\\0\")))","v":0},{"$f":"IF($A129=\"\",,SUMPRODUCT((LOOKUP(ROW(E$1:E$997),ROW(E$1:E$997)/ISNUMBER('Měsíční rekapitulace'!$L$1:$L$997),'Měsíční rekapitulace'!$L$1:$L$997)=E$4)*('Měsíční rekapitulace'!$A$3:$A$999=$A129)*TEXT('Měsíční rekapitulace'!$Q$3:$Q$999,\"0,0;0;0;\\0\")))","v":0},{"$f":"IF($A129=\"\",,SUMPRODUCT((LOOKUP(ROW(F$1:F$997),ROW(F$1:F$997)/ISNUMBER('Měsíční rekapitulace'!$L$1:$L$997),'Měsíční rekapitulace'!$L$1:$L$997)=F$4)*('Měsíční rekapitulace'!$A$3:$A$999=$A129)*TEXT('Měsíční rekapitulace'!$Q$3:$Q$999,\"0,0;0;0;\\0\")))","v":0},{"$f":"IF($A129=\"\",,SUMPRODUCT((LOOKUP(ROW(G$1:G$997),ROW(G$1:G$997)/ISNUMBER('Měsíční rekapitulace'!$L$1:$L$997),'Měsíční rekapitulace'!$L$1:$L$997)=G$4)*('Měsíční rekapitulace'!$A$3:$A$999=$A129)*TEXT('Měsíční rekapitulace'!$Q$3:$Q$999,\"0,0;0;0;\\0\")))","v":0},{"$f":"IF($A129=\"\",,SUMPRODUCT((LOOKUP(ROW(H$1:H$997),ROW(H$1:H$997)/ISNUMBER('Měsíční rekapitulace'!$L$1:$L$997),'Měsíční rekapitulace'!$L$1:$L$997)=H$4)*('Měsíční rekapitulace'!$A$3:$A$999=$A129)*TEXT('Měsíční rekapitulace'!$Q$3:$Q$999,\"0,0;0;0;\\0\")))","v":0},{"$f":"IF($A129=\"\",,SUMPRODUCT((LOOKUP(ROW(I$1:I$997),ROW(I$1:I$997)/ISNUMBER('Měsíční rekapitulace'!$L$1:$L$997),'Měsíční rekapitulace'!$L$1:$L$997)=I$4)*('Měsíční rekapitulace'!$A$3:$A$999=$A129)*TEXT('Měsíční rekapitulace'!$Q$3:$Q$999,\"0,0;0;0;\\0\")))","v":0},{"$f":"IF($A129=\"\",,SUMPRODUCT((LOOKUP(ROW(J$1:J$997),ROW(J$1:J$997)/ISNUMBER('Měsíční rekapitulace'!$L$1:$L$997),'Měsíční rekapitulace'!$L$1:$L$997)=J$4)*('Měsíční rekapitulace'!$A$3:$A$999=$A129)*TEXT('Měsíční rekapitulace'!$Q$3:$Q$999,\"0,0;0;0;\\0\")))","v":0},{"$f":"IF($A129=\"\",,SUMPRODUCT((LOOKUP(ROW(K$1:K$997),ROW(K$1:K$997)/ISNUMBER('Měsíční rekapitulace'!$L$1:$L$997),'Měsíční rekapitulace'!$L$1:$L$997)=K$4)*('Měsíční rekapitulace'!$A$3:$A$999=$A129)*TEXT('Měsíční rekapitulace'!$Q$3:$Q$999,\"0,0;0;0;\\0\")))","v":0},{"$f":"IF($A129=\"\",,SUMPRODUCT((LOOKUP(ROW(L$1:L$997),ROW(L$1:L$997)/ISNUMBER('Měsíční rekapitulace'!$L$1:$L$997),'Měsíční rekapitulace'!$L$1:$L$997)=L$4)*('Měsíční rekapitulace'!$A$3:$A$999=$A129)*TEXT('Měsíční rekapitulace'!$Q$3:$Q$999,\"0,0;0;0;\\0\")))","v":0},{"$f":"IF($A129=\"\",,SUMPRODUCT((LOOKUP(ROW(M$1:M$997),ROW(M$1:M$997)/ISNUMBER('Měsíční rekapitulace'!$L$1:$L$997),'Měsíční rekapitulace'!$L$1:$L$997)=M$4)*('Měsíční rekapitulace'!$A$3:$A$999=$A129)*TEXT('Měsíční rekapitulace'!$Q$3:$Q$999,\"0,0;0;0;\\0\")))","v":0},{"$f":"IF($A129=\"\",,SUMPRODUCT((LOOKUP(ROW(N$1:N$997),ROW(N$1:N$997)/ISNUMBER('Měsíční rekapitulace'!$L$1:$L$997),'Měsíční rekapitulace'!$L$1:$L$997)=N$4)*('Měsíční rekapitulace'!$A$3:$A$999=$A129)*TEXT('Měsíční rekapitulace'!$Q$3:$Q$999,\"0,0;0;0;\\0\")))","v":0},{"$f":"IF($A129=\"\",,SUMPRODUCT((LOOKUP(ROW(O$1:O$997),ROW(O$1:O$997)/ISNUMBER('Měsíční rekapitulace'!$L$1:$L$997),'Měsíční rekapitulace'!$L$1:$L$997)=O$4)*('Měsíční rekapitulace'!$A$3:$A$999=$A129)*TEXT('Měsíční rekapitulace'!$Q$3:$Q$999,\"0,0;0;0;\\0\")))","v":0},0]
[{"$f":"IFERROR(INDEX('Měsíční rekapitulace'!A$3:A$999,SMALL(IF(('Měsíční rekapitulace'!A$3:A$999<>\"\")*('Měsíční rekapitulace'!A$3:A$999<>'Měsíční rekapitulace'!$A$2)*(COUNTIF(A$5:A129,'Měsíční rekapitulace'!A$3:A$999)=0),ROW('Měsíční rekapitulace'!A$3:A$999)-2),1)),\"\")","v":""},{"$f":"IFERROR(INDEX('Měsíční rekapitulace'!E$3:E$999,MATCH(A130,'Měsíční rekapitulace'!A$3:A$999,)),\"\")","v":""},null,{"$f":"IF($A130=\"\",,SUMPRODUCT((LOOKUP(ROW(D$1:D$997),ROW(D$1:D$997)/ISNUMBER('Měsíční rekapitulace'!$L$1:$L$997),'Měsíční rekapitulace'!$L$1:$L$997)=D$4)*('Měsíční rekapitulace'!$A$3:$A$999=$A130)*TEXT('Měsíční rekapitulace'!$Q$3:$Q$999,\"0,0;0;0;\\0\")))","v":0},{"$f":"IF($A130=\"\",,SUMPRODUCT((LOOKUP(ROW(E$1:E$997),ROW(E$1:E$997)/ISNUMBER('Měsíční rekapitulace'!$L$1:$L$997),'Měsíční rekapitulace'!$L$1:$L$997)=E$4)*('Měsíční rekapitulace'!$A$3:$A$999=$A130)*TEXT('Měsíční rekapitulace'!$Q$3:$Q$999,\"0,0;0;0;\\0\")))","v":0},{"$f":"IF($A130=\"\",,SUMPRODUCT((LOOKUP(ROW(F$1:F$997),ROW(F$1:F$997)/ISNUMBER('Měsíční rekapitulace'!$L$1:$L$997),'Měsíční rekapitulace'!$L$1:$L$997)=F$4)*('Měsíční rekapitulace'!$A$3:$A$999=$A130)*TEXT('Měsíční rekapitulace'!$Q$3:$Q$999,\"0,0;0;0;\\0\")))","v":0},{"$f":"IF($A130=\"\",,SUMPRODUCT((LOOKUP(ROW(G$1:G$997),ROW(G$1:G$997)/ISNUMBER('Měsíční rekapitulace'!$L$1:$L$997),'Měsíční rekapitulace'!$L$1:$L$997)=G$4)*('Měsíční rekapitulace'!$A$3:$A$999=$A130)*TEXT('Měsíční rekapitulace'!$Q$3:$Q$999,\"0,0;0;0;\\0\")))","v":0},{"$f":"IF($A130=\"\",,SUMPRODUCT((LOOKUP(ROW(H$1:H$997),ROW(H$1:H$997)/ISNUMBER('Měsíční rekapitulace'!$L$1:$L$997),'Měsíční rekapitulace'!$L$1:$L$997)=H$4)*('Měsíční rekapitulace'!$A$3:$A$999=$A130)*TEXT('Měsíční rekapitulace'!$Q$3:$Q$999,\"0,0;0;0;\\0\")))","v":0},{"$f":"IF($A130=\"\",,SUMPRODUCT((LOOKUP(ROW(I$1:I$997),ROW(I$1:I$997)/ISNUMBER('Měsíční rekapitulace'!$L$1:$L$997),'Měsíční rekapitulace'!$L$1:$L$997)=I$4)*('Měsíční rekapitulace'!$A$3:$A$999=$A130)*TEXT('Měsíční rekapitulace'!$Q$3:$Q$999,\"0,0;0;0;\\0\")))","v":0},{"$f":"IF($A130=\"\",,SUMPRODUCT((LOOKUP(ROW(J$1:J$997),ROW(J$1:J$997)/ISNUMBER('Měsíční rekapitulace'!$L$1:$L$997),'Měsíční rekapitulace'!$L$1:$L$997)=J$4)*('Měsíční rekapitulace'!$A$3:$A$999=$A130)*TEXT('Měsíční rekapitulace'!$Q$3:$Q$999,\"0,0;0;0;\\0\")))","v":0},{"$f":"IF($A130=\"\",,SUMPRODUCT((LOOKUP(ROW(K$1:K$997),ROW(K$1:K$997)/ISNUMBER('Měsíční rekapitulace'!$L$1:$L$997),'Měsíční rekapitulace'!$L$1:$L$997)=K$4)*('Měsíční rekapitulace'!$A$3:$A$999=$A130)*TEXT('Měsíční rekapitulace'!$Q$3:$Q$999,\"0,0;0;0;\\0\")))","v":0},{"$f":"IF($A130=\"\",,SUMPRODUCT((LOOKUP(ROW(L$1:L$997),ROW(L$1:L$997)/ISNUMBER('Měsíční rekapitulace'!$L$1:$L$997),'Měsíční rekapitulace'!$L$1:$L$997)=L$4)*('Měsíční rekapitulace'!$A$3:$A$999=$A130)*TEXT('Měsíční rekapitulace'!$Q$3:$Q$999,\"0,0;0;0;\\0\")))","v":0},{"$f":"IF($A130=\"\",,SUMPRODUCT((LOOKUP(ROW(M$1:M$997),ROW(M$1:M$997)/ISNUMBER('Měsíční rekapitulace'!$L$1:$L$997),'Měsíční rekapitulace'!$L$1:$L$997)=M$4)*('Měsíční rekapitulace'!$A$3:$A$999=$A130)*TEXT('Měsíční rekapitulace'!$Q$3:$Q$999,\"0,0;0;0;\\0\")))","v":0},{"$f":"IF($A130=\"\",,SUMPRODUCT((LOOKUP(ROW(N$1:N$997),ROW(N$1:N$997)/ISNUMBER('Měsíční rekapitulace'!$L$1:$L$997),'Měsíční rekapitulace'!$L$1:$L$997)=N$4)*('Měsíční rekapitulace'!$A$3:$A$999=$A130)*TEXT('Měsíční rekapitulace'!$Q$3:$Q$999,\"0,0;0;0;\\0\")))","v":0},{"$f":"IF($A130=\"\",,SUMPRODUCT((LOOKUP(ROW(O$1:O$997),ROW(O$1:O$997)/ISNUMBER('Měsíční rekapitulace'!$L$1:$L$997),'Měsíční rekapitulace'!$L$1:$L$997)=O$4)*('Měsíční rekapitulace'!$A$3:$A$999=$A130)*TEXT('Měsíční rekapitulace'!$Q$3:$Q$999,\"0,0;0;0;\\0\")))","v":0},0]
[{"$f":"IFERROR(INDEX('Měsíční rekapitulace'!A$3:A$999,SMALL(IF(('Měsíční rekapitulace'!A$3:A$999<>\"\")*('Měsíční rekapitulace'!A$3:A$999<>'Měsíční rekapitulace'!$A$2)*(COUNTIF(A$5:A130,'Měsíční rekapitulace'!A$3:A$999)=0),ROW('Měsíční rekapitulace'!A$3:A$999)-2),1)),\"\")","v":""},{"$f":"IFERROR(INDEX('Měsíční rekapitulace'!E$3:E$999,MATCH(A131,'Měsíční rekapitulace'!A$3:A$999,)),\"\")","v":""},null,{"$f":"IF($A131=\"\",,SUMPRODUCT((LOOKUP(ROW(D$1:D$997),ROW(D$1:D$997)/ISNUMBER('Měsíční rekapitulace'!$L$1:$L$997),'Měsíční rekapitulace'!$L$1:$L$997)=D$4)*('Měsíční rekapitulace'!$A$3:$A$999=$A131)*TEXT('Měsíční rekapitulace'!$Q$3:$Q$999,\"0,0;0;0;\\0\")))","v":0},{"$f":"IF($A131=\"\",,SUMPRODUCT((LOOKUP(ROW(E$1:E$997),ROW(E$1:E$997)/ISNUMBER('Měsíční rekapitulace'!$L$1:$L$997),'Měsíční rekapitulace'!$L$1:$L$997)=E$4)*('Měsíční rekapitulace'!$A$3:$A$999=$A131)*TEXT('Měsíční rekapitulace'!$Q$3:$Q$999,\"0,0;0;0;\\0\")))","v":0},{"$f":"IF($A131=\"\",,SUMPRODUCT((LOOKUP(ROW(F$1:F$997),ROW(F$1:F$997)/ISNUMBER('Měsíční rekapitulace'!$L$1:$L$997),'Měsíční rekapitulace'!$L$1:$L$997)=F$4)*('Měsíční rekapitulace'!$A$3:$A$999=$A131)*TEXT('Měsíční rekapitulace'!$Q$3:$Q$999,\"0,0;0;0;\\0\")))","v":0},{"$f":"IF($A131=\"\",,SUMPRODUCT((LOOKUP(ROW(G$1:G$997),ROW(G$1:G$997)/ISNUMBER('Měsíční rekapitulace'!$L$1:$L$997),'Měsíční rekapitulace'!$L$1:$L$997)=G$4)*('Měsíční rekapitulace'!$A$3:$A$999=$A131)*TEXT('Měsíční rekapitulace'!$Q$3:$Q$999,\"0,0;0;0;\\0\")))","v":0},{"$f":"IF($A131=\"\",,SUMPRODUCT((LOOKUP(ROW(H$1:H$997),ROW(H$1:H$997)/ISNUMBER('Měsíční rekapitulace'!$L$1:$L$997),'Měsíční rekapitulace'!$L$1:$L$997)=H$4)*('Měsíční rekapitulace'!$A$3:$A$999=$A131)*TEXT('Měsíční rekapitulace'!$Q$3:$Q$999,\"0,0;0;0;\\0\")))","v":0},{"$f":"IF($A131=\"\",,SUMPRODUCT((LOOKUP(ROW(I$1:I$997),ROW(I$1:I$997)/ISNUMBER('Měsíční rekapitulace'!$L$1:$L$997),'Měsíční rekapitulace'!$L$1:$L$997)=I$4)*('Měsíční rekapitulace'!$A$3:$A$999=$A131)*TEXT('Měsíční rekapitulace'!$Q$3:$Q$999,\"0,0;0;0;\\0\")))","v":0},{"$f":"IF($A131=\"\",,SUMPRODUCT((LOOKUP(ROW(J$1:J$997),ROW(J$1:J$997)/ISNUMBER('Měsíční rekapitulace'!$L$1:$L$997),'Měsíční rekapitulace'!$L$1:$L$997)=J$4)*('Měsíční rekapitulace'!$A$3:$A$999=$A131)*TEXT('Měsíční rekapitulace'!$Q$3:$Q$999,\"0,0;0;0;\\0\")))","v":0},{"$f":"IF($A131=\"\",,SUMPRODUCT((LOOKUP(ROW(K$1:K$997),ROW(K$1:K$997)/ISNUMBER('Měsíční rekapitulace'!$L$1:$L$997),'Měsíční rekapitulace'!$L$1:$L$997)=K$4)*('Měsíční rekapitulace'!$A$3:$A$999=$A131)*TEXT('Měsíční rekapitulace'!$Q$3:$Q$999,\"0,0;0;0;\\0\")))","v":0},{"$f":"IF($A131=\"\",,SUMPRODUCT((LOOKUP(ROW(L$1:L$997),ROW(L$1:L$997)/ISNUMBER('Měsíční rekapitulace'!$L$1:$L$997),'Měsíční rekapitulace'!$L$1:$L$997)=L$4)*('Měsíční rekapitulace'!$A$3:$A$999=$A131)*TEXT('Měsíční rekapitulace'!$Q$3:$Q$999,\"0,0;0;0;\\0\")))","v":0},{"$f":"IF($A131=\"\",,SUMPRODUCT((LOOKUP(ROW(M$1:M$997),ROW(M$1:M$997)/ISNUMBER('Měsíční rekapitulace'!$L$1:$L$997),'Měsíční rekapitulace'!$L$1:$L$997)=M$4)*('Měsíční rekapitulace'!$A$3:$A$999=$A131)*TEXT('Měsíční rekapitulace'!$Q$3:$Q$999,\"0,0;0;0;\\0\")))","v":0},{"$f":"IF($A131=\"\",,SUMPRODUCT((LOOKUP(ROW(N$1:N$997),ROW(N$1:N$997)/ISNUMBER('Měsíční rekapitulace'!$L$1:$L$997),'Měsíční rekapitulace'!$L$1:$L$997)=N$4)*('Měsíční rekapitulace'!$A$3:$A$999=$A131)*TEXT('Měsíční rekapitulace'!$Q$3:$Q$999,\"0,0;0;0;\\0\")))","v":0},{"$f":"IF($A131=\"\",,SUMPRODUCT((LOOKUP(ROW(O$1:O$997),ROW(O$1:O$997)/ISNUMBER('Měsíční rekapitulace'!$L$1:$L$997),'Měsíční rekapitulace'!$L$1:$L$997)=O$4)*('Měsíční rekapitulace'!$A$3:$A$999=$A131)*TEXT('Měsíční rekapitulace'!$Q$3:$Q$999,\"0,0;0;0;\\0\")))","v":0},0]
[{"$f":"IFERROR(INDEX('Měsíční rekapitulace'!A$3:A$999,SMALL(IF(('Měsíční rekapitulace'!A$3:A$999<>\"\")*('Měsíční rekapitulace'!A$3:A$999<>'Měsíční rekapitulace'!$A$2)*(COUNTIF(A$5:A131,'Měsíční rekapitulace'!A$3:A$999)=0),ROW('Měsíční rekapitulace'!A$3:A$999)-2),1)),\"\")","v":""},{"$f":"IFERROR(INDEX('Měsíční rekapitulace'!E$3:E$999,MATCH(A132,'Měsíční rekapitulace'!A$3:A$999,)),\"\")","v":""},null,{"$f":"IF($A132=\"\",,SUMPRODUCT((LOOKUP(ROW(D$1:D$997),ROW(D$1:D$997)/ISNUMBER('Měsíční rekapitulace'!$L$1:$L$997),'Měsíční rekapitulace'!$L$1:$L$997)=D$4)*('Měsíční rekapitulace'!$A$3:$A$999=$A132)*TEXT('Měsíční rekapitulace'!$Q$3:$Q$999,\"0,0;0;0;\\0\")))","v":0},{"$f":"IF($A132=\"\",,SUMPRODUCT((LOOKUP(ROW(E$1:E$997),ROW(E$1:E$997)/ISNUMBER('Měsíční rekapitulace'!$L$1:$L$997),'Měsíční rekapitulace'!$L$1:$L$997)=E$4)*('Měsíční rekapitulace'!$A$3:$A$999=$A132)*TEXT('Měsíční rekapitulace'!$Q$3:$Q$999,\"0,0;0;0;\\0\")))","v":0},{"$f":"IF($A132=\"\",,SUMPRODUCT((LOOKUP(ROW(F$1:F$997),ROW(F$1:F$997)/ISNUMBER('Měsíční rekapitulace'!$L$1:$L$997),'Měsíční rekapitulace'!$L$1:$L$997)=F$4)*('Měsíční rekapitulace'!$A$3:$A$999=$A132)*TEXT('Měsíční rekapitulace'!$Q$3:$Q$999,\"0,0;0;0;\\0\")))","v":0},{"$f":"IF($A132=\"\",,SUMPRODUCT((LOOKUP(ROW(G$1:G$997),ROW(G$1:G$997)/ISNUMBER('Měsíční rekapitulace'!$L$1:$L$997),'Měsíční rekapitulace'!$L$1:$L$997)=G$4)*('Měsíční rekapitulace'!$A$3:$A$999=$A132)*TEXT('Měsíční rekapitulace'!$Q$3:$Q$999,\"0,0;0;0;\\0\")))","v":0},{"$f":"IF($A132=\"\",,SUMPRODUCT((LOOKUP(ROW(H$1:H$997),ROW(H$1:H$997)/ISNUMBER('Měsíční rekapitulace'!$L$1:$L$997),'Měsíční rekapitulace'!$L$1:$L$997)=H$4)*('Měsíční rekapitulace'!$A$3:$A$999=$A132)*TEXT('Měsíční rekapitulace'!$Q$3:$Q$999,\"0,0;0;0;\\0\")))","v":0},{"$f":"IF($A132=\"\",,SUMPRODUCT((LOOKUP(ROW(I$1:I$997),ROW(I$1:I$997)/ISNUMBER('Měsíční rekapitulace'!$L$1:$L$997),'Měsíční rekapitulace'!$L$1:$L$997)=I$4)*('Měsíční rekapitulace'!$A$3:$A$999=$A132)*TEXT('Měsíční rekapitulace'!$Q$3:$Q$999,\"0,0;0;0;\\0\")))","v":0},{"$f":"IF($A132=\"\",,SUMPRODUCT((LOOKUP(ROW(J$1:J$997),ROW(J$1:J$997)/ISNUMBER('Měsíční rekapitulace'!$L$1:$L$997),'Měsíční rekapitulace'!$L$1:$L$997)=J$4)*('Měsíční rekapitulace'!$A$3:$A$999=$A132)*TEXT('Měsíční rekapitulace'!$Q$3:$Q$999,\"0,0;0;0;\\0\")))","v":0},{"$f":"IF($A132=\"\",,SUMPRODUCT((LOOKUP(ROW(K$1:K$997),ROW(K$1:K$997)/ISNUMBER('Měsíční rekapitulace'!$L$1:$L$997),'Měsíční rekapitulace'!$L$1:$L$997)=K$4)*('Měsíční rekapitulace'!$A$3:$A$999=$A132)*TEXT('Měsíční rekapitulace'!$Q$3:$Q$999,\"0,0;0;0;\\0\")))","v":0},{"$f":"IF($A132=\"\",,SUMPRODUCT((LOOKUP(ROW(L$1:L$997),ROW(L$1:L$997)/ISNUMBER('Měsíční rekapitulace'!$L$1:$L$997),'Měsíční rekapitulace'!$L$1:$L$997)=L$4)*('Měsíční rekapitulace'!$A$3:$A$999=$A132)*TEXT('Měsíční rekapitulace'!$Q$3:$Q$999,\"0,0;0;0;\\0\")))","v":0},{"$f":"IF($A132=\"\",,SUMPRODUCT((LOOKUP(ROW(M$1:M$997),ROW(M$1:M$997)/ISNUMBER('Měsíční rekapitulace'!$L$1:$L$997),'Měsíční rekapitulace'!$L$1:$L$997)=M$4)*('Měsíční rekapitulace'!$A$3:$A$999=$A132)*TEXT('Měsíční rekapitulace'!$Q$3:$Q$999,\"0,0;0;0;\\0\")))","v":0},{"$f":"IF($A132=\"\",,SUMPRODUCT((LOOKUP(ROW(N$1:N$997),ROW(N$1:N$997)/ISNUMBER('Měsíční rekapitulace'!$L$1:$L$997),'Měsíční rekapitulace'!$L$1:$L$997)=N$4)*('Měsíční rekapitulace'!$A$3:$A$999=$A132)*TEXT('Měsíční rekapitulace'!$Q$3:$Q$999,\"0,0;0;0;\\0\")))","v":0},{"$f":"IF($A132=\"\",,SUMPRODUCT((LOOKUP(ROW(O$1:O$997),ROW(O$1:O$997)/ISNUMBER('Měsíční rekapitulace'!$L$1:$L$997),'Měsíční rekapitulace'!$L$1:$L$997)=O$4)*('Měsíční rekapitulace'!$A$3:$A$999=$A132)*TEXT('Měsíční rekapitulace'!$Q$3:$Q$999,\"0,0;0;0;\\0\")))","v":0},0]
[{"$f":"IFERROR(INDEX('Měsíční rekapitulace'!A$3:A$999,SMALL(IF(('Měsíční rekapitulace'!A$3:A$999<>\"\")*('Měsíční rekapitulace'!A$3:A$999<>'Měsíční rekapitulace'!$A$2)*(COUNTIF(A$5:A132,'Měsíční rekapitulace'!A$3:A$999)=0),ROW('Měsíční rekapitulace'!A$3:A$999)-2),1)),\"\")","v":""},{"$f":"IFERROR(INDEX('Měsíční rekapitulace'!E$3:E$999,MATCH(A133,'Měsíční rekapitulace'!A$3:A$999,)),\"\")","v":""},null,{"$f":"IF($A133=\"\",,SUMPRODUCT((LOOKUP(ROW(D$1:D$997),ROW(D$1:D$997)/ISNUMBER('Měsíční rekapitulace'!$L$1:$L$997),'Měsíční rekapitulace'!$L$1:$L$997)=D$4)*('Měsíční rekapitulace'!$A$3:$A$999=$A133)*TEXT('Měsíční rekapitulace'!$Q$3:$Q$999,\"0,0;0;0;\\0\")))","v":0},{"$f":"IF($A133=\"\",,SUMPRODUCT((LOOKUP(ROW(E$1:E$997),ROW(E$1:E$997)/ISNUMBER('Měsíční rekapitulace'!$L$1:$L$997),'Měsíční rekapitulace'!$L$1:$L$997)=E$4)*('Měsíční rekapitulace'!$A$3:$A$999=$A133)*TEXT('Měsíční rekapitulace'!$Q$3:$Q$999,\"0,0;0;0;\\0\")))","v":0},{"$f":"IF($A133=\"\",,SUMPRODUCT((LOOKUP(ROW(F$1:F$997),ROW(F$1:F$997)/ISNUMBER('Měsíční rekapitulace'!$L$1:$L$997),'Měsíční rekapitulace'!$L$1:$L$997)=F$4)*('Měsíční rekapitulace'!$A$3:$A$999=$A133)*TEXT('Měsíční rekapitulace'!$Q$3:$Q$999,\"0,0;0;0;\\0\")))","v":0},{"$f":"IF($A133=\"\",,SUMPRODUCT((LOOKUP(ROW(G$1:G$997),ROW(G$1:G$997)/ISNUMBER('Měsíční rekapitulace'!$L$1:$L$997),'Měsíční rekapitulace'!$L$1:$L$997)=G$4)*('Měsíční rekapitulace'!$A$3:$A$999=$A133)*TEXT('Měsíční rekapitulace'!$Q$3:$Q$999,\"0,0;0;0;\\0\")))","v":0},{"$f":"IF($A133=\"\",,SUMPRODUCT((LOOKUP(ROW(H$1:H$997),ROW(H$1:H$997)/ISNUMBER('Měsíční rekapitulace'!$L$1:$L$997),'Měsíční rekapitulace'!$L$1:$L$997)=H$4)*('Měsíční rekapitulace'!$A$3:$A$999=$A133)*TEXT('Měsíční rekapitulace'!$Q$3:$Q$999,\"0,0;0;0;\\0\")))","v":0},{"$f":"IF($A133=\"\",,SUMPRODUCT((LOOKUP(ROW(I$1:I$997),ROW(I$1:I$997)/ISNUMBER('Měsíční rekapitulace'!$L$1:$L$997),'Měsíční rekapitulace'!$L$1:$L$997)=I$4)*('Měsíční rekapitulace'!$A$3:$A$999=$A133)*TEXT('Měsíční rekapitulace'!$Q$3:$Q$999,\"0,0;0;0;\\0\")))","v":0},{"$f":"IF($A133=\"\",,SUMPRODUCT((LOOKUP(ROW(J$1:J$997),ROW(J$1:J$997)/ISNUMBER('Měsíční rekapitulace'!$L$1:$L$997),'Měsíční rekapitulace'!$L$1:$L$997)=J$4)*('Měsíční rekapitulace'!$A$3:$A$999=$A133)*TEXT('Měsíční rekapitulace'!$Q$3:$Q$999,\"0,0;0;0;\\0\")))","v":0},{"$f":"IF($A133=\"\",,SUMPRODUCT((LOOKUP(ROW(K$1:K$997),ROW(K$1:K$997)/ISNUMBER('Měsíční rekapitulace'!$L$1:$L$997),'Měsíční rekapitulace'!$L$1:$L$997)=K$4)*('Měsíční rekapitulace'!$A$3:$A$999=$A133)*TEXT('Měsíční rekapitulace'!$Q$3:$Q$999,\"0,0;0;0;\\0\")))","v":0},{"$f":"IF($A133=\"\",,SUMPRODUCT((LOOKUP(ROW(L$1:L$997),ROW(L$1:L$997)/ISNUMBER('Měsíční rekapitulace'!$L$1:$L$997),'Měsíční rekapitulace'!$L$1:$L$997)=L$4)*('Měsíční rekapitulace'!$A$3:$A$999=$A133)*TEXT('Měsíční rekapitulace'!$Q$3:$Q$999,\"0,0;0;0;\\0\")))","v":0},{"$f":"IF($A133=\"\",,SUMPRODUCT((LOOKUP(ROW(M$1:M$997),ROW(M$1:M$997)/ISNUMBER('Měsíční rekapitulace'!$L$1:$L$997),'Měsíční rekapitulace'!$L$1:$L$997)=M$4)*('Měsíční rekapitulace'!$A$3:$A$999=$A133)*TEXT('Měsíční rekapitulace'!$Q$3:$Q$999,\"0,0;0;0;\\0\")))","v":0},{"$f":"IF($A133=\"\",,SUMPRODUCT((LOOKUP(ROW(N$1:N$997),ROW(N$1:N$997)/ISNUMBER('Měsíční rekapitulace'!$L$1:$L$997),'Měsíční rekapitulace'!$L$1:$L$997)=N$4)*('Měsíční rekapitulace'!$A$3:$A$999=$A133)*TEXT('Měsíční rekapitulace'!$Q$3:$Q$999,\"0,0;0;0;\\0\")))","v":0},{"$f":"IF($A133=\"\",,SUMPRODUCT((LOOKUP(ROW(O$1:O$997),ROW(O$1:O$997)/ISNUMBER('Měsíční rekapitulace'!$L$1:$L$997),'Měsíční rekapitulace'!$L$1:$L$997)=O$4)*('Měsíční rekapitulace'!$A$3:$A$999=$A133)*TEXT('Měsíční rekapitulace'!$Q$3:$Q$999,\"0,0;0;0;\\0\")))","v":0},0]
[{"$f":"IFERROR(INDEX('Měsíční rekapitulace'!A$3:A$999,SMALL(IF(('Měsíční rekapitulace'!A$3:A$999<>\"\")*('Měsíční rekapitulace'!A$3:A$999<>'Měsíční rekapitulace'!$A$2)*(COUNTIF(A$5:A133,'Měsíční rekapitulace'!A$3:A$999)=0),ROW('Měsíční rekapitulace'!A$3:A$999)-2),1)),\"\")","v":""},{"$f":"IFERROR(INDEX('Měsíční rekapitulace'!E$3:E$999,MATCH(A134,'Měsíční rekapitulace'!A$3:A$999,)),\"\")","v":""},null,{"$f":"IF($A134=\"\",,SUMPRODUCT((LOOKUP(ROW(D$1:D$997),ROW(D$1:D$997)/ISNUMBER('Měsíční rekapitulace'!$L$1:$L$997),'Měsíční rekapitulace'!$L$1:$L$997)=D$4)*('Měsíční rekapitulace'!$A$3:$A$999=$A134)*TEXT('Měsíční rekapitulace'!$Q$3:$Q$999,\"0,0;0;0;\\0\")))","v":0},{"$f":"IF($A134=\"\",,SUMPRODUCT((LOOKUP(ROW(E$1:E$997),ROW(E$1:E$997)/ISNUMBER('Měsíční rekapitulace'!$L$1:$L$997),'Měsíční rekapitulace'!$L$1:$L$997)=E$4)*('Měsíční rekapitulace'!$A$3:$A$999=$A134)*TEXT('Měsíční rekapitulace'!$Q$3:$Q$999,\"0,0;0;0;\\0\")))","v":0},{"$f":"IF($A134=\"\",,SUMPRODUCT((LOOKUP(ROW(F$1:F$997),ROW(F$1:F$997)/ISNUMBER('Měsíční rekapitulace'!$L$1:$L$997),'Měsíční rekapitulace'!$L$1:$L$997)=F$4)*('Měsíční rekapitulace'!$A$3:$A$999=$A134)*TEXT('Měsíční rekapitulace'!$Q$3:$Q$999,\"0,0;0;0;\\0\")))","v":0},{"$f":"IF($A134=\"\",,SUMPRODUCT((LOOKUP(ROW(G$1:G$997),ROW(G$1:G$997)/ISNUMBER('Měsíční rekapitulace'!$L$1:$L$997),'Měsíční rekapitulace'!$L$1:$L$997)=G$4)*('Měsíční rekapitulace'!$A$3:$A$999=$A134)*TEXT('Měsíční rekapitulace'!$Q$3:$Q$999,\"0,0;0;0;\\0\")))","v":0},{"$f":"IF($A134=\"\",,SUMPRODUCT((LOOKUP(ROW(H$1:H$997),ROW(H$1:H$997)/ISNUMBER('Měsíční rekapitulace'!$L$1:$L$997),'Měsíční rekapitulace'!$L$1:$L$997)=H$4)*('Měsíční rekapitulace'!$A$3:$A$999=$A134)*TEXT('Měsíční rekapitulace'!$Q$3:$Q$999,\"0,0;0;0;\\0\")))","v":0},{"$f":"IF($A134=\"\",,SUMPRODUCT((LOOKUP(ROW(I$1:I$997),ROW(I$1:I$997)/ISNUMBER('Měsíční rekapitulace'!$L$1:$L$997),'Měsíční rekapitulace'!$L$1:$L$997)=I$4)*('Měsíční rekapitulace'!$A$3:$A$999=$A134)*TEXT('Měsíční rekapitulace'!$Q$3:$Q$999,\"0,0;0;0;\\0\")))","v":0},{"$f":"IF($A134=\"\",,SUMPRODUCT((LOOKUP(ROW(J$1:J$997),ROW(J$1:J$997)/ISNUMBER('Měsíční rekapitulace'!$L$1:$L$997),'Měsíční rekapitulace'!$L$1:$L$997)=J$4)*('Měsíční rekapitulace'!$A$3:$A$999=$A134)*TEXT('Měsíční rekapitulace'!$Q$3:$Q$999,\"0,0;0;0;\\0\")))","v":0},{"$f":"IF($A134=\"\",,SUMPRODUCT((LOOKUP(ROW(K$1:K$997),ROW(K$1:K$997)/ISNUMBER('Měsíční rekapitulace'!$L$1:$L$997),'Měsíční rekapitulace'!$L$1:$L$997)=K$4)*('Měsíční rekapitulace'!$A$3:$A$999=$A134)*TEXT('Měsíční rekapitulace'!$Q$3:$Q$999,\"0,0;0;0;\\0\")))","v":0},{"$f":"IF($A134=\"\",,SUMPRODUCT((LOOKUP(ROW(L$1:L$997),ROW(L$1:L$997)/ISNUMBER('Měsíční rekapitulace'!$L$1:$L$997),'Měsíční rekapitulace'!$L$1:$L$997)=L$4)*('Měsíční rekapitulace'!$A$3:$A$999=$A134)*TEXT('Měsíční rekapitulace'!$Q$3:$Q$999,\"0,0;0;0;\\0\")))","v":0},{"$f":"IF($A134=\"\",,SUMPRODUCT((LOOKUP(ROW(M$1:M$997),ROW(M$1:M$997)/ISNUMBER('Měsíční rekapitulace'!$L$1:$L$997),'Měsíční rekapitulace'!$L$1:$L$997)=M$4)*('Měsíční rekapitulace'!$A$3:$A$999=$A134)*TEXT('Měsíční rekapitulace'!$Q$3:$Q$999,\"0,0;0;0;\\0\")))","v":0},{"$f":"IF($A134=\"\",,SUMPRODUCT((LOOKUP(ROW(N$1:N$997),ROW(N$1:N$997)/ISNUMBER('Měsíční rekapitulace'!$L$1:$L$997),'Měsíční rekapitulace'!$L$1:$L$997)=N$4)*('Měsíční rekapitulace'!$A$3:$A$999=$A134)*TEXT('Měsíční rekapitulace'!$Q$3:$Q$999,\"0,0;0;0;\\0\")))","v":0},{"$f":"IF($A134=\"\",,SUMPRODUCT((LOOKUP(ROW(O$1:O$997),ROW(O$1:O$997)/ISNUMBER('Měsíční rekapitulace'!$L$1:$L$997),'Měsíční rekapitulace'!$L$1:$L$997)=O$4)*('Měsíční rekapitulace'!$A$3:$A$999=$A134)*TEXT('Měsíční rekapitulace'!$Q$3:$Q$999,\"0,0;0;0;\\0\")))","v":0},0]
[null,null,null,{"$f":"SUM(D6:D49)","v":192.5},162.5,210.5,374,0,0,0,0,0,0,93.5,295,1328]
[]
[]
[null,"Přeřazeno do dodatku"]

{"sheet":"List1","index":2,"n_rows":34,"n_cols":1,"rows_kept":34,"cut":false,"hidden":false,"merged":[]}
[]
[]
[]
["Popisky řádků"]
["Řízení"]
[50.5]
["(prázdné)"]
["\n=SUMIF('Měsíční rekapitulace'!$A$3:$B$10;'Roční rekapitulace'!A8;'Měsíční rekapitulace'!$Q$3:$Q$10)"]
["(prázdné)"]
[49]
["(prázdné)"]
["(prázdné)"]
[47]
["(prázdné)"]
["S-1787"]
["S-1868"]
["S-2109"]
["S-2398"]
["S-2414"]
["S-2422"]
["S-2437"]
["S-2508"]
["S-2546"]
["S-2561"]
["S-2589"]
["S-2628"]
["S-2682"]
["S-2683"]
["S-2685"]
["S-2695"]
["Servis 2015"]
["Servis2015"]
["(prázdné)"]
["Celkový součet"]