{"text_format":"1","workbook":"xlsx","n_sheets":3,"sheets":["EXCEL2.RU (2)","Хайрварин","Реестр инцидентов"],"not_rendered":{"charts":0,"images":0,"macros":1,"external_links":0,"defined_names":13,"comments":0,"pivot_tables":0},"unopened":[],"bounds":{"document_bytes":16777216,"sheet_cells":100000,"rows_first":2000,"rows_last":500,"rows_between":2000,"halvings":0,"cell_chars":16384,"cell_head_chars":4096},"cells_cut":0,"cells_raw":0,"read":"whole","date_system":"1900"}

{"sheet":"EXCEL2.RU (2)","index":0,"n_rows":3,"n_cols":1,"rows_kept":3,"cut":false,"hidden":true,"merged":[[0,0,0,6]]}
["EXCEL2.RU - профессиональные приемы для всех >>>"]
["Хорошая новость! Большинство задач, которые Вы хотите решить с помощью MS EXCEL – уже давно решены! \nНа нашем сайте Вы найдете решения множества из наиболее часто встречающихся задач. Сайт содержит более 500 качественно оформленных статей с файлами примеров."]
["Миссия нашего сайта - превратить Вашу работу в MS EXCEL в приятное времяпрепровождение и ускорить решение Ваших задач. Мы постоянно работаем над содержанием и оформлением нашего сайта и благодарим активных пользователей за поддержку и неоценимую помощь в нашей работе."]

{"sheet":"Хайрварин","index":1,"n_rows":265,"n_cols":14,"rows_kept":265,"cut":false,"hidden":false,"merged":[]}
["Создатель","Номер инцидента","Дата создания","Состояние","Ошибка регистрации","Ошибка подтверждена?","Работа РГ","Апелляция",null,"№","Состав группы из представления","Состав группы","Ошибки","Да"]
[{"$f":"IFERROR(INDEX($L$2:$L$23,ROUNDDOWN((ROW(B3)-3)/12,0)+1),\"\")","v":"Баженова Анастасия Станиславовна"},null,null,null,null,null,null,null,null,1,{"$f":"IFERROR(IF(LEN(L2)-LEN(SUBSTITUTE(L2,\" \",\"\"))=2,MID(TRIM(L2),SEARCH(\" \",TRIM(L2))+1,SEARCH(\" \",TRIM(L2),SEARCH(\" \",TRIM(L2))+1)-SEARCH(\" \",TRIM(L2))-1)&\" \"&MID(TRIM(L2),1,SEARCH(\" \",TRIM(L2))-1),MID(TRIM(L2),SEARCH(\" \",TRIM(L2))+1,LEN(TRIM(L2))-SEARCH(\" \",TRIM(L2)))&\" \"&MID(TRIM(L2),1,SEARCH(\" \",TRIM(L2))-1)),0)","v":"Анастасия Баженова"},"Баженова Анастасия Станиславовна",{"$f":"COUNTIF(A:A,K2)","v":1},"Нет"]
[{"$f":"IFERROR(INDEX('Реестр инцидентов'!$A$4:$P$171,MATCH(INDEX($K$2:$K$24,ROUNDDOWN((ROW(B3)-3)/12,0)+1)&1,'Реестр инцидентов'!$Q$4:$Q$171,0),MATCH(A$1,'Реестр инцидентов'!$A$3:$Q$3,0)),\"\")","v":"Анастасия Баженова"},{"$f":"IFERROR(INDEX('Реестр инцидентов'!$A$4:$P$171,MATCH(INDEX($K$2:$K$24,ROUNDDOWN((ROW(C3)-3)/12,0)+1)&1,'Реестр инцидентов'!$Q$4:$Q$171,0),MATCH(B$1,'Реестр инцидентов'!$A$3:$Q$3,0)),\"\")","v":"150701/3.1"},{"$f":"IFERROR(INDEX('Реестр инцидентов'!$A$4:$P$171,MATCH(INDEX($K$2:$K$24,ROUNDDOWN((ROW(D3)-3)/12,0)+1)&1,'Реестр инцидентов'!$Q$4:$Q$171,0),MATCH(C$1,'Реестр инцидентов'!$A$3:$Q$3,0)),\"\")","v":"2015-07-01T01:11:36"},{"$f":"IFERROR(INDEX('Реестр инцидентов'!$A$4:$P$171,MATCH(INDEX($K$2:$K$24,ROUNDDOWN((ROW(E3)-3)/12,0)+1)&1,'Реестр инцидентов'!$Q$4:$Q$171,0),MATCH(D$1,'Реестр инцидентов'!$A$3:$Q$3,0)),\"\")","v":"Разрешено"},{"$f":"IFERROR(INDEX('Реестр инцидентов'!$A$4:$P$171,MATCH(INDEX($K$2:$K$24,ROUNDDOWN((ROW(F3)-3)/12,0)+1)&1,'Реестр инцидентов'!$Q$4:$Q$171,0),MATCH(E$1,'Реестр инцидентов'!$A$3:$Q$3,0)),\"\")","v":"Некорректный контакт"},null,null,null,null,2,{"$f":"IFERROR(IF(LEN(L3)-LEN(SUBSTITUTE(L3,\" \",\"\"))=2,MID(TRIM(L3),SEARCH(\" \",TRIM(L3))+1,SEARCH(\" \",TRIM(L3),SEARCH(\" \",TRIM(L3))+1)-SEARCH(\" \",TRIM(L3))-1)&\" \"&MID(TRIM(L3),1,SEARCH(\" \",TRIM(L3))-1),MID(TRIM(L3),SEARCH(\" \",TRIM(L3))+1,LEN(TRIM(L3))-SEARCH(\" \",TRIM(L3)))&\" \"&MID(TRIM(L3),1,SEARCH(\" \",TRIM(L3))-1)),0)","v":"Александр Балабанов"},"Балабанов Александр Леонидович",{"$f":"COUNTIF(A:A,K3)","v":1},"Проработано"]
[{"$f":"IFERROR(INDEX('Реестр инцидентов'!$A$4:$P$171,MATCH(INDEX($K$2:$K$24,ROUNDDOWN((ROW(B4)-3)/12,0)+1)&2,'Реестр инцидентов'!$Q$4:$Q$171,0),MATCH(A$1,'Реестр инцидентов'!$A$3:$Q$3,0)),\"\")","v":""},{"$f":"IFERROR(INDEX('Реестр инцидентов'!$A$4:$P$171,MATCH(INDEX($K$2:$K$24,ROUNDDOWN((ROW(C4)-3)/12,0)+1)&2,'Реестр инцидентов'!$Q$4:$Q$171,0),MATCH(B$1,'Реестр инцидентов'!$A$3:$Q$3,0)),\"\")","v":""},{"$f":"IFERROR(INDEX('Реестр инцидентов'!$A$4:$P$171,MATCH(INDEX($K$2:$K$24,ROUNDDOWN((ROW(D4)-3)/12,0)+1)&2,'Реестр инцидентов'!$Q$4:$Q$171,0),MATCH(C$1,'Реестр инцидентов'!$A$3:$Q$3,0)),\"\")","v":""},{"$f":"IFERROR(INDEX('Реестр инцидентов'!$A$4:$P$171,MATCH(INDEX($K$2:$K$24,ROUNDDOWN((ROW(E4)-3)/12,0)+1)&2,'Реестр инцидентов'!$Q$4:$Q$171,0),MATCH(D$1,'Реестр инцидентов'!$A$3:$Q$3,0)),\"\")","v":""},{"$f":"IFERROR(INDEX('Реестр инцидентов'!$A$4:$P$171,MATCH(INDEX($K$2:$K$24,ROUNDDOWN((ROW(F4)-3)/12,0)+1)&2,'Реестр инцидентов'!$Q$4:$Q$171,0),MATCH(E$1,'Реестр инцидентов'!$A$3:$Q$3,0)),\"\")","v":""},null,null,null,null,3,"Дмитрий Балабанов","Балабанов Дмитрий Сергеевич",{"$f":"COUNTIF(A:A,K4)","v":0},"Не проработано"]
[{"$f":"IFERROR(INDEX('Реестр инцидентов'!$A$4:$P$171,MATCH(INDEX($K$2:$K$24,ROUNDDOWN((ROW(B5)-3)/12,0)+1)&3,'Реестр инцидентов'!$Q$4:$Q$171,0),MATCH(A$1,'Реестр инцидентов'!$A$3:$Q$3,0)),\"\")","v":""},{"$f":"IFERROR(INDEX('Реестр инцидентов'!$A$4:$P$171,MATCH(INDEX($K$2:$K$24,ROUNDDOWN((ROW(C5)-3)/12,0)+1)&3,'Реестр инцидентов'!$Q$4:$Q$171,0),MATCH(B$1,'Реестр инцидентов'!$A$3:$Q$3,0)),\"\")","v":""},{"$f":"IFERROR(INDEX('Реестр инцидентов'!$A$4:$P$171,MATCH(INDEX($K$2:$K$24,ROUNDDOWN((ROW(D5)-3)/12,0)+1)&3,'Реестр инцидентов'!$Q$4:$Q$171,0),MATCH(C$1,'Реестр инцидентов'!$A$3:$Q$3,0)),\"\")","v":""},{"$f":"IFERROR(INDEX('Реестр инцидентов'!$A$4:$P$171,MATCH(INDEX($K$2:$K$24,ROUNDDOWN((ROW(E5)-3)/12,0)+1)&3,'Реестр инцидентов'!$Q$4:$Q$171,0),MATCH(D$1,'Реестр инцидентов'!$A$3:$Q$3,0)),\"\")","v":""},{"$f":"IFERROR(INDEX('Реестр инцидентов'!$A$4:$P$171,MATCH(INDEX($K$2:$K$24,ROUNDDOWN((ROW(F5)-3)/12,0)+1)&3,'Реестр инцидентов'!$Q$4:$Q$171,0),MATCH(E$1,'Реестр инцидентов'!$A$3:$Q$3,0)),\"\")","v":""},null,null,null,null,4,"Алексей Василевский","Василевский Алексей Вадимович",{"$f":"COUNTIF(A:A,K5)","v":0}]
[{"$f":"IFERROR(INDEX('Реестр инцидентов'!$A$4:$P$171,MATCH(INDEX($K$2:$K$24,ROUNDDOWN((ROW(B6)-3)/12,0)+1)&4,'Реестр инцидентов'!$Q$4:$Q$171,0),MATCH(A$1,'Реестр инцидентов'!$A$3:$Q$3,0)),\"\")","v":""},{"$f":"IFERROR(INDEX('Реестр инцидентов'!$A$4:$P$171,MATCH(INDEX($K$2:$K$24,ROUNDDOWN((ROW(C6)-3)/12,0)+1)&4,'Реестр инцидентов'!$Q$4:$Q$171,0),MATCH(B$1,'Реестр инцидентов'!$A$3:$Q$3,0)),\"\")","v":""},{"$f":"IFERROR(INDEX('Реестр инцидентов'!$A$4:$P$171,MATCH(INDEX($K$2:$K$24,ROUNDDOWN((ROW(D6)-3)/12,0)+1)&4,'Реестр инцидентов'!$Q$4:$Q$171,0),MATCH(C$1,'Реестр инцидентов'!$A$3:$Q$3,0)),\"\")","v":""},{"$f":"IFERROR(INDEX('Реестр инцидентов'!$A$4:$P$171,MATCH(INDEX($K$2:$K$24,ROUNDDOWN((ROW(E6)-3)/12,0)+1)&4,'Реестр инцидентов'!$Q$4:$Q$171,0),MATCH(D$1,'Реестр инцидентов'!$A$3:$Q$3,0)),\"\")","v":""},{"$f":"IFERROR(INDEX('Реестр инцидентов'!$A$4:$P$171,MATCH(INDEX($K$2:$K$24,ROUNDDOWN((ROW(F6)-3)/12,0)+1)&4,'Реестр инцидентов'!$Q$4:$Q$171,0),MATCH(E$1,'Реестр инцидентов'!$A$3:$Q$3,0)),\"\")","v":""},null,null,null,null,5,"Дмитрий Галузо","Галузо Дмитрий Игоревич",{"$f":"COUNTIF(A:A,K6)","v":1}]
[{"$f":"IFERROR(INDEX('Реестр инцидентов'!$A$4:$P$171,MATCH(INDEX($K$2:$K$24,ROUNDDOWN((ROW(B7)-3)/12,0)+1)&5,'Реестр инцидентов'!$Q$4:$Q$171,0),MATCH(A$1,'Реестр инцидентов'!$A$3:$Q$3,0)),\"\")","v":""},{"$f":"IFERROR(INDEX('Реестр инцидентов'!$A$4:$P$171,MATCH(INDEX($K$2:$K$24,ROUNDDOWN((ROW(C7)-3)/12,0)+1)&5,'Реестр инцидентов'!$Q$4:$Q$171,0),MATCH(B$1,'Реестр инцидентов'!$A$3:$Q$3,0)),\"\")","v":""},{"$f":"IFERROR(INDEX('Реестр инцидентов'!$A$4:$P$171,MATCH(INDEX($K$2:$K$24,ROUNDDOWN((ROW(D7)-3)/12,0)+1)&5,'Реестр инцидентов'!$Q$4:$Q$171,0),MATCH(C$1,'Реестр инцидентов'!$A$3:$Q$3,0)),\"\")","v":""},{"$f":"IFERROR(INDEX('Реестр инцидентов'!$A$4:$P$171,MATCH(INDEX($K$2:$K$24,ROUNDDOWN((ROW(E7)-3)/12,0)+1)&5,'Реестр инцидентов'!$Q$4:$Q$171,0),MATCH(D$1,'Реестр инцидентов'!$A$3:$Q$3,0)),\"\")","v":""},{"$f":"IFERROR(INDEX('Реестр инцидентов'!$A$4:$P$171,MATCH(INDEX($K$2:$K$24,ROUNDDOWN((ROW(F7)-3)/12,0)+1)&5,'Реестр инцидентов'!$Q$4:$Q$171,0),MATCH(E$1,'Реестр инцидентов'!$A$3:$Q$3,0)),\"\")","v":""},null,null,null,null,6,"Динара Гериева","Гериева Динара Барасбиевна",{"$f":"COUNTIF(A:A,K7)","v":0}]
[{"$f":"IFERROR(INDEX('Реестр инцидентов'!$A$4:$P$171,MATCH(INDEX($K$2:$K$24,ROUNDDOWN((ROW(B8)-3)/12,0)+1)&6,'Реестр инцидентов'!$Q$4:$Q$171,0),MATCH(A$1,'Реестр инцидентов'!$A$3:$Q$3,0)),\"\")","v":""},{"$f":"IFERROR(INDEX('Реестр инцидентов'!$A$4:$P$171,MATCH(INDEX($K$2:$K$24,ROUNDDOWN((ROW(C8)-3)/12,0)+1)&6,'Реестр инцидентов'!$Q$4:$Q$171,0),MATCH(B$1,'Реестр инцидентов'!$A$3:$Q$3,0)),\"\")","v":""},{"$f":"IFERROR(INDEX('Реестр инцидентов'!$A$4:$P$171,MATCH(INDEX($K$2:$K$24,ROUNDDOWN((ROW(D8)-3)/12,0)+1)&6,'Реестр инцидентов'!$Q$4:$Q$171,0),MATCH(C$1,'Реестр инцидентов'!$A$3:$Q$3,0)),\"\")","v":""},{"$f":"IFERROR(INDEX('Реестр инцидентов'!$A$4:$P$171,MATCH(INDEX($K$2:$K$24,ROUNDDOWN((ROW(E8)-3)/12,0)+1)&6,'Реестр инцидентов'!$Q$4:$Q$171,0),MATCH(D$1,'Реестр инцидентов'!$A$3:$Q$3,0)),\"\")","v":""},{"$f":"IFERROR(INDEX('Реестр инцидентов'!$A$4:$P$171,MATCH(INDEX($K$2:$K$24,ROUNDDOWN((ROW(F8)-3)/12,0)+1)&6,'Реестр инцидентов'!$Q$4:$Q$171,0),MATCH(E$1,'Реестр инцидентов'!$A$3:$Q$3,0)),\"\")","v":""},null,null,null,null,7,"Зульфия Гериева","Гериева Зульфия Барасбиевна",{"$f":"COUNTIF(A:A,K8)","v":0}]
[{"$f":"IFERROR(INDEX('Реестр инцидентов'!$A$4:$P$171,MATCH(INDEX($K$2:$K$24,ROUNDDOWN((ROW(B9)-3)/12,0)+1)&7,'Реестр инцидентов'!$Q$4:$Q$171,0),MATCH(A$1,'Реестр инцидентов'!$A$3:$Q$3,0)),\"\")","v":""},{"$f":"IFERROR(INDEX('Реестр инцидентов'!$A$4:$P$171,MATCH(INDEX($K$2:$K$24,ROUNDDOWN((ROW(C9)-3)/12,0)+1)&7,'Реестр инцидентов'!$Q$4:$Q$171,0),MATCH(B$1,'Реестр инцидентов'!$A$3:$Q$3,0)),\"\")","v":""},{"$f":"IFERROR(INDEX('Реестр инцидентов'!$A$4:$P$171,MATCH(INDEX($K$2:$K$24,ROUNDDOWN((ROW(D9)-3)/12,0)+1)&7,'Реестр инцидентов'!$Q$4:$Q$171,0),MATCH(C$1,'Реестр инцидентов'!$A$3:$Q$3,0)),\"\")","v":""},{"$f":"IFERROR(INDEX('Реестр инцидентов'!$A$4:$P$171,MATCH(INDEX($K$2:$K$24,ROUNDDOWN((ROW(E9)-3)/12,0)+1)&7,'Реестр инцидентов'!$Q$4:$Q$171,0),MATCH(D$1,'Реестр инцидентов'!$A$3:$Q$3,0)),\"\")","v":""},{"$f":"IFERROR(INDEX('Реестр инцидентов'!$A$4:$P$171,MATCH(INDEX($K$2:$K$24,ROUNDDOWN((ROW(F9)-3)/12,0)+1)&7,'Реестр инцидентов'!$Q$4:$Q$171,0),MATCH(E$1,'Реестр инцидентов'!$A$3:$Q$3,0)),\"\")","v":""},null,null,null,null,8,"Владислав Гончаров","Гончаров Владислав Андреевич",{"$f":"COUNTIF(A:A,K9)","v":3}]
[{"$f":"IFERROR(INDEX('Реестр инцидентов'!$A$4:$P$171,MATCH(INDEX($K$2:$K$24,ROUNDDOWN((ROW(B10)-3)/12,0)+1)&8,'Реестр инцидентов'!$Q$4:$Q$171,0),MATCH(A$1,'Реестр инцидентов'!$A$3:$Q$3,0)),\"\")","v":""},{"$f":"IFERROR(INDEX('Реестр инцидентов'!$A$4:$P$171,MATCH(INDEX($K$2:$K$24,ROUNDDOWN((ROW(C10)-3)/12,0)+1)&8,'Реестр инцидентов'!$Q$4:$Q$171,0),MATCH(B$1,'Реестр инцидентов'!$A$3:$Q$3,0)),\"\")","v":""},{"$f":"IFERROR(INDEX('Реестр инцидентов'!$A$4:$P$171,MATCH(INDEX($K$2:$K$24,ROUNDDOWN((ROW(D10)-3)/12,0)+1)&8,'Реестр инцидентов'!$Q$4:$Q$171,0),MATCH(C$1,'Реестр инцидентов'!$A$3:$Q$3,0)),\"\")","v":""},{"$f":"IFERROR(INDEX('Реестр инцидентов'!$A$4:$P$171,MATCH(INDEX($K$2:$K$24,ROUNDDOWN((ROW(E10)-3)/12,0)+1)&8,'Реестр инцидентов'!$Q$4:$Q$171,0),MATCH(D$1,'Реестр инцидентов'!$A$3:$Q$3,0)),\"\")","v":""},{"$f":"IFERROR(INDEX('Реестр инцидентов'!$A$4:$P$171,MATCH(INDEX($K$2:$K$24,ROUNDDOWN((ROW(F10)-3)/12,0)+1)&8,'Реестр инцидентов'!$Q$4:$Q$171,0),MATCH(E$1,'Реестр инцидентов'!$A$3:$Q$3,0)),\"\")","v":""},null,null,null,null,9,"Андрей Демченко","Демченко Андрей Олегович",{"$f":"COUNTIF(A:A,K10)","v":0}]
[{"$f":"IFERROR(INDEX('Реестр инцидентов'!$A$4:$P$171,MATCH(INDEX($K$2:$K$24,ROUNDDOWN((ROW(B11)-3)/12,0)+1)&9,'Реестр инцидентов'!$Q$4:$Q$171,0),MATCH(A$1,'Реестр инцидентов'!$A$3:$Q$3,0)),\"\")","v":""},{"$f":"IFERROR(INDEX('Реестр инцидентов'!$A$4:$P$171,MATCH(INDEX($K$2:$K$24,ROUNDDOWN((ROW(C11)-3)/12,0)+1)&9,'Реестр инцидентов'!$Q$4:$Q$171,0),MATCH(B$1,'Реестр инцидентов'!$A$3:$Q$3,0)),\"\")","v":""},{"$f":"IFERROR(INDEX('Реестр инцидентов'!$A$4:$P$171,MATCH(INDEX($K$2:$K$24,ROUNDDOWN((ROW(D11)-3)/12,0)+1)&9,'Реестр инцидентов'!$Q$4:$Q$171,0),MATCH(C$1,'Реестр инцидентов'!$A$3:$Q$3,0)),\"\")","v":""},{"$f":"IFERROR(INDEX('Реестр инцидентов'!$A$4:$P$171,MATCH(INDEX($K$2:$K$24,ROUNDDOWN((ROW(E11)-3)/12,0)+1)&9,'Реестр инцидентов'!$Q$4:$Q$171,0),MATCH(D$1,'Реестр инцидентов'!$A$3:$Q$3,0)),\"\")","v":""},{"$f":"IFERROR(INDEX('Реестр инцидентов'!$A$4:$P$171,MATCH(INDEX($K$2:$K$24,ROUNDDOWN((ROW(F11)-3)/12,0)+1)&9,'Реестр инцидентов'!$Q$4:$Q$171,0),MATCH(E$1,'Реестр инцидентов'!$A$3:$Q$3,0)),\"\")","v":""},null,null,null,null,10,"Иван Долгов","Долгов Иван Андреевич",{"$f":"COUNTIF(A:A,K11)","v":1}]
[{"$f":"IFERROR(INDEX('Реестр инцидентов'!$A$4:$P$171,MATCH(INDEX($K$2:$K$24,ROUNDDOWN((ROW(B12)-3)/12,0)+1)&10,'Реестр инцидентов'!$Q$4:$Q$171,0),MATCH(A$1,'Реестр инцидентов'!$A$3:$Q$3,0)),\"\")","v":""},{"$f":"IFERROR(INDEX('Реестр инцидентов'!$A$4:$P$171,MATCH(INDEX($K$2:$K$24,ROUNDDOWN((ROW(C12)-3)/12,0)+1)&10,'Реестр инцидентов'!$Q$4:$Q$171,0),MATCH(B$1,'Реестр инцидентов'!$A$3:$Q$3,0)),\"\")","v":""},{"$f":"IFERROR(INDEX('Реестр инцидентов'!$A$4:$P$171,MATCH(INDEX($K$2:$K$24,ROUNDDOWN((ROW(D12)-3)/12,0)+1)&10,'Реестр инцидентов'!$Q$4:$Q$171,0),MATCH(C$1,'Реестр инцидентов'!$A$3:$Q$3,0)),\"\")","v":""},{"$f":"IFERROR(INDEX('Реестр инцидентов'!$A$4:$P$171,MATCH(INDEX($K$2:$K$24,ROUNDDOWN((ROW(E12)-3)/12,0)+1)&10,'Реестр инцидентов'!$Q$4:$Q$171,0),MATCH(D$1,'Реестр инцидентов'!$A$3:$Q$3,0)),\"\")","v":""},{"$f":"IFERROR(INDEX('Реестр инцидентов'!$A$4:$P$171,MATCH(INDEX($K$2:$K$24,ROUNDDOWN((ROW(F12)-3)/12,0)+1)&10,'Реестр инцидентов'!$Q$4:$Q$171,0),MATCH(E$1,'Реестр инцидентов'!$A$3:$Q$3,0)),\"\")","v":""},null,null,null,null,11,"Вячеслав Иванов","Иванов Вячеслав Алексеевич",{"$f":"COUNTIF(A:A,K12)","v":1}]
[{"$f":"IFERROR(INDEX('Реестр инцидентов'!$A$4:$P$171,MATCH(INDEX($K$2:$K$24,ROUNDDOWN((ROW(B13)-3)/12,0)+1)&11,'Реестр инцидентов'!$Q$4:$Q$171,0),MATCH(A$1,'Реестр инцидентов'!$A$3:$Q$3,0)),\"\")","v":""},{"$f":"IFERROR(INDEX('Реестр инцидентов'!$A$4:$P$171,MATCH(INDEX($K$2:$K$24,ROUNDDOWN((ROW(C13)-3)/12,0)+1)&11,'Реестр инцидентов'!$Q$4:$Q$171,0),MATCH(B$1,'Реестр инцидентов'!$A$3:$Q$3,0)),\"\")","v":""},{"$f":"IFERROR(INDEX('Реестр инцидентов'!$A$4:$P$171,MATCH(INDEX($K$2:$K$24,ROUNDDOWN((ROW(D13)-3)/12,0)+1)&11,'Реестр инцидентов'!$Q$4:$Q$171,0),MATCH(C$1,'Реестр инцидентов'!$A$3:$Q$3,0)),\"\")","v":""},{"$f":"IFERROR(INDEX('Реестр инцидентов'!$A$4:$P$171,MATCH(INDEX($K$2:$K$24,ROUNDDOWN((ROW(E13)-3)/12,0)+1)&11,'Реестр инцидентов'!$Q$4:$Q$171,0),MATCH(D$1,'Реестр инцидентов'!$A$3:$Q$3,0)),\"\")","v":""},{"$f":"IFERROR(INDEX('Реестр инцидентов'!$A$4:$P$171,MATCH(INDEX($K$2:$K$24,ROUNDDOWN((ROW(F13)-3)/12,0)+1)&11,'Реестр инцидентов'!$Q$4:$Q$171,0),MATCH(E$1,'Реестр инцидентов'!$A$3:$Q$3,0)),\"\")","v":""},null,null,null,null,12,"Михаил Иванов","Иванов Михаил Алексеевич",{"$f":"COUNTIF(A:A,K13)","v":0}]
[{"$f":"IFERROR(INDEX($L$2:$L$23,ROUNDDOWN((ROW(B15)-3)/12,0)+1),\"\")","v":"Балабанов Александр Леонидович"},null,null,null,null,null,null,null,null,13,"Никита Иванюк","Иванюк Никита Романович",{"$f":"COUNTIF(A:A,K14)","v":2}]
[{"$f":"IFERROR(INDEX('Реестр инцидентов'!$A$4:$P$171,MATCH(INDEX($K$2:$K$24,ROUNDDOWN((ROW(B15)-3)/12,0)+1)&1,'Реестр инцидентов'!$Q$4:$Q$171,0),MATCH(A$1,'Реестр инцидентов'!$A$3:$Q$3,0)),\"\")","v":"Александр Балабанов"},{"$f":"IFERROR(INDEX('Реестр инцидентов'!$A$4:$P$171,MATCH(INDEX($K$2:$K$24,ROUNDDOWN((ROW(C15)-3)/12,0)+1)&1,'Реестр инцидентов'!$Q$4:$Q$171,0),MATCH(B$1,'Реестр инцидентов'!$A$3:$Q$3,0)),\"\")","v":"150715/3752.1"},{"$f":"IFERROR(INDEX('Реестр инцидентов'!$A$4:$P$171,MATCH(INDEX($K$2:$K$24,ROUNDDOWN((ROW(D15)-3)/12,0)+1)&1,'Реестр инцидентов'!$Q$4:$Q$171,0),MATCH(C$1,'Реестр инцидентов'!$A$3:$Q$3,0)),\"\")","v":"2015-07-15T18:06:31"},{"$f":"IFERROR(INDEX('Реестр инцидентов'!$A$4:$P$171,MATCH(INDEX($K$2:$K$24,ROUNDDOWN((ROW(E15)-3)/12,0)+1)&1,'Реестр инцидентов'!$Q$4:$Q$171,0),MATCH(D$1,'Реестр инцидентов'!$A$3:$Q$3,0)),\"\")","v":"Разрешено"},{"$f":"IFERROR(INDEX('Реестр инцидентов'!$A$4:$P$171,MATCH(INDEX($K$2:$K$24,ROUNDDOWN((ROW(F15)-3)/12,0)+1)&1,'Реестр инцидентов'!$Q$4:$Q$171,0),MATCH(E$1,'Реестр инцидентов'!$A$3:$Q$3,0)),\"\")","v":"Некорректное описание"},null,null,null,null,14,"Александр Карев","Карев Александр Витальевич",{"$f":"COUNTIF(A:A,K15)","v":2}]
{"$rows_left_out":251}
{"sheet":"Реестр инцидентов","index":2,"n_rows":171,"n_cols":17,"rows_kept":171,"cut":false,"hidden":false,"merged":[]}
[]
["Реестр некорректно зарегистрированных инцидентов"]
["Номер инцидента",null,null,"Дата создания",null,"Состояние",null,"Создатель",null,null,null,"Отдел создавшего",null,null,null,"Ошибка регистрации"]
["150701/3.1",null,null,"2015-07-01T01:11:36",null,"Разрешено",null,"Анастасия Баженова",null,null,null,"Отдел поддержки клиентов",null,null,null,"Некорректный контакт",{"$f":"H4&COUNTIF($H$4:H4,H4)","v":"Анастасия Баженова1"}]
["150701/254.1",null,null,"2015-07-01T11:18:16",null,"Разрешено",null,"Александр Захаров",null,null,null,"Отдел поддержки клиентов",null,null,null,"Отсутствие файлов",{"$f":"H5&COUNTIF($H$4:H5,H5)","v":"Александр Захаров1"}]
["150701/272.2",null,null,"2015-07-01T11:23:39",null,"Разрешено",null,"Дарья Ревина",null,null,null,"Отдел поддержки клиентов",null,null,null,"Отсутствие файлов",{"$f":"H6&COUNTIF($H$4:H6,H6)","v":"Дарья Ревина1"}]
["150701/444.1",null,null,"2015-07-01T11:54:49",null,"Разрешено",null,"Александр Захаров",null,null,null,"Отдел поддержки клиентов",null,null,null,"Отсутствие файлов",{"$f":"H7&COUNTIF($H$4:H7,H7)","v":"Александр Захаров2"}]
["150701/479.1",null,null,"2015-07-01T11:59:26",null,"Разрешено",null,"Александр Захаров",null,null,null,"Отдел поддержки клиентов",null,null,null,"Неправомерный перевод",{"$f":"H8&COUNTIF($H$4:H8,H8)","v":"Александр Захаров3"}]
["150701/513.1",null,null,"2015-07-01T12:05:12",null,"Разрешено",null,"Александр Захаров",null,null,null,"Отдел поддержки клиентов",null,null,null,"Отсутствие файлов",{"$f":"H9&COUNTIF($H$4:H9,H9)","v":"Александр Захаров4"}]
["150701/549.1",null,null,"2015-07-01T12:11:48",null,"Разрешено",null,"Игорь Рысенков",null,null,null,"Отдел поддержки клиентов",null,null,null,"Некорректный контакт",{"$f":"H10&COUNTIF($H$4:H10,H10)","v":"Игорь Рысенков1"}]
["150701/600.1",null,null,"2015-07-01T12:21:47",null,"Разрешено",null,"Кирилл Червяков",null,null,null,"Отдел поддержки клиентов",null,null,null,"Некорректный контакт",{"$f":"H11&COUNTIF($H$4:H11,H11)","v":"Кирилл Червяков1"}]
["150701/659.1",null,null,"2015-07-01T12:32:11",null,"Разрешено",null,"Денис Аманов",null,null,null,"Отдел поддержки клиентов",null,null,null,"Есть сценарий",{"$f":"H12&COUNTIF($H$4:H12,H12)","v":"Денис Аманов1"}]
["150701/764.1",null,null,"2015-07-01T12:51:20",null,"Разрешено",null,"Михаил Карпухин",null,null,null,"Отдел поддержки клиентов",null,null,null,"Отсутствие файлов",{"$f":"H13&COUNTIF($H$4:H13,H13)","v":"Михаил Карпухин1"}]
["150701/835.2",null,null,"2015-07-01T13:07:48",null,"Разрешено",null,"Кирилл Оськин",null,null,null,"Отдел поддержки клиентов",null,null,null,"Некорректный контакт",{"$f":"H14&COUNTIF($H$4:H14,H14)","v":"Кирилл Оськин1"}]
["150701/1056.1",null,null,"2015-07-01T13:45:44",null,"Разрешено",null,"Владислав Гончаров",null,null,null,"Отдел поддержки клиентов",null,null,null,"Некорректный контакт",{"$f":"H15&COUNTIF($H$4:H15,H15)","v":"Владислав Гончаров1"}]
{"$rows_left_out":156}