{"text_format":"1","workbook":"xlsx","n_sheets":3,"sheets":["инфо","счет","Лист3"],"not_rendered":{"charts":0,"images":0,"macros":1,"external_links":0,"defined_names":0,"comments":0,"pivot_tables":0},"unopened":[],"bounds":{"document_bytes":16777216,"sheet_cells":100000,"rows_first":2000,"rows_last":500,"rows_between":2000,"halvings":0,"cell_chars":16384,"cell_head_chars":4096},"cells_cut":0,"cells_raw":0,"read":"whole","date_system":"1900"}

{"sheet":"инфо","index":0,"n_rows":351,"n_cols":12,"rows_kept":351,"cut":false,"hidden":false,"merged":[[1,1,2,5]]}
["№ п/п","№ счёта","Дата","Наименование заказчика","ИНН","Сумма (руб.)","Вид услуг","Наименование системы сертификации","Стандарт","Расход","Прибыль","Эксперт"]
[null,"ПРИМЕРЫ СЧЕТОВ",null,null,null,null,"Оказание информационно-консультацонных услуг по договору № М-00001 от 06 августа 2010 г.,  НДС не облагается"]
[null,null,null,null,null,null,"Оказание юридических услуг по договору № М-0001/1 от 06 августа 2010 г.,  НДС не облагается"]
[1,null,null,null,null,null,"Проведение обязательного ежегодного инспекционного контроля системы менеджмента качества в системе добровольной сертификации \"Стандарт-Гарант\", НДС не облагается"]
[2,null,null,null,null,null,"Сертификация системы менеджмента качества  в системе добровольной сертификации \"Стандарт Гарант\" на соответствие стандарту ГОСТ Р ИСО 9001-2008 (ISO 9001:2008), НДС не облагается"]
[3,null,null,null,null,null,"Сертификация системы менеджмента качества  в системе добровольной сертификации Стандарт Гарант на соответствие стандарту ГОСТ Р ИСО 14001-2007 (ISO 14001:2007) , НДС не облагается"]
[4,null,null,null,null,null,"Сертификация системы  управления охраной труда в системе добровольной сертификации «Стандарт – Гарант» на соответствие стандарту ГОСТ Р ИСО 12.0.230-2007 (OHSAS 18001:2007), НДС не облагается"]
[5,null,null,null,null,null,"Смена бланка сертификата  в системе добровольной сертификации Стандарт Гарант на соответствие стандарту ГОСТ Р ИСО 14001-2007 (ISO 14001:2004), НДС не облагается"]
[6,null,null,null,null,null,"Смена бланка сертификата  в системе добровольной сертификации Стандарт Гарант на соответствие стандарту ГОСТ ISO  9001-2011 (ISO 9001:2008) , ГОСТ Р ИСО 14001-2007 (ISO 14001:2004) , ГОСТ Р ИСО 14001-2007 (ISO 14001:2004), разрешение на применение знака соответствия, НДС не облагается"]
[7,null,null,null,null,null,"Оказание информационно-консультационных услуг по вопросу получения лицензии Министерства культуры, по договору № М-0001 от 17 октября 2012 г., НДС не облагается."]
[8,null,null,null,null,null,"Оказание информационно-консультационных услуг по вопросу получения лицензии Министерства чрезвычайных ситуаций по договору № М-0001 от 24 сентября 2012 г., НДС не облагается."]
[9,"П-0001","2015-08-21","ООО \"РСК\"",7719864549,1,"Оказание информационно-консультационных услуг по вопросу получения лицензии МЧС, по договору № П-0001 от 21 августа 2015 года, НДС не облагается","обучение","обучение",1,{"$f":"F12-J12","v":0}]
[10]
[11]
[12]
[13]
[14]
[15]
[16]
[17]
[18]
[19]
[20]
[21]
[22]
[23]
[24]
[25]
[26]
[27]
[28]
[29]
[30]
[31]
[32]
[33]
[34]
[35]
[36]
[37]
[38]
[39]
[40]
[41]
[42]
[43]
[44]
[45]
[46]
[47]
[48]
[49]
[50]
[51]
[52]
[53]
[54]
[55]
[56]
[57]
[58]
[59]
[60]
[61]
[62]
[63]
[64]
[65]
[66]
[67]
[68]
[69]
[70]
[71]
[72]
[73]
[74]
[75]
[76]
[77]
[78]
[79]
[80]
[81]
[82]
[83]
[84]
[85]
[86]
[87]
[88]
[89]
[90]
[91]
[92]
[93]
[94]
[95]
[96]
[97]
[98]
[99]
[100]
[101]
[102]
[103]
[104]
[105]
[106]
[107]
[108]
[109]
[110]
[111]
[112]
[113]
[114]
[115]
[116]
[117]
[118]
[119]
[120]
[121]
[122]
[123]
[124]
[125]
[126]
[127]
[128]
[129]
[130]
[131]
[132]
[133]
[134]
[135]
[136]
[137]
[138]
[139]
[140]
[141]
[142]
[143]
[144]
[145]
[146]
[147]
[148]
[149]
[150]
[151]
[152]
[153]
[154]
[155]
[156]
[157]
[158]
[159]
[160]
[161]
[162]
[163]
[164]
[165]
[166]
[167]
[168]
[169]
[170]
[171]
[172]
[173]
[174]
[175]
[176]
[177]
[178]
[179]
[180]
[181]
[182]
[183]
[184]
[185]
[186]
[187]
[188]
[189]
[190]
[191]
[192]
[193]
[194]
[195]
[196]
[197]
[198]
[199]
[200]
[201]
[202]
[203]
[204]
[205]
[206]
[207]
[208]
[209]
[210]
[211]
[212]
[213]
[214]
[215]
[216]
[217]
[218]
[219]
[220]
[221]
[222]
[223]
[224]
[225]
[226]
[227]
[228]
[229]
[230]
[231]
[232]
[233]
[234]
[235]
[236]
[237]
[238]
[239]
[240]
[241]
[242]
[243]
[244]
[245]
[246]
[247]
[248]
[249]
[250]
[251]
[252]
[253]
[254]
[255]
[256]
[257]
[258]
[259]
[260]
[261]
[262]
[263]
[264]
[265]
[266]
[267]
[268]
[269]
[270]
[271]
[272]
[273]
[274]
[275]
[276]
[277]
[278]
[279]
[280]
[281]
[282]
[283]
[284]
[285]
[286]
[287]
[288]
[289]
[290]
[291]
[292]
[293]
[294]
[295]
[296]
[297]
[298]
[299]
[300]
[301]
[302]
[303]
[304]
[305]
[306]
[307]
[308]
[309]
[310]
[311]
[312]
[313]
[314]
[315]
[316]
[317]
[318]
[319]
[320]
[321]
[322]
[323]
[324]
[325]
[326]
[327]
[328]
[329]
[330]
[331]
[332]
[333]
[334]
[335]
[336]
[337]
[338]
[339]
[340]
[341]
[342]
[343]
[344]
[345]
[346]
[347]
[348]

{"sheet":"счет","index":1,"n_rows":42,"n_cols":13,"rows_kept":42,"cut":false,"hidden":false,"merged":[[0,0,0,2],[10,9,10,10],[11,9,11,10],[1,3,1,9],[3,0,3,10],[7,0,7,3],[7,5,7,6],[7,7,9,8],[7,9,9,10],[8,0,8,6],[18,1,18,5],[19,1,20,5],[9,0,9,6],[10,0,10,6],[11,0,11,6],[18,6,18,7],[19,6,20,7],[10,7,10,8],[11,7,11,8],[13,8,13,9],[15,0,15,2],[16,0,16,2],[15,3,15,9],[16,3,16,9],[19,8,20,8],[19,9,20,9],[19,10,20,10],[41,4,41,9],[25,5,25,6],[26,0,26,6],[25,0,25,4],[31,0,31,4],[31,5,31,7],[31,8,31,9],[39,4,39,9],[40,4,40,9],[19,0,20,0]]}
[12]
[null,null,null,"ООО \"ПрофБизнесУспех\""]
[]
["Адрес: Россия, 140560, Московская область, город Озёры, ул.Свердлова, д. 62 Б"]
[]
[]
[]
["ИНН 5033001993",null,null,null,null,"КПП 503301001",null,"Сч. №",null,"40702810940000011062"]
["Получатель"]
["ООО \"ПрофБизнесУспех\""]
["Банк получателя",null,null,null,null,null,null,"БИК",null,"044525225"]
["ОАО \"Сбербанк России\"",null,null,null,null,null,null,"Сч. №",null,"30101810400000000225"]
[]
[null,null,null,null,null,"СЧЕТ №",{"$f":"INDEX(инфо!B1:B500,A1,1)","v":"П-0001"},"от",{"$f":"INDEX(инфо!C1:C500,A1,1)","v":"2015-08-21"}]
[]
["Заказчик:",null,null,{"$f":"INDEX(инфо!D1:D500,A1,1)","v":"ООО \"РСК\""}]
["Плательщик:",null,null,{"$f":"D16","v":"ООО \"РСК\""},null,null,null,null,null,null,null,null," "]
[]
["№","Наименование товара",null,null,null,null,"ед.",null,"кол-во","Цена, рублей","Сумма, рублей"]
[1,{"$f":"INDEX(инфо!G1:G500,A1,1)","v":"Оказание информационно-консультационных услуг по вопросу получения лицензии МЧС, по договору № П-0001 от 21 августа 2015 года, НДС не облагается"},null,null,null,null,"шт.",null,1,{"$f":"INDEX(инфо!F1:F500,A1,1)","v":1},{"$f":"I20*J20","v":1}]
[]
[null,null,null,null,null,null,null,null,null,"Итого:",{"$f":"K20","v":1}]
[null,null,null,null,null,null,null,null,null,"НДС не облагается"]
[]
[]
["Всего наименований 1, на сумму",null,null,null,null,{"$f":"K22","v":1}]
[{"$f":"IF((K22)<=0,\"Сумма прописью:_______________________________________\",\"Сумма прописью: \"&FirstLetter(CurText(K22)))","v":"Сумма прописью: Один руб. 00 коп."}]
[]
[]
[]
[]
["Генеральный директор",null,null,null,null,null,null,null,"Юшина Л.В."]
[]
[]
[]
[]
[]
[]
[]
[null,null,null,null,"Оплачивать строго по указанным реквизитам."]
[null,null,null,null,"При оплате обязательно указывать"]
[null,null,null,null,"в назначении платежа номер и дату счета."]

{"sheet":"Лист3","index":2,"n_rows":0,"n_cols":0,"rows_kept":0,"cut":false,"hidden":false,"merged":[]}