{"text_format":"1","workbook":"xlsx","n_sheets":2,"sheets":["Книга запросов DANFOSS","Тех замены"],"not_rendered":{"charts":0,"images":0,"macros":1,"external_links":0,"defined_names":551,"comments":1,"pivot_tables":0},"unopened":[],"bounds":{"document_bytes":16777216,"sheet_cells":100000,"rows_first":2000,"rows_last":500,"rows_between":2000,"halvings":0,"cell_chars":16384,"cell_head_chars":4096},"cells_cut":0,"cells_raw":0,"read":"whole","date_system":"1900"}

{"sheet":"Книга запросов DANFOSS","index":0,"n_rows":14,"n_cols":32,"rows_kept":14,"cut":false,"hidden":false,"merged":[[0,0,0,10],[1,0,1,4],[1,7,1,8],[5,0,7,0],[5,7,7,7],[5,8,7,8],[5,10,7,10]]}
[]
[]
[]
[null,null,null,null,null,null,null,null,null,null,null,null,null,null,null,null,null,null,null,null,null,null,null,null,null,null,null,null,null,null,null,"Евро €"]
["2014-12-01","Н",1,"47446N4C3",10,{"$f":"VLOOKUP(D5,#REF!,2,0)","v":{"$error":"#REF!"}}]
["2014-12-01","Оля",1,"065B7472",1,{"$f":"VLOOKUP(D6,#REF!,2,0)","v":{"$error":"#REF!"}}]
[null,"Оля",2,"065B7733",1,{"$f":"VLOOKUP(D7,#REF!,2,0)","v":{"$error":"#REF!"}}]
[null,"Оля",3,"003Z1062",1,{"$f":"VLOOKUP(D8,#REF!,2,0)","v":{"$error":"#REF!"}}]
["2014-12-01","Н",1,"065B7362",8,{"$f":"VLOOKUP(D9,#REF!,2,0)","v":{"$error":"#REF!"}}]
[null,null,null,"065B2058"]
[null,null,null," "]
[null,null,null,"QALSK"]
[null,null,null,"QWE "]
[null,null,null,"003H6902"]

{"sheet":"Тех замены","index":1,"n_rows":6,"n_cols":2,"rows_kept":6,"cut":false,"hidden":false,"merged":[]}
["003H6902","Требуется всегда когда соединение НР"]
["065B2058","Необходимо добавить арт 003Z4004"]
["003H6346","Проверте применимость арт 00364 если не подойдет примените 0045162"]
["003H6352",3]
["003H6854",4]
["003H6902",5]