{"text_format":"1","workbook":"xlsx","n_sheets":2,"sheets":["Книга запросов DANFOSS","Курс ЕВРО фиксированный"],"not_rendered":{"charts":0,"images":0,"macros":1,"external_links":0,"defined_names":552,"comments":0,"pivot_tables":0},"unopened":[],"bounds":{"document_bytes":16777216,"sheet_cells":100000,"rows_first":2000,"rows_last":500,"rows_between":2000,"halvings":0,"cell_chars":16384,"cell_head_chars":4096},"cells_cut":0,"cells_raw":0,"read":"whole","date_system":"1900"}

{"sheet":"Книга запросов DANFOSS","index":0,"n_rows":1380,"n_cols":32,"rows_kept":1380,"cut":false,"hidden":false,"merged":[[0,0,0,10],[1,0,1,4],[1,7,1,8]]}
[]
["Курс ЕВРО на текущий день :",null,null,null,null,"Курс ЕВРО на торгах ",{"$f":"#REF!","v":{"$error":"#REF!"}},"Фиксированный курс ЕВРО на",null,{"$f":"'Курс ЕВРО фиксированный'!C51","v":"2015-09-09"},{"$f":"VLOOKUP(AF4,'Курс ЕВРО фиксированный'!A43:C60,3,0)","v":"руб. ↑76,9246"}]
[]
[null,null,null,null,null,null,null,null,null,null,null,null,null,null,null,null,null,null,null,null,null,null,null,null,null,null,null,null,null,null,null,"Евро €"]
[]
[]
[]
[]
[]
[]
[]
[]
[]
[]
[]
[]
[]
[]
[]
[]
[]
[]
[]
[]
[]
[]
[]
[]
[]
[]
[]
[]
[]
[]
[]
[]
[]
[]
[]
[]
[]
[]
[]
[]
[]
[]
[]
[]
[]
[]
[]
[]
[]
[]
[]
[]
[]
[]
[]
[]
[]
[]
[]
[]
[]
[]
[]
[]
[]
[]
[]
[]
[]
[]
[]
[]
[]
[]
[]
[]
[]
[]
[]
[]
[]
[]
[]
[]
[]
[]
[]
[]
[]
[]
[]
[]
[]
[]
[]
[]
[]
[]
[]
[]
[]
[]
[]
[]
[]
[]
[]
[]
[]
[]
[]
[]
[]
[]
[]
[]
[]
[]
[]
[]
[]
[]
[]
[]
[]
[]
[]
[]
[]
[]
[]
[]
[]
[]
[]
[]
[]
[]
[]
[]
[]
[]
[]
[]
[]
[]
[]
[]
[]
[]
[]
[]
[]
[]
[]
[]
[]
[]
[]
[]
[]
[]
[]
[]
[]
[]
[]
[]
[]
[]
[]
[]
[]
[]
[]
[]
[]
[]
[]
[]
[]
[]
[]
[]
[]
[]
[]
[]
[]
[]
[]
[]
[]
[]
[]
[]
[]
[]
[]
[]
[]
[]
[]
[]
[]
[]
[]
[]
[]
[]
[]
[]
[]
[]
[]
[]
[]
[]
[]
[]
[]
[]
[]
[]
[]
[]
[]
[]
[]
[]
[]
[]
[]
[]
[]
[]
[]
[]
[]
[]
[]
[]
[]
[]
[]
[]
[]
[]
[]
[]
[]
[]
[]
[]
[]
[]
[]
[]
[]
[]
[]
[]
[]
[]
[]
[]
[]
[]
[]
[]
[]
[]
[]
[]
[]
[]
[]
[]
[]
[]
[]
[]
[]
[]
[]
[]
[]
[]
[]
[]
[]
[]
[]
[]
[]
[]
[]
[]
[]
[]
[]
[]
[]
[]
[]
[]
[]
[]
[]
[]
[]
[]
[]
[]
[]
[]
[]
[]
[]
[]
[]
[]
[]
[]
[]
[]
[]
[]
[]
[]
[]
[]
[]
[]
[]
[]
[]
[]
[]
[]
[]
[]
[]
[]
[]
[]
[]
[]
[]
[]
[]
[]
[]
[]
[]
[]
[]
[]
[]
[]
[]
[]
[]
[]
[]
[]
[]
[]
[]
[]
[]
[]
[]
[]
[]
[]
[]
[]
[]
[]
[]
[]
[]
[]
[]
[]
[]
[]
[]
[]
[]
[]
[]
[]
[]
[]
{"$rows_left_out":981}
{"sheet":"Курс ЕВРО фиксированный","index":1,"n_rows":266,"n_cols":4,"rows_kept":266,"cut":false,"hidden":false,"merged":[]}
["Центральный банк Российской Федерации"]
["Банк России сегодня"]
["Денежно-кредитная политика"]
["Банкноты и монеты"]
["Информационно-аналитические материалы"]
["Информация по кредитным организациям"]
["Национальная платежная система"]
["Статистика"]
["Издания Банка России"]
["Региональный раздел"]
["Финансовые рынки"]
["Кредитные истории"]
["Пресс-центр"]
["Интернет-приемная Банка России"]
["Противодействие коррупции"]
[]
["Информация об ОСАГО"]
["Информация об ОСАГО"]
["FINNOPOLIS 2015"]
["Первый Казанский форум инновационных финансовых технологий FINNOPOLIS 2015"]
["17-18 сентября"]
["Финансовое просвещение"]
["Финансовое просвещение и музей"]
["Переход НФО на план счетов и ОСБУ"]
["Переход НФО на план счетов и ОСБУ"]
["RU"]
["EN"]
["Центральный банк"]
["Российской Федерации"]
[]
["Ключевая ставка "]
["с 03.08.2015, %",11]
[]
["Инфляция "]
["Инфляция,",15.8]
["Показатель инфляции отражает темп прироста потребительских цен к соответствующему месяцу предыдущего года"]
[]
["(источник: Федеральная служба государственной статистики)"]
[]
[" август 2015 года, %"]
[]
["Цель по инфляции "]
["Цель по инфляции,",4]
["Цель по инфляции устанавливается для показателя инфляции, отражающего темп прироста потребительских цен к соответствующему месяцу предыдущего года"]
[]
[" 2017 год, %"]
[]
["Основные индикаторы финансового рынка "]
[]
["Курсы валют"]
[null,"2015-09-08","2015-09-09"]
["Доллар США $","руб. 68,4864","руб. ↑68,7932"]
["Евро €","руб. 76,3692","руб. ↑76,9246"]
[]
["Бивалютная корзина"]
["с  09.09.2015","руб. 72,4523"]
[]
["Учетные цены на драгоценные металлы"]
["рублей за грамм",42256]
["Золото Au",2479.04]
["Серебро Ag","1900-02-01T08:38:24"]
["Платина Pt",2196.27]
["Палладий Pd",1298.3]
[]
["Ставки межбанковского кредитного рынка"]
["%","1 день","2-7 дней","8-30 дней"]
["MIACR на 07.09.2015",10.52,"— ","— "]
["%","1 день","1 месяц","3 месяца"]
["MosPrime  Rate на 08.09.2015",10.76,11.54,11.85]
["RUONIA  на 07.09.2015","↓10,40"]
["%","1 неделя","1 месяц","3 месяца"]
["ROISfix  на 08.09.2015",11,11.2,11.26]
[]
["Параметры операций Банка России "]
[]
["Операции постоянного действия по предоставлению ликвидности"]
[]
["Ставки по кредитным операциям"]
["Ставка по кредиту overnight  с 03.08.2015, % годовых","↓12,00"]
["Ломбардным кредитам","1 день"]
["с 03.08.2015, % годовых",12]
["Кредитам под активы или поручительства","1 день","2–549 дней"]
["с 03.08.2015, % годовых",12,12.75]
["Кредитам, обеспеченным золотом","1 день","2–549 дней"]
["с 03.08.2015, % годовых",12,12.5]
["Условия проведения операций по предоставлению обеспеченных кредитов по фиксированным процентным ставкам "]
[]
["Своп-разница по валютному свопу"]
["руб."]
["USD/RUB buy/sell overnight  на 08.09.2015",2.2700000000000001E-2]
["EUR/RUB buy/sell overnight  на 08.09.2015",2.5399999999999999E-2]
[]
["Операции РЕПО по фиксированной ставке"]
[null,"на 1 день"]
["Операции РЕПО по фиксированной ставке, %",12]
["Объем операций РЕПО по фиксированной ставке"]
[]
["Операции на аукционной основе по предоставлению ликвидности"]
["Аукционы РЕПО  на 08.09.2015"]
[null,"7 дней"]
["Лимит, млрд руб.",950]
["Мин. ставка, %",11]
["Итоги аукциона РЕПО"]
["Расписание операций РЕПО"]
["Параметры аукционов по предоставлению кредитов, обеспеченных нерыночными активами, по плавающей процентной ставке"]
["Итоги аукционов по предоставлению кредитов, обеспеченных нерыночными активами, по плавающей процентной ставке"]
["Ставки по итогам ломбардных кредитных аукционов"]
["Ставки по итогам кредитных аукционов (кредиты, обеспеченные активами или поручительствами)"]
["Минимальные ставки для кредитных аукционов (кредиты, обеспеченные активами или поручительствами)"]
["Минимальные ставки для ломбардных кредитных аукционов"]
["Условия проведения депозитного/кредитного аукциона на срок 1 неделя"]
[]
["Депозитные операции на аукционной основе"]
["Ставки по депозитным аукционам, %"]
["Максимальные ставки для депозитных аукционов"]
["Условия проведения депозитного/кредитного аукциона на срок 1 неделя"]
["Условия проведения Банком России депозитных операций «тонкой настройки» на аукционной основе на срок от 1 до 6 дней"]
[]
["Депозитные операции постоянного действия"]
[]
["Ставки по депозитным операциям"]
["с 03.08.2015, % годовых"]
["Овернайт","↓10,00"]
["Том-некст","↓10,00"]
["Спот-некст","↓10,00"]
["До востребования","↓10,00"]
["Условия проведения депозитных операций по фиксированным процентным ставкам "]
[]
[]
["Требования Банка России к кредитным организациям "]
["млн руб."]
["По кредитам overnight  на 08.09.2015",136]
["По ломбардным кредитам  на 08.09.2015",4132]
["По кредитам под активы или поручительства  на 08.09.2015",2959691.5]
["По кредитам, обеспеченным золотом  на 08.09.2015",575.20000000000005]
["По операциям РЕПО  на 09.09.2015"]
["на аукционной основе",728604.5]
[]
[]
["по фиксированной ставке",135595.5]
[]
[]
["По сделкам «валютный своп»  на 09.09.2015",0]
["По кредитам без обеспечения  на 31.12.2010",0]
[]
["Показатели ликвидности банковского сектора "]
["Сведения об остатках средств на корреспондентских счетах кредитных организаций"]
[]
["млрд руб."]
["По Российской Федерации на 08.09.2015",1100.3]
["По Московскому региону на 08.09.2015",952.2]
["млрд руб."]
["Объем предоставленных внутридневных кредитов  за 07.09.2015",271.2]
["млрд руб."]
["Депозиты банков в Банке России  на 08.09.2015",279.2]
["млрд руб."]
["Сальдо операций Банка России по предоставлению/абсорбированию ликвидности на 08.09.2015","↓116,2"]
["Факторы формирования ликвидности банковского сектора"]
["Прогноз факторов формирования ликвидности банковского сектора"]
[]
["Обязательные резервные требования "]
["Перед юридическими лицами — нерезидентами, %",4.25]
["Перед физическими лицами, %",4.25]
["По иным обязательствам, %",4.25]
["Корректировочный коэффициент",0.2]
[]
["Коэффициент усреднения обязательных резервов"]
["Для КО",0.7]
["Для НКО",1]
[]
["Международные резервы Российской Федерации "]
["28.08.2015, млрд. долл. США",366.4]
[]
["Справочно: ставка рефинансирования "]
["с 14.09.2012, %",8.25]
[]
["Новое на сайте RSS"]
["9 сентября 2015 г."]
["Задолженность кредитных организаций перед Банком России по операциям РЕПО в иностранной валюте "]
["8 сентября 2015 г."]
["Информация о ценных бумагах, принимаемых в обеспечение по кредитам Банка России на 09.09.2015 "]
["8 сентября 2015 г."]
["Инсайдерская информация Банка России "]
["8 сентября 2015 г."]
["Сведения о проведении реорганизации НПФ "]
["8 сентября 2015 г."]
["О порядке направления в Банк России участниками рынка микрофинансирования документов на бумажных носителях "]
[]
["Пресс-релизыRSS"]
["8 сентября 2015 г."]
["Об аннулировании лицензий профессиональных участников рынка ценных бумаг"]
["8 сентября 2015 г."]
["О выпуске в обращение памятной монеты из драгоценного металла "]
["8 сентября 2015 г."]
["О решениях Банка России"]
["8 сентября 2015 г."]
["Об аннулировании лицензий профессионального участника рынка ценных бумаг "]
["8 сентября 2015 г."]
["Об отзыве лицензии на осуществление банковских операций "]
[]
["Актуальные документы"]
["Отчет о развитии банковского сектора и банковского надзора в 2014 году"]
[]
["Обзор финансовой стабильности • IV квартал 2014 г. - I квартал 2015 г.Важно"]
[]
["Доклад о денежно-кредитной политике - Выпуск № 2 (10) • Июнь 2015 годаВажно"]
[]
["Основные направления единой государственной денежно-кредитной политики на 2015 год и период 2016 и 2017 годовВажно"]
[]
["Дополнительные материалы"]
["Вопросы, связанные с представлением в Банк России отчетности в электронном виде с электронной подписью"]
[]
["Новый порядок представления эмиссионных документов эмитентов, не являющихся кредитными организациями!Важно"]
[]
["Проекты нормативных актов Банка России"]
[]
["График операций Банка России"]
[]
["Информация Тендерного комитета Банка России"]
[]
["Перечень инсайдерской информации Банка России"]
[]
["Справочная информация"]
["Список официально открытых внутренних структурных подразделений, расположенных на территории московского региона (г. Москва и Московская область), кредитных организаций (филиалов), имеющих валютную лицензию, а также информация о незаконных «точках» обмена валюты"]
[]
["Сведения о средних ставках банковского процента по вкладам физических лиц в рублях для целей применения ст. 395 ГК РФ (по федеральным округам)"]
[]
["Кредитный калькулятор для кредитных организаций"]
[]
["Перечень нерабочих праздничных дней и перенесенных выходных дней в 2015 году"]
[]
["Технические ресурсы"]
[]
[]
[]
[]
[]
[]
[]
[]
[]
[]
[]
[]
[]
[]
[]
[]
["О сайте"]
["Архив"]
["Поиск и карта сайта"]
["Другие ресурсы"]
["© Банк России, 2000–2015"]
["Адрес: ул. Неглинная, 12, Москва, 107016"]
[]
["Телефоны: 8 800 250-40-72 (для бесплатных звонков из регионов России), +7 495 771-91-00 (круглосуточно, по рабочим дням), факс: +7 495 621-64-65"]
[]
["Контактная информация"]
[]
["Банк России не рассылает SMS-сообщения"]
[]
["Вся официальная контактная информация Банка России представлена на официальном сайте Банка России www.cbr.ru"]
[]
["По вопросам, связанным с работой сайта, обращайтесь по адресу: webmaster@www.cbr.ru"]
[]
["Дизайн сайта — Логотип Студии Артемия ЛебедеваСтудия Артемия Лебедева"]