{"text_format":"1","workbook":"xlsx","n_sheets":4,"sheets":["Доверенность","Паспортные данные","Реестр доверенностей","Лист1"],"not_rendered":{"charts":0,"images":0,"macros":1,"external_links":0,"defined_names":25,"comments":0,"pivot_tables":0},"unopened":[],"bounds":{"document_bytes":16777216,"sheet_cells":100000,"rows_first":2000,"rows_last":500,"rows_between":2000,"halvings":0,"cell_chars":16384,"cell_head_chars":4096},"cells_cut":0,"cells_raw":0,"read":"whole","date_system":"1900"}

{"sheet":"Доверенность","index":0,"n_rows":50,"n_cols":78,"rows_kept":50,"cut":false,"hidden":false,"merged":[[32,30,32,75],[25,52,25,75],[27,11,27,75],[27,1,27,8],[24,52,24,75],[10,72,10,73],[22,38,22,75],[24,24,24,48],[28,1,28,13],[30,18,30,75],[26,32,26,46],[29,18,29,75],[29,1,29,16],[10,13,10,70],[23,38,23,75],[19,1,19,75],[18,1,18,75],[21,1,21,75],[20,1,20,75],[22,1,22,4],[25,24,25,48],[17,33,17,62],[31,1,31,16],[31,18,31,75],[22,6,22,33],[22,35,22,36],[28,47,28,48],[26,1,26,14],[26,16,26,25],[26,27,26,29],[24,1,24,22],[13,56,13,63],[3,19,3,35],[11,72,11,73],[10,75,11,75],[0,0,0,2],[13,31,13,53],[17,1,17,32],[6,70,7,75],[0,10,0,18],[0,36,0,51],[0,19,0,35],[0,73,0,76],[0,3,0,9],[4,0,4,76],[0,52,0,72],[1,52,1,72],[2,52,3,72],[2,73,3,76],[34,0,34,76],[1,36,1,51],[1,73,1,76],[2,3,3,9],[2,10,3,18],[2,19,2,35],[2,36,3,51],[15,25,15,42],[15,43,15,65],[10,1,10,11],[35,0,35,6],[35,7,35,59],[35,60,35,67],[35,68,35,76],[1,0,1,2],[1,3,1,9],[1,10,1,18],[1,19,1,35],[2,0,3,2],[28,14,28,46],[36,0,36,6],[36,7,36,59],[36,60,36,67],[36,68,36,76],[49,28,50,45],[43,22,44,45],[38,41,38,57],[38,2,38,39],[38,59,38,66],[42,2,45,3],[41,8,43,21],[48,8,49,27],[40,22,42,45],[47,28,48,45],[49,51,50,66],[43,51,44,66],[40,51,42,66],[47,51,48,66]]}
["№ дове-\nрен.",null,null,"Дата\nвыдачи",null,null,null,null,null,null,"Срок\nдей-\nствия",null,null,null,null,null,null,null,null,"Должность и фамилия\nлица, которому выдана\nдоверенность",null,null,null,null,null,null,null,null,null,null,null,null,null,null,null,null,"Расписка в\nполучении\nдоверенности",null,null,null,null,null,null,null,null,null,null,null,null,null,null,null,"Поставщик",null,null,null,null,null,null,null,null,null,null,null,null,null,null,null,null,null,null,null,null,"Полученная сумма",null,null,null,{"$f":"VLOOKUP(\"х\",'Паспортные данные'!A3:K18,2,FALSE)","v":"Любимова, Олеся"}]
[1,null,null,2,null,null,null,null,null,null,3,null,null,null,null,null,null,null,null,4,null,null,null,null,null,null,null,null,null,null,null,null,null,null,null,null,5,null,null,null,null,null,null,null,null,null,null,null,null,null,null,null,6,null,null,null,null,null,null,null,null,null,null,null,null,null,null,null,null,null,null,null,null,7,null,null,null,{"$f":"HLOOKUP(BZ1,#REF!,2,FALSE)","v":{"$error":"#REF!"}}]
[{"$f":"LOOKUP(9^9,'Реестр доверенностей'!A:A)+1","v":2},null,null,{"$f":"NOW()","v":"2015-09-23T12:43:03.530"},null,null,null,null,null,null,{"$f":"D3+10","v":"2015-10-03T12:43:03.530"},null,null,null,null,null,null,null,null,{"$f":"VLOOKUP(\"х\",'Паспортные данные'!A3:K18,11,TRUE)","v":"МПП"},null,null,null,null,null,null,null,null,null,null,null,null,null,null,null,null," ",null,null,null,null,null,null,null,null,null,null,null,null,null,null,null," "]
[null,null,null,null,null,null,null,null,null,null,null,null,null,null,null,null,null,null,null,{"$f":"VLOOKUP(\"х\",'Паспортные данные'!A1:C18,3,TRUE)","v":"Любимовой Олесе Алексеевне"}]
["ЛИНИЯ ОТРЕЗА"]
[]
[null,null,null,null,null,null,null,null,null,null,null,null,null,null,null,null,null,null,null,null,null,null,null,null,null,null,null,null,null,null,null,null,null,null,null,null,null,null,null,null,null,null,null,null,null,null,null,null,null,null,null,null,null,null,null,null,null,null,null,null,null,null,null,null,null,null,null,null,null,null,"Типовая межотраслевая форма № М-2"]
[]
[]
[null,null,null,null,null,null,null,null,null,null,null,null,null,null,null,null,null,null,null,null,null,null,null,null,null,null,null,null,null,null,null,null,null,null,null,null,null,null,null,null,null,null,null,null,null,null,null,null,null,null,null,null,null,null,null,null,null,null,null,null,null,null,null,null,null,null,null,null,null,null,null,null,null,null,null,"Коды"]
[null,"Организация",null,null,null,null,null,null,null,null,null,null,null,"Общество с ограниченной ответственностью \"Дубль Гис-Оренбург\"",null,null,null,null,null,null,null,null,null,null,null,null,null,null,null,null,null,null,null,null,null,null,null,null,null,null,null,null,null,null,null,null,null,null,null,null,null,null,null,null,null,null,null,null,null,null,null,null,null,null,null,null,null,null,null,null,null,null,"Форма по ОКУД",null,null," "]
[null,null,null,null,null,null,null,null,null,null,null,null,null,null,null,null,null,null,null,null,null,null,null,null,null,null,null,null,null,null,null,null,null,null,null,null,null,null,null,null,null,null,null,null,null,null,null,null,null,null,null,null,null,null,null,null,null,null,null,null,null,null,null,null,null,null,null,null,null,null,null,null,"по ОКПО"]
[]
[null,null,null,null,null,null,null,null,null,null,null,null,null,null,null,null,null,null,null,null,null,null,null,null,null,null,null,null,null,null,null,"ДОВЕРЕННОСТЬ №",null,null,null,null,null,null,null,null,null,null,null,null,null,null,null,null,null,null,null,null,null,null,null,null,{"$f":"A3","v":2}]
[]
[null,null,null,null,null,null,null,null,null,null,null,null,null,null,null,null,null,null,null,null,null,null,null,null,null,"Дата выдачи ",null,null,null,null,null,null,null,null,null,null,null,null,null,null,null,null,null,{"$f":"D3","v":"2015-09-23T12:43:03.530"}]
[]
[null,"Доверенность действительна по \"",null,null,null,null,null,null,null,null,null,null,null,null,null,null,null,null,null,null,null,null,null,null,null,null,null,null,null,null,null,null,null,{"$f":"K3","v":"2015-10-03T12:43:03.530"}]
[]
[null,"наименование потребителя и его адрес"]
[]
[null,"наименование плательщика и его адрес"]
[null,"Счет №",null,null,null,null,null,null,null,null,null,null,null,null,null,null,null,null,null,null,null,null,null,null,null,null,null,null,null,null,null,null,null,null,null,"в"]
[null,null,null,null,null,null,null,null,null,null,null,null,null,null,null,null,null,null,null,null,null,null,null,null,null,null,null,null,null,null,null,null,null,null,null,null,null,null,"наименование банка"]
[null,"Доверенность выдана",null,null,null,null,null,null,null,null,null,null,null,null,null,null,null,null,null,null,null,null,null,null,{"$f":"T3","v":"МПП"},null,null,null,null,null,null,null,null,null,null,null,null,null,null,null,null,null,null,null,null,null,null,null,null,null,null,null,{"$f":"T4","v":"Любимовой Олесе Алексеевне"}]
[null,null,null,null,null,null,null,null,null,null,null,null,null,null,null,null,null,null,null,null,null,null,null,null,"должность",null,null,null,null,null,null,null,null,null,null,null,null,null,null,null,null,null,null,null,null,null,null,null,null,null,null,null,"фамилия, имя, отчество"]
[null,"Паспорт: серия",null,null,null,null,null,null,null,null,null,null,null,null,null,null,{"$f":"VLOOKUP(\"х\",'Паспортные данные'!A1:K18,7)","v":0},null,null,null,null,null,null,null,null,null,null,"№",null,null,null,null,{"$f":"VLOOKUP(\"х\",'Паспортные данные'!A1:K18,8)","v":0}]
[null,"Кем выдан",null,null,null,null,null,null,null,null,null,{"$f":"VLOOKUP(\"х\",'Паспортные данные'!A1:K18,9)","v":0}]
[null,"Дата выдачи \"",null,null,null,null,null,null,null,null,null,null,null,null,{"$f":"VLOOKUP(\"х\",'Паспортные данные'!A1:K18,10)","v":"00:00:00"},null,null,null,null,null,null,null,null,null,null,null,null,null,null,null,null,null,null,null,null,null,null,null,null,null,null,null,null,null,null,null,null,"г."]
[null,"На получение от"]
[null,null,null,null,null,null,null,null,null,null,null,null,null,null,null,null,null,null,"наименование поставщика"]
[null,"денежных средств ",null,null,null,null,null,null,null,null,null,null,null,null,null,null,null,null,{"$f":"IF(BV3=0,\" \",Лист1!C1)","v":" "}]
[null,null,null,null,null,null,null,null,null,null,null,null,null,null,null,null,null,null,null,null,null,null,null,null,null,null,null,null,null,null,"Сумма прописью"]
[]
["Перечень товарно-материальных ценностей, подлежащих получению"]
["Номер по\nпорядку",null,null,null,null,null,null,"Материальные\nценности",null,null,null,null,null,null,null,null,null,null,null,null,null,null,null,null,null,null,null,null,null,null,null,null,null,null,null,null,null,null,null,null,null,null,null,null,null,null,null,null,null,null,null,null,null,null,null,null,null,null,null,null,"Единица\nизмерения",null,null,null,null,null,null,null,"Количество\n(прописью)"]
[1,null,null,null,null,null,null,2,null,null,null,null,null,null,null,null,null,null,null,null,null,null,null,null,null,null,null,null,null,null,null,null,null,null,null,null,null,null,null,null,null,null,null,null,null,null,null,null,null,null,null,null,null,null,null,null,null,null,null,null,3,null,null,null,null,null,null,null,4]
[]
[null,null,"Подпись лица, получившего доверенность",null,null,null,null,null,null,null,null,null,null,null,null,null,null,null,null,null,null,null,null,null,null,null,null,null,null,null,null,null,null,null,null,null,null,null,null,null,null," ",null,null,null,null,null,null,null,null,null,null,null,null,null,null,null,null,null,"удостоверяем"]
[]
{"$rows_left_out":11}
{"sheet":"Паспортные данные","index":1,"n_rows":21,"n_cols":11,"rows_kept":21,"cut":false,"hidden":false,"merged":[[0,1,1,1],[19,0,19,10],[0,10,1,10],[0,0,1,0],[0,2,1,2],[0,6,0,9],[0,3,1,3],[0,4,1,4],[0,5,1,5]]}
["х","ФИО ERM","ФИО","Фамилия","Имя","Отчество","Паспортные данные",null,null,null,"Должность"]
[null,null,null,null,null,null,"Серия","№","Кем выдан","Дата выдачи"]
["х","Любимова, Олеся",{"$f":"CONCATENATE(D3,\" \",E3, \" \",F3)","v":"Любимовой Олесе Алексеевне"},"Любимовой","Олесе","Алексеевне",null,null,null,null,"МПП"]
[null,"Молдырева, Любовь",{"$f":"CONCATENATE(D4,\" \",E4, \" \",F4)","v":"Молдыревой  Любови  Андреевне"},"Молдыревой ","Любови ","Андреевне",null,null,null,null,"МПП"]
[null,"Уварова, Светлана",{"$f":"CONCATENATE(D5,\" \",E5, \" \",F5)","v":"Уваровой Светлане Фаильевне"},"Уваровой","Светлане","Фаильевне",null,null,null,null,"МПП"]
[]
[]
[]
[]
[]
[]
[]
[]
[null,1]
[null,2,{"$f":"CONCATENATE(D15,\" \",E15, \" \",F15)","v":"  "}]
[null,3,{"$f":"CONCATENATE(D16,\" \",E16, \" \",F16)","v":"  "}]
[null,4]
[null,5]
[]
["Бывшие сотрудники"]
["х"]

{"sheet":"Реестр доверенностей","index":2,"n_rows":950,"n_cols":227,"rows_kept":950,"cut":false,"hidden":false,"merged":[]}
["№","Дата выдачи","Действительна до","ФИО","ЮР ЛИЦО","Сумма","Возврат корешка","Сроки",{"$f":"NOW()","v":"2015-09-23T12:43:03.530"}]
[1,null,null,null,null,null,null,{"$f":"IF(G2=\"х\",0,C2-$I$1)","v":-42270.529901967595},null,null,null,null,{"$f":"'Паспортные данные'!C3","v":"Любимовой Олесе Алексеевне"},null,null,"№","Дата","Действительна","МПП","Организация","Сумма"]
[null,null,null,null,null,null,null,-42270.529901967595,null,null,null,null,{"$f":"'Паспортные данные'!C4","v":"Молдыревой  Любови  Андреевне"},null,null,{"$f":"Доверенность!A3","v":2},{"$f":"Доверенность!D3","v":"2015-09-23T12:43:03.530"},{"$f":"Доверенность!K3","v":"2015-10-03T12:43:03.530"},{"$f":"Доверенность!T4","v":"Любимовой Олесе Алексеевне"},{"$f":"IF(Доверенность!S30=0,\" \",Доверенность!S30)","v":" "},{"$f":"Доверенность!BV3","v":0}]
[null,null,null,null,null,null,null,-42270.529901967595,null,null,null,null,{"$f":"'Паспортные данные'!C5","v":"Уваровой Светлане Фаильевне"}]
[null,null,null,null,null,null,null,-42270.529901967595,null,null,null,null,{"$f":"'Паспортные данные'!C6","v":0}]
[null,null,null,null,null,null,null,-42270.529901967595,null,null,null,null,{"$f":"'Паспортные данные'!C7","v":0}]
[null,null,null,null,null,null,null,-42270.529901967595,null,null,null,null,{"$f":"'Паспортные данные'!C8","v":0}]
[null,null,null,null,null,null,null,-42270.529901967595,null,null,null,null,{"$f":"'Паспортные данные'!C9","v":0}]
[null,null,null,null,null,null,null,-42270.529901967595,null,null,null,null,{"$f":"'Паспортные данные'!C10","v":0}]
[null,null,null,null,null,null,null,-42270.529901967595,null,null,null,null,{"$f":"'Паспортные данные'!C11","v":0}]
[null,null,null,null,null,null,null,-42270.529901967595,null,null,null,null,{"$f":"'Паспортные данные'!C12","v":0}]
[null,null,null,null,null,null,null,-42270.529901967595,null,null,null,null,{"$f":"'Паспортные данные'!C13","v":0}]
[null,null,null,null,null,null,null,-42270.529901967595,null,null,null,null,{"$f":"'Паспортные данные'!C14","v":0}]
[null,null,null,null,null,null,null,-42270.529901967595,null,null,null,null,{"$f":"'Паспортные данные'!C15","v":"  "}]
[null,null,null,null,null,null,null,-42270.529901967595,null,null,null,null,{"$f":"'Паспортные данные'!C16","v":"  "}]
[null,null,null,null,null,null,null,-42270.529901967595,null,null,null,null,{"$f":"'Паспортные данные'!C17","v":0}]
[null,null,null,null,null,null,null,-42270.529901967595,null,null,null,null,{"$f":"'Паспортные данные'!C18","v":0}]
[null,null,null,null,null,null,null,-42270.529901967595,null,null,null,null,{"$f":"'Паспортные данные'!C19","v":0}]
[null,null,null,null,null,null,null,-42270.529901967595,null,null,null,null,{"$f":"'Паспортные данные'!C20","v":0}]
[null,null,null,null,null,null,null,-42270.529901967595]
[null,null,null,null,null,null,null,-42270.529901967595]
[null,null,null,null,null,null,null,-42270.529901967595]
[null,null,null,null,null,null,null,-42270.529901967595]
[null,null,null,null,null,null,null,-42270.529901967595]
[null,null,null,null,null,null,null,-42270.529901967595]
[null,null,null,null,null,null,null,-42270.529901967595]
[null,null,null,null,null,null,null,-42270.529901967595]
[null,null,null,null,null,null,null,-42270.529901967595]
[null,null,null,null,null,null,null,-42270.529901967595]
[null,null,null,null,null,null,null,-42270.529901967595]
[null,null,null,null,null,null,null,-42270.529901967595]
[null,null,null,null,null,null,null,-42270.529901967595]
[null,null,null,null,null,null,null,-42270.529901967595]
[null,null,null,null,null,null,null,-42270.529901967595]
[null,null,null,null,null,null,null,-42270.529901967595]
[null,null,null,null,null,null,null,-42270.529901967595]
[null,null,null,null,null,null,null,-42270.529901967595]
[null,null,null,null,null,null,null,-42270.529901967595]
[null,null,null,null,null,null,null,-42270.529901967595]
[null,null,null,null,null,null,null,-42270.529901967595]
{"$rows_left_out":911}
{"sheet":"Лист1","index":3,"n_rows":71,"n_cols":3,"rows_kept":71,"cut":false,"hidden":true,"merged":[]}
[null,{"$f":"Доверенность!BV3","v":0},{"$f":"IFERROR((C3&C4&C5&C6&C7&C8&C9&C10&C11&C12&C13&C14&C15&C16&C17&C18&C19&C20&C21&C22&C23),\" \")","v":"ноль рублей"}]
[]
[null,{"$f":"--MID(RIGHT(TEXT(B1,\"000000000000000,00\"),18),1,1)","v":0},{"$f":"INDEX({\"\",\"сто \",\"двести \",\"триста \",\"четыреста \",\"пятьсот \",\"шестьсот \",\"семьсот \",\"восемьсот \",\"девятьсот \"},B3+1)","v":""}]
[null,{"$f":"--MID(RIGHT(TEXT(B1,\"000000000000000,00\"),18),2,1)","v":0},{"$f":"CHOOSE(B4+1,\"\",INDEX({\"десять \",\"одиннадцать \",\"двенадцать \",\"тринадцать \",\"четырнадцать \",\"пятнадцать \",\"шестнадцать \",\"семнадцать \",\"восемнадцать \",\"девятнадцать \"},B5+1),\"двадцать \",\"тридцать \",\"сорок \",\"пятьдесят \",\"шестьдесят \",\"семьдесят \",\"восемьдесят \",\"девяносто \")","v":""}]
[null,{"$f":"--MID(RIGHT(TEXT(B1,\"000000000000000,00\"),18),3,1)","v":0},{"$f":"IF(B4<>1,INDEX({\"\",\"один \",\"два \",\"три \",\"четыре \",\"пять \",\"шесть \",\"семь \",\"восемь \",\"девять \"},B5+1),\"\")","v":""}]
[null,null,{"$f":"IF(SUM(B3:B5),\"триллион\"&IF(B4=1,\"ов \",LOOKUP(B5,{0,1,2,5},{\"ов \",\" \",\"а \",\"ов \"})),\"\")","v":""}]
[null,{"$f":"--MID(RIGHT(TEXT(B1,\"000000000000000,00\"),18),4,1)","v":0},{"$f":"INDEX({\"\",\"сто \",\"двести \",\"триста \",\"четыреста \",\"пятьсот \",\"шестьсот \",\"семьсот \",\"восемьсот \",\"девятьсот \"},B7+1)","v":""}]
[null,{"$f":"--MID(RIGHT(TEXT(B1,\"000000000000000,00\"),18),5,1)","v":0},{"$f":"CHOOSE(B8+1,\"\",INDEX({\"десять \",\"одиннадцать \",\"двенадцать \",\"тринадцать \",\"четырнадцать \",\"пятнадцать \",\"шестнадцать \",\"семнадцать \",\"восемнадцать \",\"девятнадцать \"},B9+1),\"двадцать \",\"тридцать \",\"сорок \",\"пятьдесят \",\"шестьдесят \",\"семьдесят \",\"восемьдесят \",\"девяносто \")","v":""}]
[null,{"$f":"--MID(RIGHT(TEXT(B1,\"000000000000000,00\"),18),6,1)","v":0},{"$f":"IF(B8<>1,INDEX({\"\",\"один \",\"два \",\"три \",\"четыре \",\"пять \",\"шесть \",\"семь \",\"восемь \",\"девять \"},B9+1),\"\")","v":""}]
[null,null,{"$f":"IF(SUM(B7:B9),\"миллиард\"&IF(B8=1,\"ов \",LOOKUP(B9,{0,1,2,5},{\"ов \",\" \",\"а \",\"ов \"})),\"\")","v":""}]
[null,{"$f":"--MID(RIGHT(TEXT(B1,\"000000000000000,00\"),18),7,1)","v":0},{"$f":"INDEX({\"\",\"сто \",\"двести \",\"триста \",\"четыреста \",\"пятьсот \",\"шестьсот \",\"семьсот \",\"восемьсот \",\"девятьсот \"},B11+1)","v":""}]
[null,{"$f":"--MID(RIGHT(TEXT(B1,\"000000000000000,00\"),18),8,1)","v":0},{"$f":"CHOOSE(B12+1,\"\",INDEX({\"десять \",\"одиннадцать \",\"двенадцать \",\"тринадцать \",\"четырнадцать \",\"пятнадцать \",\"шестнадцать \",\"семнадцать \",\"восемнадцать \",\"девятнадцать \"},B13+1),\"двадцать \",\"тридцать \",\"сорок \",\"пятьдесят \",\"шестьдесят \",\"семьдесят \",\"восемьдесят \",\"девяносто \")","v":""}]
[null,{"$f":"--MID(RIGHT(TEXT(B1,\"000000000000000,00\"),18),9,1)","v":0},{"$f":"IF(B12<>1,INDEX({\"\",\"один \",\"два \",\"три \",\"четыре \",\"пять \",\"шесть \",\"семь \",\"восемь \",\"девять \"},B13+1),\"\")","v":""}]
[null,null,{"$f":"IF(SUM(B11:B13),\"миллион\"&IF(B12=1,\"ов \",LOOKUP(B13,{0,1,2,5},{\"ов \",\" \",\"а \",\"ов \"})),\"\")","v":""}]
[null,{"$f":"--MID(RIGHT(TEXT(B1,\"000000000000000,00\"),18),10,1)","v":0},{"$f":"INDEX({\"\",\"сто \",\"двести \",\"триста \",\"четыреста \",\"пятьсот \",\"шестьсот \",\"семьсот \",\"восемьсот \",\"девятьсот \"},B15+1)","v":""}]
[null,{"$f":"--MID(RIGHT(TEXT(B1,\"000000000000000,00\"),18),11,1)","v":0},{"$f":"CHOOSE(B16+1,\"\",INDEX({\"десять \",\"одиннадцать \",\"двенадцать \",\"тринадцать \",\"четырнадцать \",\"пятнадцать \",\"шестнадцать \",\"семнадцать \",\"восемнадцать \",\"девятнадцать \"},B17+1),\"двадцать \",\"тридцать \",\"сорок \",\"пятьдесят \",\"шестьдесят \",\"семьдесят \",\"восемьдесят \",\"девяносто \")","v":""}]
[null,{"$f":"--MID(RIGHT(TEXT(B1,\"000000000000000,00\"),18),12,1)","v":0},{"$f":"IF(B16<>1,INDEX({\"\",\"одна \",\"две \",\"три \",\"четыре \",\"пять \",\"шесть \",\"семь \",\"восемь \",\"девять \"},B17+1),\"\")","v":""}]
[null,null,{"$f":"IF(SUM(B15:B17),\"тысяч\"&IF(B16=1,\" \",LOOKUP(B17,{0,1,2,5},{\" \",\"а \",\"и \",\" \"})),\"\")","v":""}]
[null,{"$f":"--MID(RIGHT(TEXT(B1,\"000000000000000,00\"),18),13,1)","v":0},{"$f":"INDEX({\"\",\"сто \",\"двести \",\"триста \",\"четыреста \",\"пятьсот \",\"шестьсот \",\"семьсот \",\"восемьсот \",\"девятьсот \"},B19+1)","v":""}]
[null,{"$f":"--MID(RIGHT(TEXT(B1,\"000000000000000,00\"),18),14,1)","v":0},{"$f":"CHOOSE(B20+1,\"\",INDEX({\"десять \",\"одиннадцать \",\"двенадцать \",\"тринадцать \",\"четырнадцать \",\"пятнадцать \",\"шестнадцать \",\"семнадцать \",\"восемнадцать \",\"девятнадцать \"},B21+1),\"двадцать \",\"тридцать \",\"сорок \",\"пятьдесят \",\"шестьдесят \",\"семьдесят \",\"восемьдесят \",\"девяносто \")","v":""}]
[null,{"$f":"--MID(RIGHT(TEXT(B1,\"000000000000000,00\"),18),15,1)","v":0},{"$f":"IF(INT(B1)=0,\"ноль \",IF(B20<>1,INDEX({\"\",\"один \",\"два \",\"три \",\"четыре \",\"пять \",\"шесть \",\"семь \",\"восемь \",\"девять \"},B21+1),\"\"))","v":"ноль "}]
[null,null,{"$f":"\"рубл\"&IF(B20=1,\"ей\",LOOKUP(B21,{0,1,2,5},{\"ей\",\"ь\",\"я\",\"ей\"}))","v":"рублей"}]
[null,{"$f":"--RIGHT(TEXT(B1,\"0,00\"),2)","v":0},{"$f":"TEXT(B23,\" 00\\ коп.;;\")","v":""}]
[]
[null,261876543298321,{"$f":"C27&C28&C29&C30&C31&C32&C33&C34&C35&C36&C37&C38&C39&C40&C41&C42&C43&C44&C45&C46&C47","v":"двести шестьдесят один триллион восемьсот семьдесят шесть миллиардов пятьсот сорок три миллиона двести девяносто восемь тысяч триста двадцать один рубль"}]
[]
[null,{"$f":"--MID(RIGHT(TEXT(B25,\"000000000000000,00\"),18),1,1)","v":2},{"$f":"INDEX({\"\",\"сто \",\"двести \",\"триста \",\"четыреста \",\"пятьсот \",\"шестьсот \",\"семьсот \",\"восемьсот \",\"девятьсот \"},B27+1)","v":"двести "}]
[null,{"$f":"--MID(RIGHT(TEXT(B25,\"000000000000000,00\"),18),2,1)","v":6},{"$f":"CHOOSE(B28+1,\"\",INDEX({\"десять \",\"одиннадцать \",\"двенадцать \",\"тринадцать \",\"четырнадцать \",\"пятнадцать \",\"шестнадцать \",\"семнадцать \",\"восемнадцать \",\"девятнадцать \"},B29+1),\"двадцать \",\"тридцать \",\"сорок \",\"пятьдесят \",\"шестьдесят \",\"семьдесят \",\"восемьдесят \",\"девяносто \")","v":"шестьдесят "}]
[null,{"$f":"--MID(RIGHT(TEXT(B25,\"000000000000000,00\"),18),3,1)","v":1},{"$f":"IF(B28<>1,INDEX({\"\",\"один \",\"два \",\"три \",\"четыре \",\"пять \",\"шесть \",\"семь \",\"восемь \",\"девять \"},B29+1),\"\")","v":"один "}]
[null,null,{"$f":"IF(SUM(B27:B29),\"триллион\"&IF(B28=1,\"ов \",LOOKUP(B29,{0,1,2,5},{\"ов \",\" \",\"а \",\"ов \"})),\"\")","v":"триллион "}]
[null,{"$f":"--MID(RIGHT(TEXT(B25,\"000000000000000,00\"),18),4,1)","v":8},{"$f":"INDEX({\"\",\"сто \",\"двести \",\"триста \",\"четыреста \",\"пятьсот \",\"шестьсот \",\"семьсот \",\"восемьсот \",\"девятьсот \"},B31+1)","v":"восемьсот "}]
[null,{"$f":"--MID(RIGHT(TEXT(B25,\"000000000000000,00\"),18),5,1)","v":7},{"$f":"CHOOSE(B32+1,\"\",INDEX({\"десять \",\"одиннадцать \",\"двенадцать \",\"тринадцать \",\"четырнадцать \",\"пятнадцать \",\"шестнадцать \",\"семнадцать \",\"восемнадцать \",\"девятнадцать \"},B33+1),\"двадцать \",\"тридцать \",\"сорок \",\"пятьдесят \",\"шестьдесят \",\"семьдесят \",\"восемьдесят \",\"девяносто \")","v":"семьдесят "}]
[null,{"$f":"--MID(RIGHT(TEXT(B25,\"000000000000000,00\"),18),6,1)","v":6},{"$f":"IF(B32<>1,INDEX({\"\",\"один \",\"два \",\"три \",\"четыре \",\"пять \",\"шесть \",\"семь \",\"восемь \",\"девять \"},B33+1),\"\")","v":"шесть "}]
[null,null,{"$f":"IF(SUM(B31:B33),\"миллиард\"&IF(B32=1,\"ов \",LOOKUP(B33,{0,1,2,5},{\"ов \",\" \",\"а \",\"ов \"})),\"\")","v":"миллиардов "}]
[null,{"$f":"--MID(RIGHT(TEXT(B25,\"000000000000000,00\"),18),7,1)","v":5},{"$f":"INDEX({\"\",\"сто \",\"двести \",\"триста \",\"четыреста \",\"пятьсот \",\"шестьсот \",\"семьсот \",\"восемьсот \",\"девятьсот \"},B35+1)","v":"пятьсот "}]
[null,{"$f":"--MID(RIGHT(TEXT(B25,\"000000000000000,00\"),18),8,1)","v":4},{"$f":"CHOOSE(B36+1,\"\",INDEX({\"десять \",\"одиннадцать \",\"двенадцать \",\"тринадцать \",\"четырнадцать \",\"пятнадцать \",\"шестнадцать \",\"семнадцать \",\"восемнадцать \",\"девятнадцать \"},B37+1),\"двадцать \",\"тридцать \",\"сорок \",\"пятьдесят \",\"шестьдесят \",\"семьдесят \",\"восемьдесят \",\"девяносто \")","v":"сорок "}]
[null,{"$f":"--MID(RIGHT(TEXT(B25,\"000000000000000,00\"),18),9,1)","v":3},{"$f":"IF(B36<>1,INDEX({\"\",\"один \",\"два \",\"три \",\"четыре \",\"пять \",\"шесть \",\"семь \",\"восемь \",\"девять \"},B37+1),\"\")","v":"три "}]
[null,null,{"$f":"IF(SUM(B35:B37),\"миллион\"&IF(B36=1,\"ов \",LOOKUP(B37,{0,1,2,5},{\"ов \",\" \",\"а \",\"ов \"})),\"\")","v":"миллиона "}]
[null,{"$f":"--MID(RIGHT(TEXT(B25,\"000000000000000,00\"),18),10,1)","v":2},{"$f":"INDEX({\"\",\"сто \",\"двести \",\"триста \",\"четыреста \",\"пятьсот \",\"шестьсот \",\"семьсот \",\"восемьсот \",\"девятьсот \"},B39+1)","v":"двести "}]
[null,{"$f":"--MID(RIGHT(TEXT(B25,\"000000000000000,00\"),18),11,1)","v":9},{"$f":"CHOOSE(B40+1,\"\",INDEX({\"десять \",\"одиннадцать \",\"двенадцать \",\"тринадцать \",\"четырнадцать \",\"пятнадцать \",\"шестнадцать \",\"семнадцать \",\"восемнадцать \",\"девятнадцать \"},B41+1),\"двадцать \",\"тридцать \",\"сорок \",\"пятьдесят \",\"шестьдесят \",\"семьдесят \",\"восемьдесят \",\"девяносто \")","v":"девяносто "}]
{"$rows_left_out":31}