{"text_format":"1","workbook":"xlsx","n_sheets":3,"sheets":["Прайс","Себестоимость","Лист3"],"not_rendered":{"charts":0,"images":0,"macros":1,"external_links":0,"defined_names":0,"comments":0,"pivot_tables":0},"unopened":[],"bounds":{"document_bytes":16777216,"sheet_cells":100000,"rows_first":2000,"rows_last":500,"rows_between":2000,"halvings":0,"cell_chars":16384,"cell_head_chars":4096},"cells_cut":0,"cells_raw":0,"read":"whole","date_system":"1900"}

{"sheet":"Прайс","index":0,"n_rows":11,"n_cols":4,"rows_kept":11,"cut":false,"hidden":false,"merged":[]}
["Название","Цена"]
["Резистор 1 ом",1.23]
["Резистор 2 ом",2.11,null,"Заменить на Резистор 2.2 ом"]
["Резистор 3 ом",4.22]
["Резистор 3.3 ом",5.32]
["Резистор 5.6 ом",6.84]
["Резистор 6.9 ом",2.66]
["Плата МК-16",50,null,"Заменить на плату МВ-01"]
["Микросхема 8962",35.36]
["Транзистор 2231",12.58]
["Драйвер 996",39.700000000000003]

{"sheet":"Себестоимость","index":1,"n_rows":13,"n_cols":4,"rows_kept":13,"cut":false,"hidden":false,"merged":[]}
["Название","Кол-во","Цена","Сумма"]
["Резистор 1 ом",2,{"$f":"VLOOKUP(A2,Прайс!$A$2:$B$7,2,0)","v":1.23},{"$f":"C2*B2","v":2.46}]
["Резистор 2 ом",2,{"$f":"VLOOKUP(A3,Прайс!$A$2:$B$7,2,0)","v":2.11},{"$f":"C3*B3","v":4.22}]
["Резистор 3 ом",1,{"$f":"VLOOKUP(A4,Прайс!$A$2:$B$7,2,0)","v":4.22},4.22]
["Резистор 3.3 ом",3,{"$f":"VLOOKUP(A5,Прайс!$A$2:$B$7,2,0)","v":5.32},15.96]
["Резистор 5.6 ом",1,{"$f":"VLOOKUP(A6,Прайс!$A$2:$B$7,2,0)","v":6.84},6.84]
["Резистор 6.9 ом",11,{"$f":"VLOOKUP(A7,Прайс!$A$2:$B$15,2,0)","v":2.66},29.26]
["Плата МК-16",1,{"$f":"VLOOKUP(A8,Прайс!$A$2:$B$15,2,0)","v":50},50]
["Микросхема 8962",2,{"$f":"VLOOKUP(A9,Прайс!$A$2:$B$15,2,0)","v":35.36},70.72]
["Транзистор 2231",4,{"$f":"VLOOKUP(A10,Прайс!$A$2:$B$15,2,0)","v":12.58},50.32]
["Драйвер 996",1,{"$f":"VLOOKUP(A11,Прайс!$A$2:$B$15,2,0)","v":39.700000000000003},39.700000000000003]
["Плата МК-16"]
["ИТОГО",null,null,{"$f":"SUM(D2:D11)","v":273.7}]

{"sheet":"Лист3","index":2,"n_rows":0,"n_cols":0,"rows_kept":0,"cut":false,"hidden":false,"merged":[]}