{"text_format":"1","workbook":"xlsx","n_sheets":3,"sheets":["шаблон для расширенного импорта","текст","результат"],"not_rendered":{"charts":0,"images":0,"macros":1,"external_links":0,"defined_names":1,"comments":0,"pivot_tables":0},"unopened":[],"bounds":{"document_bytes":16777216,"sheet_cells":100000,"rows_first":2000,"rows_last":500,"rows_between":2000,"halvings":0,"cell_chars":16384,"cell_head_chars":4096},"cells_cut":0,"cells_raw":0,"read":"whole","date_system":"1900"}

{"sheet":"шаблон для расширенного импорта","index":0,"n_rows":4,"n_cols":9,"rows_kept":4,"cut":false,"hidden":false,"merged":[]}
["NAME","CITY","ADDRESS","PHONE","CONTACT_PERSON","DUTY","CONTACT_PHONE","EMAIL","INFORMATION"]
["ИМИДЖ ИНТЕРТРЕЙД ЛИМИТЕД КОМПАНИЯ","Москва","103050, Россия, г. Москва, ул. Сущевская, 21-23, строение 1-а, б, в",7373700,"Екатерина Александровна,  Ерошин Роман Сергеевич","начальник отдела кадров, руководитель","0, 73737",", info@image.ru","Численность 15 чел. может понадобится любая из услуг\"факс\" 7377580\"Продукция и услуги\"продукция электронной промышленности/ принтеры/ сканеры/ копировальная техника/ компьютеры/ расходные материалы для копировально-множительной техники/ фототовары/ ноутбуки/ \"Отрасль\" Медцентр4, test,tes,test, test,tes,test, test,tes,test, test,tes,test, test,tes,test, test,tes,test"]
["ВИКТОРИЯ МАГАЗИН (ООО)","Москва","119019, Россия, г. Москва, пер. Сивцев Вражек, 8/16",2031854,"Наталья Михайловна, Шкулев Михаил Витальевич,Екатерина Александровна,  Ерошин Роман Сергеевич","ген.директор, руководитель, начальник отдела кадров, руководитель","33230, 2031854,0,4345"," ,push11@yandex.ru,, info@image.ru","16 чел. Предложение интересно, мед.книжки2032724 мясо и птица/ рыба/ морепродукты/ бакалея/ молочные товары/ плодоовощные товары/ Медцентр4, test,tes,test, test,tes,test, test,tes,test, test,tes,test, test,tes,test, test,tes,test, test,tes,test, test,tes,test, test,tes,test, test,tes,test, test,tes,test, test,tes,test, test,tes,test"]
["КИНОАФИША КАФЕ","Москва","123242, Россия, г. Москва, ул. Дружинниковская, 15","2559844, 2559845","Анна Григорьевна","директор",2559844,null,"18 чел. может понадобится любая из услуг 2559844, 2559845 услуги ресторанов/ европейская кухня/ кавказская кухня/ Медцентр4, test,tes,test, test,tes,test, test,tes,test, test,tes,test, test,tes,test, test,tes,test, test,tes,test, test,tes,test, test,tes,test, test,tes,test, test,tes,test, test,tes,test, test,tes,test, test,tes,test, test,tes,test, test,tes,test, test,tes,test, test,tes,test, test,tes,test, test,tes,test, test,tes,test"]

{"sheet":"текст","index":1,"n_rows":263,"n_cols":9,"rows_kept":263,"cut":false,"hidden":false,"merged":[]}
["12 МЕСЯЦЕВ; 115191, Москва, Тульская Б. ул., 2\r"," (р-н) ЮАО:Даниловский; ст.м. Тульская (рядом)\r"," :: СУПЕРМАРКЕТЫ\r"," тел.: 775-2222 доб.1302 - Охрана\r"," факс: 958-4466\r"," web-стр.: www.12month.ru; www.12mn.ru\r"," кред. карты: mastercard, visa\r"," время работы: 24\r"]
["12 МЕСЯЦЕВ; 127299, Москва, Академическая Б. ул., 24, к.1\r"," (р-н) САО:Коптево; ст.м. Войковская (2000м на ЮЗ), Сокол (2250м на ЮЗ)\r"," :: СУПЕРМАРКЕТЫ\r"," тел.: 775-2222 доб.1924\r"," факс: 450-8033\r"," web-стр.: www.12month.ru\r"," кред. карты: mastercard, visa\r"," время работы: 24\r"]
["12 МЕСЯЦЕВ; 119019, Москва, Арбат Нов. ул., 11, стр.1\r"," (р-н) ЦАО:Арбат; ст.м. Арбатская (Филевская линия) (350м на В)\r"," :: СУПЕРМАРКЕТЫ\r"," тел.: 691-1034\r"," web-стр.: www.12month.ru\r"," время работы: 24\r"]
["12 МЕСЯЦЕВ; 123182, Москва, Василевского Маршала ул., 17\r"," (р-н) СЗАО:Щукино; ст.м. Щукинская (рядом)!\r"," :: СУПЕРМАРКЕТЫ\r"," тел.: 775-2222 доб.1424 - Справочная\r"," факс: (499) 190-0030\r"," web-стр.: www.12month.ru\r"," кред. карты: *любые\r"," время работы: 24\r"]
["12 МЕСЯЦЕВ; 111539, Москва, Вешняковская ул., 17А\r"," (р-н) ВАО:Вешняки; ст.м. Выхино (2200м на ЮЗ)!, Новогиреево (2000м на СЗ)\r"," :: СУПЕРМАРКЕТЫ\r"," тел.: 775-2222 доб.2124 - Директор\r"," факс: 370-9620\r"," web-стр.: www.12month.ru\r"," кред. карты: mastercard, visa\r"," время работы: 9-23\r"]
["12 МЕСЯЦЕВ; 125480, Москва, Героев Панфиловцев ул., 7\r"," (р-н) СЗАО:Тушино Северное; ст.м. Планерная (400м на СВ)!, Сходненская (750м на ЮВ)\r"," :: СУПЕРМАРКЕТЫ\r"," тел.: 775-2222 доб.2024\r"," web-стр.: www.12month.ru\r"," кред. карты: mastercard, visa\r"," время работы: 9-23\r"]
["12 МЕСЯЦЕВ; 105118, Москва, Измайловское шоссе, 6\r"," (р-н) ВАО:Соколиная гора; ст.м. Семеновская (450м на СЗ)\r"," :: СУПЕРМАРКЕТЫ\r"," тел.: 775-2222 доб.2602\r"," web-стр.: www.12month.ru\r"," кред. карты: *любые\r"," время работы: 9-23\r"]
["12 МЕСЯЦЕВ; 115304, Москва, Кантемировская ул., 6, к.1\r"," (р-н) ЮАО:Москворечье-Сабурово; ст.м. Кантемировская (1300м на З)!, Царицыно (1750м на ЮЗ)\r"," :: СУПЕРМАРКЕТЫ\r"," тел.: 775-2222 доб.1724\r"," web-стр.: www.12month.ru\r"," кред. карты: mastercard, visa\r"," время работы: 9-23\r"]
["12 МЕСЯЦЕВ; 109651, Москва, Новочеркасский бульв., 27, стр.1\r"," (р-н) ЮВАО:Марьино; ст.м. Марьино (1650м на В)!\r"," :: СУПЕРМАРКЕТЫ\r"," тел.: 775-2222 доб.1806 - Администратор\r"," web-стр.: www.12month.ru\r"," кред. карты: mastercard, visa\r"," время работы: 9-23\r"]
["12 МЕСЯЦЕВ; 125310, Москва, Пятницкое шоссе, 3\r"," (р-н) СЗАО:Митино; ст.м. Тушинская (3350м на В)!, Волоколамская (рядом)\r"," :: СУПЕРМАРКЕТЫ\r"," тел.: 775-8181\r"," факс: 789-9472\r"," web-стр.: www.12month.ru\r"," время работы: 9-23\r"]
["12 МЕСЯЦЕВ; 115191, Москва, Серпуховский Вал ул., 17\r"," (р-н) ЮАО:Даниловский; ст.м. Тульская (700м на В)!, Шаболовская (900м на СЗ)\r"," :: СУПЕРМАРКЕТЫ\r"," тел.: 775-2222 доб.1624\r"," факс: 954-4543\r"," web-стр.: www.12month.ru\r"," кред. карты: mastercard, visa\r"," время работы: 24\r"]
["12 МЕСЯЦЕВ; 125363, Москва, Сходненская ул., 25\r"," (р-н) СЗАО:Тушино Южное; ст.м. Сходненская (400м на С)!\r"," :: СУПЕРМАРКЕТЫ\r"," тел.: 775-2222 доб.1124 - Администратор\r"," web-стр.: www.12month.ru\r"," кред. карты: mastercard, visa\r"," время работы: 24\r"]
["12 МЕСЯЦЕВ; 107065, Москва, Хабаровская ул., 15\r"," (р-н) ВАО:Гольяново; ст.м. Щелковская (2000м на ЮЗ)!\r"," :: СУПЕРМАРКЕТЫ\r"," тел.: 775-2222 доб.2206 - Администратор\r"," web-стр.: www.12month.ru\r"," время работы: 24\r"]
["12 МЕСЯЦЕВ; 115551, Москва, Шипиловский проезд, 39, к.2\r"," (р-н) ЮАО:Орехово-Борисово Северное; ст.м. Орехово (рядом)!\r"," :: СУПЕРМАРКЕТЫ\r"," тел.: 775-2222 доб.1524 - Администратор\r"," web-стр.: www.12month.ru\r"," кред. карты: mastercard, visa\r"," время работы: 8-23\r"]
["12 МЕСЯЦЕВ; 109390, Москва, Юных Ленинцев ул., 7, к.1\r"," (р-н) ЮВАО:Текстильщики; ст.м. Текстильщики (1100м на СЗ)!, Печатники (1100м на ЮЗ), Волжская (1150м на ЮВ)\r"," :: СУПЕРМАРКЕТЫ\r"," тел.: 775-2222 доб.1206 - Администратор\r"," web-стр.: www.12month.ru\r"," кред. карты: mastercard, visa\r"," время работы: 9-23\r"]
["12 МЕСЯЦЕВ; 140003, Московская область, Люберцы г., Городок Б, 53А\r"," :: СУПЕРМАРКЕТЫ\r"," тел.: 775-2222 доб.2328\r"," web-стр.: www.12month.ru\r"," время работы: 24\r"]
["12 МЕСЯЦЕВ; 249020, Калужская область, Обнинск г., Карла Маркса просп., 114\r"," :: СУПЕРМАРКЕТЫ\r"," тел.: 775-2222 доб.2524\r"," web-стр.: www.12month.ru\r"," время работы: 24\r"]
["24 ЧАСА УНИВЕРСАМ; 129343, Москва, Берингов проезд, 3, стр.5\r"," (р-н) СВАО:Свиблово; ст.м. Свиблово (300м на ЮЗ)\r"," :: СУПЕРМАРКЕТЫ\r"," тел.: (499) 189-7227 - Администрация\r"," факс: (499) 186-2283\r"," кред. карты: mastercard, visa, visa electron\r"," время работы: 24\r"]
["24 ЧАСА УНИВЕРСАМ; 111020, Москва, Юрьевский пер., 16, к.2\r"," (р-н) ЮВАО:Лефортово; ст.м. Авиамоторная (1500м на Ю), Семеновская (1900м на С), Электрозаводская (1950м на СЗ)\r"," :: СУПЕРМАРКЕТЫ\r"," тел.: 360-2156\r"," время работы: 24\r"]
["№66; 143408, Московская область, Красногорск г., Карбышева ул., 17А\r"," :: СУПЕРМАРКЕТЫ\r"," тел.: 563-3598 - Приемная\r"," факс: 563-3598\r"," кред. карты: *любые\r"," время работы: 24\r"]
{"$rows_left_out":244}
{"sheet":"результат","index":2,"n_rows":270,"n_cols":10,"rows_kept":270,"cut":false,"hidden":false,"merged":[]}
[null,"NAME","CITY","ADDRESS","PHONE","CONTACT_PERSON","DUTY","CONTACT_PHONE","EMAIL","INFORMATION"]
[]
[{"$f":"текст!A1","v":"12 МЕСЯЦЕВ; 115191, Москва, Тульская Б. ул., 2\r"},{"$f":"TRIM(LEFT(A3,FIND(\";\",A3,1)-1))","v":"12 МЕСЯЦЕВ"},{"$f":"MID(A3,LEN(B3)+(SUMPRODUCT(IFERROR(SEARCH(\"; \"&{0,1,2,3,4,5,6,7,8,9},A3,1),0))>0)*8+3,SEARCH(\",\",A3,LEN(B3)+(SUMPRODUCT(IFERROR(SEARCH(\"; \"&{0,1,2,3,4,5,6,7,8,9},A3,1),0))>0)*8+3)-LEN(B3)-(SUMPRODUCT(IFERROR(SEARCH(\"; \"&{0,1,2,3,4,5,6,7,8,9},A3,1),0))>0)*8-3)","v":"Москва"},{"$f":"TRIM(MID(A3,LEN(B3)+(SUMPRODUCT(IFERROR(SEARCH(\"; \"&{0,1,2,3,4,5,6,7,8,9},A3,1),0))>0)*8+4 +LEN(C3),1000))","v":"Тульская Б. ул., 2\r"},{"$f":"IFERROR(MID(HLOOKUP(\" тел.:*\",текст!$A1:$W1,1,0),8,1000),\"\")","v":"775-2222 доб.1302 - Охрана\r"},null,null,null,null,{"$f":"IFERROR(MID(HLOOKUP(\" web-стр.: *\",текст!$A1:$W1,1,0),11,1000),\"\")","v":" www.12month.ru; www.12mn.ru\r"}]
[{"$f":"текст!A2","v":"12 МЕСЯЦЕВ; 127299, Москва, Академическая Б. ул., 24, к.1\r"},{"$f":"TRIM(LEFT(A4,FIND(\";\",A4,1)-1))","v":"12 МЕСЯЦЕВ"},{"$f":"MID(A4,LEN(B4)+(SUMPRODUCT(IFERROR(SEARCH(\"; \"&{0,1,2,3,4,5,6,7,8,9},A4,1),0))>0)*8+3,SEARCH(\",\",A4,LEN(B4)+(SUMPRODUCT(IFERROR(SEARCH(\"; \"&{0,1,2,3,4,5,6,7,8,9},A4,1),0))>0)*8+3)-LEN(B4)-(SUMPRODUCT(IFERROR(SEARCH(\"; \"&{0,1,2,3,4,5,6,7,8,9},A4,1),0))>0)*8-3)","v":"Москва"},{"$f":"TRIM(MID(A4,LEN(B4)+(SUMPRODUCT(IFERROR(SEARCH(\"; \"&{0,1,2,3,4,5,6,7,8,9},A4,1),0))>0)*8+4 +LEN(C4),1000))","v":"Академическая Б. ул., 24, к.1\r"},{"$f":"IFERROR(MID(HLOOKUP(\" тел.:*\",текст!$A2:$W2,1,0),8,1000),\"\")","v":"775-2222 доб.1924\r"},null,null,null,null,{"$f":"IFERROR(MID(HLOOKUP(\" web-стр.: *\",текст!$A2:$W2,1,0),11,1000),\"\")","v":" www.12month.ru\r"}]
[{"$f":"текст!A3","v":"12 МЕСЯЦЕВ; 119019, Москва, Арбат Нов. ул., 11, стр.1\r"},"12 МЕСЯЦЕВ",{"$f":"MID(A5,LEN(B5)+(SUMPRODUCT(IFERROR(SEARCH(\"; \"&{0,1,2,3,4,5,6,7,8,9},A5,1),0))>0)*8+3,SEARCH(\",\",A5,LEN(B5)+(SUMPRODUCT(IFERROR(SEARCH(\"; \"&{0,1,2,3,4,5,6,7,8,9},A5,1),0))>0)*8+3)-LEN(B5)-(SUMPRODUCT(IFERROR(SEARCH(\"; \"&{0,1,2,3,4,5,6,7,8,9},A5,1),0))>0)*8-3)","v":"Москва"},{"$f":"TRIM(MID(A5,LEN(B5)+(SUMPRODUCT(IFERROR(SEARCH(\"; \"&{0,1,2,3,4,5,6,7,8,9},A5,1),0))>0)*8+4 +LEN(C5),1000))","v":"Арбат Нов. ул., 11, стр.1\r"},{"$f":"IFERROR(MID(HLOOKUP(\" тел.:*\",текст!$A3:$W3,1,0),8,1000),\"\")","v":"691-1034\r"},null,null,null,null,{"$f":"IFERROR(MID(HLOOKUP(\" web-стр.: *\",текст!$A3:$W3,1,0),11,1000),\"\")","v":" www.12month.ru\r"}]
[{"$f":"текст!A4","v":"12 МЕСЯЦЕВ; 123182, Москва, Василевского Маршала ул., 17\r"},"12 МЕСЯЦЕВ",{"$f":"MID(A6,LEN(B6)+(SUMPRODUCT(IFERROR(SEARCH(\"; \"&{0,1,2,3,4,5,6,7,8,9},A6,1),0))>0)*8+3,SEARCH(\",\",A6,LEN(B6)+(SUMPRODUCT(IFERROR(SEARCH(\"; \"&{0,1,2,3,4,5,6,7,8,9},A6,1),0))>0)*8+3)-LEN(B6)-(SUMPRODUCT(IFERROR(SEARCH(\"; \"&{0,1,2,3,4,5,6,7,8,9},A6,1),0))>0)*8-3)","v":"Москва"},{"$f":"TRIM(MID(A6,LEN(B6)+(SUMPRODUCT(IFERROR(SEARCH(\"; \"&{0,1,2,3,4,5,6,7,8,9},A6,1),0))>0)*8+4 +LEN(C6),1000))","v":"Василевского Маршала ул., 17\r"},{"$f":"IFERROR(MID(HLOOKUP(\" тел.:*\",текст!$A4:$W4,1,0),8,1000),\"\")","v":"775-2222 доб.1424 - Справочная\r"},null,null,null,null,{"$f":"IFERROR(MID(HLOOKUP(\" web-стр.: *\",текст!$A4:$W4,1,0),11,1000),\"\")","v":" www.12month.ru\r"}]
[{"$f":"текст!A5","v":"12 МЕСЯЦЕВ; 111539, Москва, Вешняковская ул., 17А\r"},"12 МЕСЯЦЕВ",{"$f":"MID(A7,LEN(B7)+(SUMPRODUCT(IFERROR(SEARCH(\"; \"&{0,1,2,3,4,5,6,7,8,9},A7,1),0))>0)*8+3,SEARCH(\",\",A7,LEN(B7)+(SUMPRODUCT(IFERROR(SEARCH(\"; \"&{0,1,2,3,4,5,6,7,8,9},A7,1),0))>0)*8+3)-LEN(B7)-(SUMPRODUCT(IFERROR(SEARCH(\"; \"&{0,1,2,3,4,5,6,7,8,9},A7,1),0))>0)*8-3)","v":"Москва"},{"$f":"TRIM(MID(A7,LEN(B7)+(SUMPRODUCT(IFERROR(SEARCH(\"; \"&{0,1,2,3,4,5,6,7,8,9},A7,1),0))>0)*8+4 +LEN(C7),1000))","v":"Вешняковская ул., 17А\r"},{"$f":"IFERROR(MID(HLOOKUP(\" тел.:*\",текст!$A5:$W5,1,0),8,1000),\"\")","v":"775-2222 доб.2124 - Директор\r"},null,null,null,null,{"$f":"IFERROR(MID(HLOOKUP(\" web-стр.: *\",текст!$A5:$W5,1,0),11,1000),\"\")","v":" www.12month.ru\r"}]
[{"$f":"текст!A6","v":"12 МЕСЯЦЕВ; 125480, Москва, Героев Панфиловцев ул., 7\r"},"12 МЕСЯЦЕВ",{"$f":"MID(A8,LEN(B8)+(SUMPRODUCT(IFERROR(SEARCH(\"; \"&{0,1,2,3,4,5,6,7,8,9},A8,1),0))>0)*8+3,SEARCH(\",\",A8,LEN(B8)+(SUMPRODUCT(IFERROR(SEARCH(\"; \"&{0,1,2,3,4,5,6,7,8,9},A8,1),0))>0)*8+3)-LEN(B8)-(SUMPRODUCT(IFERROR(SEARCH(\"; \"&{0,1,2,3,4,5,6,7,8,9},A8,1),0))>0)*8-3)","v":"Москва"},{"$f":"TRIM(MID(A8,LEN(B8)+(SUMPRODUCT(IFERROR(SEARCH(\"; \"&{0,1,2,3,4,5,6,7,8,9},A8,1),0))>0)*8+4 +LEN(C8),1000))","v":"Героев Панфиловцев ул., 7\r"},{"$f":"IFERROR(MID(HLOOKUP(\" тел.:*\",текст!$A6:$W6,1,0),8,1000),\"\")","v":"775-2222 доб.2024\r"},null,null,null,null,{"$f":"IFERROR(MID(HLOOKUP(\" web-стр.: *\",текст!$A6:$W6,1,0),11,1000),\"\")","v":" www.12month.ru\r"}]
[{"$f":"текст!A7","v":"12 МЕСЯЦЕВ; 105118, Москва, Измайловское шоссе, 6\r"},"12 МЕСЯЦЕВ",{"$f":"MID(A9,LEN(B9)+(SUMPRODUCT(IFERROR(SEARCH(\"; \"&{0,1,2,3,4,5,6,7,8,9},A9,1),0))>0)*8+3,SEARCH(\",\",A9,LEN(B9)+(SUMPRODUCT(IFERROR(SEARCH(\"; \"&{0,1,2,3,4,5,6,7,8,9},A9,1),0))>0)*8+3)-LEN(B9)-(SUMPRODUCT(IFERROR(SEARCH(\"; \"&{0,1,2,3,4,5,6,7,8,9},A9,1),0))>0)*8-3)","v":"Москва"},{"$f":"TRIM(MID(A9,LEN(B9)+(SUMPRODUCT(IFERROR(SEARCH(\"; \"&{0,1,2,3,4,5,6,7,8,9},A9,1),0))>0)*8+4 +LEN(C9),1000))","v":"Измайловское шоссе, 6\r"},{"$f":"IFERROR(MID(HLOOKUP(\" тел.:*\",текст!$A7:$W7,1,0),8,1000),\"\")","v":"775-2222 доб.2602\r"},null,null,null,null,{"$f":"IFERROR(MID(HLOOKUP(\" web-стр.: *\",текст!$A7:$W7,1,0),11,1000),\"\")","v":" www.12month.ru\r"}]
[{"$f":"текст!A8","v":"12 МЕСЯЦЕВ; 115304, Москва, Кантемировская ул., 6, к.1\r"},"12 МЕСЯЦЕВ",{"$f":"MID(A10,LEN(B10)+(SUMPRODUCT(IFERROR(SEARCH(\"; \"&{0,1,2,3,4,5,6,7,8,9},A10,1),0))>0)*8+3,SEARCH(\",\",A10,LEN(B10)+(SUMPRODUCT(IFERROR(SEARCH(\"; \"&{0,1,2,3,4,5,6,7,8,9},A10,1),0))>0)*8+3)-LEN(B10)-(SUMPRODUCT(IFERROR(SEARCH(\"; \"&{0,1,2,3,4,5,6,7,8,9},A10,1),0))>0)*8-3)","v":"Москва"},{"$f":"TRIM(MID(A10,LEN(B10)+(SUMPRODUCT(IFERROR(SEARCH(\"; \"&{0,1,2,3,4,5,6,7,8,9},A10,1),0))>0)*8+4 +LEN(C10),1000))","v":"Кантемировская ул., 6, к.1\r"},{"$f":"IFERROR(MID(HLOOKUP(\" тел.:*\",текст!$A8:$W8,1,0),8,1000),\"\")","v":"775-2222 доб.1724\r"},null,null,null,null,{"$f":"IFERROR(MID(HLOOKUP(\" web-стр.: *\",текст!$A8:$W8,1,0),11,1000),\"\")","v":" www.12month.ru\r"}]
[{"$f":"текст!A9","v":"12 МЕСЯЦЕВ; 109651, Москва, Новочеркасский бульв., 27, стр.1\r"},"12 МЕСЯЦЕВ",{"$f":"MID(A11,LEN(B11)+(SUMPRODUCT(IFERROR(SEARCH(\"; \"&{0,1,2,3,4,5,6,7,8,9},A11,1),0))>0)*8+3,SEARCH(\",\",A11,LEN(B11)+(SUMPRODUCT(IFERROR(SEARCH(\"; \"&{0,1,2,3,4,5,6,7,8,9},A11,1),0))>0)*8+3)-LEN(B11)-(SUMPRODUCT(IFERROR(SEARCH(\"; \"&{0,1,2,3,4,5,6,7,8,9},A11,1),0))>0)*8-3)","v":"Москва"},{"$f":"TRIM(MID(A11,LEN(B11)+(SUMPRODUCT(IFERROR(SEARCH(\"; \"&{0,1,2,3,4,5,6,7,8,9},A11,1),0))>0)*8+4 +LEN(C11),1000))","v":"Новочеркасский бульв., 27, стр.1\r"},{"$f":"IFERROR(MID(HLOOKUP(\" тел.:*\",текст!$A9:$W9,1,0),8,1000),\"\")","v":"775-2222 доб.1806 - Администратор\r"},null,null,null,null,{"$f":"IFERROR(MID(HLOOKUP(\" web-стр.: *\",текст!$A9:$W9,1,0),11,1000),\"\")","v":" www.12month.ru\r"}]
[{"$f":"текст!A10","v":"12 МЕСЯЦЕВ; 125310, Москва, Пятницкое шоссе, 3\r"},"12 МЕСЯЦЕВ",{"$f":"MID(A12,LEN(B12)+(SUMPRODUCT(IFERROR(SEARCH(\"; \"&{0,1,2,3,4,5,6,7,8,9},A12,1),0))>0)*8+3,SEARCH(\",\",A12,LEN(B12)+(SUMPRODUCT(IFERROR(SEARCH(\"; \"&{0,1,2,3,4,5,6,7,8,9},A12,1),0))>0)*8+3)-LEN(B12)-(SUMPRODUCT(IFERROR(SEARCH(\"; \"&{0,1,2,3,4,5,6,7,8,9},A12,1),0))>0)*8-3)","v":"Москва"},{"$f":"TRIM(MID(A12,LEN(B12)+(SUMPRODUCT(IFERROR(SEARCH(\"; \"&{0,1,2,3,4,5,6,7,8,9},A12,1),0))>0)*8+4 +LEN(C12),1000))","v":"Пятницкое шоссе, 3\r"},{"$f":"IFERROR(MID(HLOOKUP(\" тел.:*\",текст!$A10:$W10,1,0),8,1000),\"\")","v":"775-8181\r"},null,null,null,null,{"$f":"IFERROR(MID(HLOOKUP(\" web-стр.: *\",текст!$A10:$W10,1,0),11,1000),\"\")","v":" www.12month.ru\r"}]
[{"$f":"текст!A11","v":"12 МЕСЯЦЕВ; 115191, Москва, Серпуховский Вал ул., 17\r"},"12 МЕСЯЦЕВ",{"$f":"MID(A13,LEN(B13)+(SUMPRODUCT(IFERROR(SEARCH(\"; \"&{0,1,2,3,4,5,6,7,8,9},A13,1),0))>0)*8+3,SEARCH(\",\",A13,LEN(B13)+(SUMPRODUCT(IFERROR(SEARCH(\"; \"&{0,1,2,3,4,5,6,7,8,9},A13,1),0))>0)*8+3)-LEN(B13)-(SUMPRODUCT(IFERROR(SEARCH(\"; \"&{0,1,2,3,4,5,6,7,8,9},A13,1),0))>0)*8-3)","v":"Москва"},{"$f":"TRIM(MID(A13,LEN(B13)+(SUMPRODUCT(IFERROR(SEARCH(\"; \"&{0,1,2,3,4,5,6,7,8,9},A13,1),0))>0)*8+4 +LEN(C13),1000))","v":"Серпуховский Вал ул., 17\r"},{"$f":"IFERROR(MID(HLOOKUP(\" тел.:*\",текст!$A11:$W11,1,0),8,1000),\"\")","v":"775-2222 доб.1624\r"},null,null,null,null,{"$f":"IFERROR(MID(HLOOKUP(\" web-стр.: *\",текст!$A11:$W11,1,0),11,1000),\"\")","v":" www.12month.ru\r"}]
[{"$f":"текст!A12","v":"12 МЕСЯЦЕВ; 125363, Москва, Сходненская ул., 25\r"},"12 МЕСЯЦЕВ",{"$f":"MID(A14,LEN(B14)+(SUMPRODUCT(IFERROR(SEARCH(\"; \"&{0,1,2,3,4,5,6,7,8,9},A14,1),0))>0)*8+3,SEARCH(\",\",A14,LEN(B14)+(SUMPRODUCT(IFERROR(SEARCH(\"; \"&{0,1,2,3,4,5,6,7,8,9},A14,1),0))>0)*8+3)-LEN(B14)-(SUMPRODUCT(IFERROR(SEARCH(\"; \"&{0,1,2,3,4,5,6,7,8,9},A14,1),0))>0)*8-3)","v":"Москва"},{"$f":"TRIM(MID(A14,LEN(B14)+(SUMPRODUCT(IFERROR(SEARCH(\"; \"&{0,1,2,3,4,5,6,7,8,9},A14,1),0))>0)*8+4 +LEN(C14),1000))","v":"Сходненская ул., 25\r"},{"$f":"IFERROR(MID(HLOOKUP(\" тел.:*\",текст!$A12:$W12,1,0),8,1000),\"\")","v":"775-2222 доб.1124 - Администратор\r"},null,null,null,null,{"$f":"IFERROR(MID(HLOOKUP(\" web-стр.: *\",текст!$A12:$W12,1,0),11,1000),\"\")","v":" www.12month.ru\r"}]
[{"$f":"текст!A13","v":"12 МЕСЯЦЕВ; 107065, Москва, Хабаровская ул., 15\r"},"12 МЕСЯЦЕВ",{"$f":"MID(A15,LEN(B15)+(SUMPRODUCT(IFERROR(SEARCH(\"; \"&{0,1,2,3,4,5,6,7,8,9},A15,1),0))>0)*8+3,SEARCH(\",\",A15,LEN(B15)+(SUMPRODUCT(IFERROR(SEARCH(\"; \"&{0,1,2,3,4,5,6,7,8,9},A15,1),0))>0)*8+3)-LEN(B15)-(SUMPRODUCT(IFERROR(SEARCH(\"; \"&{0,1,2,3,4,5,6,7,8,9},A15,1),0))>0)*8-3)","v":"Москва"},{"$f":"TRIM(MID(A15,LEN(B15)+(SUMPRODUCT(IFERROR(SEARCH(\"; \"&{0,1,2,3,4,5,6,7,8,9},A15,1),0))>0)*8+4 +LEN(C15),1000))","v":"Хабаровская ул., 15\r"},{"$f":"IFERROR(MID(HLOOKUP(\" тел.:*\",текст!$A13:$W13,1,0),8,1000),\"\")","v":"775-2222 доб.2206 - Администратор\r"},null,null,null,null,{"$f":"IFERROR(MID(HLOOKUP(\" web-стр.: *\",текст!$A13:$W13,1,0),11,1000),\"\")","v":" www.12month.ru\r"}]
[{"$f":"текст!A14","v":"12 МЕСЯЦЕВ; 115551, Москва, Шипиловский проезд, 39, к.2\r"},"12 МЕСЯЦЕВ",{"$f":"MID(A16,LEN(B16)+(SUMPRODUCT(IFERROR(SEARCH(\"; \"&{0,1,2,3,4,5,6,7,8,9},A16,1),0))>0)*8+3,SEARCH(\",\",A16,LEN(B16)+(SUMPRODUCT(IFERROR(SEARCH(\"; \"&{0,1,2,3,4,5,6,7,8,9},A16,1),0))>0)*8+3)-LEN(B16)-(SUMPRODUCT(IFERROR(SEARCH(\"; \"&{0,1,2,3,4,5,6,7,8,9},A16,1),0))>0)*8-3)","v":"Москва"},{"$f":"TRIM(MID(A16,LEN(B16)+(SUMPRODUCT(IFERROR(SEARCH(\"; \"&{0,1,2,3,4,5,6,7,8,9},A16,1),0))>0)*8+4 +LEN(C16),1000))","v":"Шипиловский проезд, 39, к.2\r"},{"$f":"IFERROR(MID(HLOOKUP(\" тел.:*\",текст!$A14:$W14,1,0),8,1000),\"\")","v":"775-2222 доб.1524 - Администратор\r"},null,null,null,null,{"$f":"IFERROR(MID(HLOOKUP(\" web-стр.: *\",текст!$A14:$W14,1,0),11,1000),\"\")","v":" www.12month.ru\r"}]
[{"$f":"текст!A15","v":"12 МЕСЯЦЕВ; 109390, Москва, Юных Ленинцев ул., 7, к.1\r"},"12 МЕСЯЦЕВ",{"$f":"MID(A17,LEN(B17)+(SUMPRODUCT(IFERROR(SEARCH(\"; \"&{0,1,2,3,4,5,6,7,8,9},A17,1),0))>0)*8+3,SEARCH(\",\",A17,LEN(B17)+(SUMPRODUCT(IFERROR(SEARCH(\"; \"&{0,1,2,3,4,5,6,7,8,9},A17,1),0))>0)*8+3)-LEN(B17)-(SUMPRODUCT(IFERROR(SEARCH(\"; \"&{0,1,2,3,4,5,6,7,8,9},A17,1),0))>0)*8-3)","v":"Москва"},{"$f":"TRIM(MID(A17,LEN(B17)+(SUMPRODUCT(IFERROR(SEARCH(\"; \"&{0,1,2,3,4,5,6,7,8,9},A17,1),0))>0)*8+4 +LEN(C17),1000))","v":"Юных Ленинцев ул., 7, к.1\r"},{"$f":"IFERROR(MID(HLOOKUP(\" тел.:*\",текст!$A15:$W15,1,0),8,1000),\"\")","v":"775-2222 доб.1206 - Администратор\r"},null,null,null,null,{"$f":"IFERROR(MID(HLOOKUP(\" web-стр.: *\",текст!$A15:$W15,1,0),11,1000),\"\")","v":" www.12month.ru\r"}]
[{"$f":"текст!A16","v":"12 МЕСЯЦЕВ; 140003, Московская область, Люберцы г., Городок Б, 53А\r"},"12 МЕСЯЦЕВ",{"$f":"MID(A18,LEN(B18)+(SUMPRODUCT(IFERROR(SEARCH(\"; \"&{0,1,2,3,4,5,6,7,8,9},A18,1),0))>0)*8+3,SEARCH(\",\",A18,LEN(B18)+(SUMPRODUCT(IFERROR(SEARCH(\"; \"&{0,1,2,3,4,5,6,7,8,9},A18,1),0))>0)*8+3)-LEN(B18)-(SUMPRODUCT(IFERROR(SEARCH(\"; \"&{0,1,2,3,4,5,6,7,8,9},A18,1),0))>0)*8-3)","v":"Московская область"},{"$f":"TRIM(MID(A18,LEN(B18)+(SUMPRODUCT(IFERROR(SEARCH(\"; \"&{0,1,2,3,4,5,6,7,8,9},A18,1),0))>0)*8+4 +LEN(C18),1000))","v":"Люберцы г., Городок Б, 53А\r"},{"$f":"IFERROR(MID(HLOOKUP(\" тел.:*\",текст!$A16:$W16,1,0),8,1000),\"\")","v":"775-2222 доб.2328\r"},null,null,null,null,{"$f":"IFERROR(MID(HLOOKUP(\" web-стр.: *\",текст!$A16:$W16,1,0),11,1000),\"\")","v":" www.12month.ru\r"}]
[{"$f":"текст!A17","v":"12 МЕСЯЦЕВ; 249020, Калужская область, Обнинск г., Карла Маркса просп., 114\r"},"12 МЕСЯЦЕВ",{"$f":"MID(A19,LEN(B19)+(SUMPRODUCT(IFERROR(SEARCH(\"; \"&{0,1,2,3,4,5,6,7,8,9},A19,1),0))>0)*8+3,SEARCH(\",\",A19,LEN(B19)+(SUMPRODUCT(IFERROR(SEARCH(\"; \"&{0,1,2,3,4,5,6,7,8,9},A19,1),0))>0)*8+3)-LEN(B19)-(SUMPRODUCT(IFERROR(SEARCH(\"; \"&{0,1,2,3,4,5,6,7,8,9},A19,1),0))>0)*8-3)","v":"Калужская область"},{"$f":"TRIM(MID(A19,LEN(B19)+(SUMPRODUCT(IFERROR(SEARCH(\"; \"&{0,1,2,3,4,5,6,7,8,9},A19,1),0))>0)*8+4 +LEN(C19),1000))","v":"Обнинск г., Карла Маркса просп., 114\r"},{"$f":"IFERROR(MID(HLOOKUP(\" тел.:*\",текст!$A17:$W17,1,0),8,1000),\"\")","v":"775-2222 доб.2524\r"},null,null,null,null,{"$f":"IFERROR(MID(HLOOKUP(\" web-стр.: *\",текст!$A17:$W17,1,0),11,1000),\"\")","v":" www.12month.ru\r"}]
[{"$f":"текст!A18","v":"24 ЧАСА УНИВЕРСАМ; 129343, Москва, Берингов проезд, 3, стр.5\r"},"24 ЧАСА УНИВЕРСАМ",{"$f":"MID(A20,LEN(B20)+(SUMPRODUCT(IFERROR(SEARCH(\"; \"&{0,1,2,3,4,5,6,7,8,9},A20,1),0))>0)*8+3,SEARCH(\",\",A20,LEN(B20)+(SUMPRODUCT(IFERROR(SEARCH(\"; \"&{0,1,2,3,4,5,6,7,8,9},A20,1),0))>0)*8+3)-LEN(B20)-(SUMPRODUCT(IFERROR(SEARCH(\"; \"&{0,1,2,3,4,5,6,7,8,9},A20,1),0))>0)*8-3)","v":"Москва"},{"$f":"TRIM(MID(A20,LEN(B20)+(SUMPRODUCT(IFERROR(SEARCH(\"; \"&{0,1,2,3,4,5,6,7,8,9},A20,1),0))>0)*8+4 +LEN(C20),1000))","v":"Берингов проезд, 3, стр.5\r"},{"$f":"IFERROR(MID(HLOOKUP(\" тел.:*\",текст!$A18:$W18,1,0),8,1000),\"\")","v":"(499) 189-7227 - Администрация\r"},null,null,null,null,{"$f":"IFERROR(MID(HLOOKUP(\" web-стр.: *\",текст!$A18:$W18,1,0),11,1000),\"\")","v":""}]
{"$rows_left_out":250}