{"text_format":"1","workbook":"xlsx","n_sheets":3,"sheets":["Лист1","Лист2","Лист3"],"not_rendered":{"charts":1,"images":0,"macros":1,"external_links":0,"defined_names":1,"comments":0,"pivot_tables":0},"unopened":[],"bounds":{"document_bytes":16777216,"sheet_cells":100000,"rows_first":2000,"rows_last":500,"rows_between":2000,"halvings":0,"cell_chars":16384,"cell_head_chars":4096},"cells_cut":0,"cells_raw":0,"read":"whole","date_system":"1900"}

{"sheet":"Лист1","index":0,"n_rows":35,"n_cols":8,"rows_kept":35,"cut":false,"hidden":false,"merged":[[1,1,3,1],[1,6,3,6],[1,5,3,5],[1,4,3,4],[1,2,3,2],[1,3,3,3]]}
[]
[null,"Код товара","Товароборот","Товарный процент","Кумулятивный процент(доля)","Ранг","Порог Эффективности"]
[]
[]
[null,"A-31-10",370,{"$f":"ROW(B1)/12*100","v":8.3333333333333321},{"$f":"C5/SUM(C5:C16)","v":0.18810371123538383},{"$f":"IF(E1:E5<=80%,\"A\",IF(E5:E16<=95%,\"B\",IF(E5:E16>=95%,\"C\")))","v":"A"},0.8,{"$f":"ROW(H1)","v":1}]
[null,"M-28-10",269,{"$f":"ROW(B2)/12*100","v":16.666666666666664},{"$f":"E5+C6/SUM($C$5:$C$16)","v":0.32486019318759529},{"$f":"IF(E2:E6<=80%,\"A\",IF(E6:E17<=95%,\"B\",IF(E6:E17>=95%,\"C\")))","v":"A"},0.8,{"$f":"ROW(H2)","v":2}]
[null,"M-15-10",231,25,0.44229791560752413,"A",0.8,3]
[null,"J-09-10",189,33.333333333333329,0.53838332486019314,"A",0.8,4]
[null,"F-05-10",158,41.666666666666671,0.61870869344178947,"A",0.8,5]
[null,"J-04-10",150,50,0.69496695475343162,"A",0.8,6]
[null,"O-16-09",121,58.333333333333336,0.75648195221148962,{"$f":"IF(E7:E11<=80%,\"A\",IF(E11:E22<=95%,\"B\",IF(E11:E22>=95%,\"C\")))","v":"A"},0.8,7]
[null,"S-25-10",114,66.666666666666657,0.81443823080833766,{"$f":"IF(E8:E12<=80%,\"A\",IF(E12:E23<=95%,\"B\",IF(E12:E23>=95%,\"C\")))","v":"B"},0.8,8]
[null,"A-11-10",99,75,0.86476868327402145,{"$f":"IF(E9:E13<=80%,\"A\",IF(E13:E23<=95%,\"B\",IF(E13:E23>=95%,\"C\")))","v":"B"},0.8,9]
[null,"J-12-10",92,83.333333333333343,0.9115404168784953,{"$f":"IF(E10:E14<=80%,\"A\",IF(E14:E24<=95%,\"B\",IF(E14:E24>=95%,\"C\")))","v":"B"},0.8,10]
[null,"A-18-09",89,91.666666666666657,0.95678698525673622,{"$f":"IF(E11:E15<=80%,\"A\",IF(E15:E25<=95%,\"B\",IF(E15:E25>=95%,\"C\")))","v":"C"},0.8,11]
[null,"A-03-09",85,100,1,{"$f":"IF(E12:E16<=80%,\"A\",IF(E16:E26<=95%,\"B\",IF(E16:E26>=95%,\"C\")))","v":"C"},0.8,12]
[]
[]
[]
[]
[]
[]
[null,"Код товара",null,null,"Ранг"]
[null,"A-31-10",370]
[null,"M-28-10",269]
[null,"M-15-10",231]
[null,"J-09-10",189]
[null,"F-05-10",158]
[null,"J-04-10",150]
[null,"O-16-09",121]
[null,"S-25-10",114]
[null,"A-11-10",99]
[null,"J-12-10",92]
[null,"A-18-09",89]
[null,"A-03-09",85]

{"sheet":"Лист2","index":1,"n_rows":0,"n_cols":0,"rows_kept":0,"cut":false,"hidden":false,"merged":[]}

{"sheet":"Лист3","index":2,"n_rows":0,"n_cols":0,"rows_kept":0,"cut":false,"hidden":false,"merged":[]}