{"text_format":"1","workbook":"xlsx","n_sheets":3,"sheets":["Исходник","Что дожно получиться","Лист3"],"not_rendered":{"charts":0,"images":0,"macros":1,"external_links":0,"defined_names":3,"comments":0,"pivot_tables":0},"unopened":[],"bounds":{"document_bytes":16777216,"sheet_cells":100000,"rows_first":2000,"rows_last":500,"rows_between":2000,"halvings":0,"cell_chars":16384,"cell_head_chars":4096},"cells_cut":0,"cells_raw":0,"read":"whole","date_system":"1900"}

{"sheet":"Исходник","index":0,"n_rows":70,"n_cols":17,"rows_kept":70,"cut":false,"hidden":false,"merged":[]}
["г. ОРЕНБУРГ"]
["Код города (3532)"]
["1.    Оренбургское отделение ОСПП ",{"$f":"IF(OR(ISNUMBER(--LEFTB(A3,SEARCH(\".\",A3,1)-1)),COUNTA(A3:$A$9123)=0),1,B2+1)","v":1},{"$f":"IF(AND($B3=1,$A3<>\"\"),\nIF(MATCH(1,$B4:$B65,0)<  $B3+MATCH(1,$B3:$B20,0)+COLUMN(A$1)-2,\"\",\nINDEX($A3:$A65,$B3+MATCH(1,$B3:$B20,0)+COLUMN(A$1)-2)),\"\")","v":"1.    Оренбургское отделение ОСПП "},{"$f":"IF(AND($B3=1,$A3<>\"\"),\nIF(MATCH(1,$B4:$B65,0)<  $B3+MATCH(1,$B3:$B20,0)+COLUMN(B$1)-2,\"\",\nINDEX($A3:$A65,$B3+MATCH(1,$B3:$B20,0)+COLUMN(B$1)-2)),\"\")","v":"Руководитель Мищеряков Юрий Николаевич - Председатель"},{"$f":"IF(AND($B3=1,$A3<>\"\"),\nIF(MATCH(1,$B4:$B65,0)<  $B3+MATCH(1,$B3:$B20,0)+COLUMN(C$1)-2,\"\",\nINDEX($A3:$A65,$B3+MATCH(1,$B3:$B20,0)+COLUMN(C$1)-2)),\"\")","v":"адрес: 461300 г.Оренбург, ул.Советская, 60 "},{"$f":"IF(AND($B3=1,$A3<>\"\"),\nIF(MATCH(1,$B4:$B65,0)<  $B3+MATCH(1,$B3:$B20,0)+COLUMN(D$1)-2,\"\",\nINDEX($A3:$A65,$B3+MATCH(1,$B3:$B20,0)+COLUMN(D$1)-2)),\"\")","v":"Приемная: т. 98-70-10, факс 98-77-66;  e-mail: glava@admin.orenburg.ru "},{"$f":"IF(AND($B3=1,$A3<>\"\"),\nIF(MATCH(1,$B4:$B65,0)<  $B3+MATCH(1,$B3:$B20,0)+COLUMN(E$1)-2,\"\",\nINDEX($A3:$A65,$B3+MATCH(1,$B3:$B20,0)+COLUMN(E$1)-2)),\"\")","v":"Канцелярия: т. 98-71-17; факс: 98-77-88; e-mail: general@admin.orenburg.ru "},{"$f":"IF(AND($B3=1,$A3<>\"\"),\nIF(MATCH(1,$B4:$B65,0)<  $B3+MATCH(1,$B3:$B20,0)+COLUMN(F$1)-2,\"\",\nINDEX($A3:$A65,$B3+MATCH(1,$B3:$B20,0)+COLUMN(F$1)-2)),\"\")","v":"Сайт: www.admin.orenburg.ru "},{"$f":"IF(AND($B3=1,$A3<>\"\"),\nIF(MATCH(1,$B4:$B65,0)<  $B3+MATCH(1,$B3:$B20,0)+COLUMN(G$1)-2,\"\",\nINDEX($A3:$A65,$B3+MATCH(1,$B3:$B20,0)+COLUMN(G$1)-2)),\"\")","v":""},{"$f":"IF(AND($B3=1,$A3<>\"\"),\nIF(MATCH(1,$B4:$B65,0)<  $B3+MATCH(1,$B3:$B20,0)+COLUMN(H$1)-2,\"\",\nINDEX($A3:$A65,$B3+MATCH(1,$B3:$B20,0)+COLUMN(H$1)-2)),\"\")","v":""},{"$f":"IF(AND($B3=1,$A3<>\"\"),\nIF(MATCH(1,$B4:$B65,0)<  $B3+MATCH(1,$B3:$B20,0)+COLUMN(I$1)-2,\"\",\nINDEX($A3:$A65,$B3+MATCH(1,$B3:$B20,0)+COLUMN(I$1)-2)),\"\")","v":""},{"$f":"IF(AND($B3=1,$A3<>\"\"),\nIF(MATCH(1,$B4:$B65,0)<  $B3+MATCH(1,$B3:$B20,0)+COLUMN(J$1)-2,\"\",\nINDEX($A3:$A65,$B3+MATCH(1,$B3:$B20,0)+COLUMN(J$1)-2)),\"\")","v":""},{"$f":"IF(AND($B3=1,$A3<>\"\"),\nIF(MATCH(1,$B4:$B65,0)<  $B3+MATCH(1,$B3:$B20,0)+COLUMN(K$1)-2,\"\",\nINDEX($A3:$A65,$B3+MATCH(1,$B3:$B20,0)+COLUMN(K$1)-2)),\"\")","v":""},{"$f":"IF(AND($B3=1,$A3<>\"\"),\nIF(MATCH(1,$B4:$B65,0)<  $B3+MATCH(1,$B3:$B20,0)+COLUMN(L$1)-2,\"\",\nINDEX($A3:$A65,$B3+MATCH(1,$B3:$B20,0)+COLUMN(L$1)-2)),\"\")","v":""},{"$f":"IF(AND($B3=1,$A3<>\"\"),\nIF(MATCH(1,$B4:$B65,0)<  $B3+MATCH(1,$B3:$B20,0)+COLUMN(M$1)-2,\"\",\nINDEX($A3:$A65,$B3+MATCH(1,$B3:$B20,0)+COLUMN(M$1)-2)),\"\")","v":""},{"$f":"IF(AND($B3=1,$A3<>\"\"),\nIF(MATCH(1,$B4:$B65,0)<  $B3+MATCH(1,$B3:$B20,0)+COLUMN(N$1)-2,\"\",\nINDEX($A3:$A65,$B3+MATCH(1,$B3:$B20,0)+COLUMN(N$1)-2)),\"\")","v":""},{"$f":"IF(AND($B3=1,$A3<>\"\"),\nIF(MATCH(1,$B4:$B65,0)<  $B3+MATCH(1,$B3:$B20,0)+COLUMN(O$1)-2,\"\",\nINDEX($A3:$A65,$B3+MATCH(1,$B3:$B20,0)+COLUMN(O$1)-2)),\"\")","v":""}]
["Руководитель Мищеряков Юрий Николаевич - Председатель",{"$f":"IF(OR(ISNUMBER(--LEFTB(A4,SEARCH(\".\",A4,1)-1)),COUNTA(A4:$A$9123)=0),1,B3+1)","v":2},{"$f":"IF(AND($B4=1,$A4<>\"\"),\nIF(MATCH(1,$B5:$B65,0)<  $B4+MATCH(1,$B4:$B21,0)+COLUMN(A$1)-2,\"\",\nINDEX($A4:$A65,$B4+MATCH(1,$B4:$B21,0)+COLUMN(A$1)-2)),\"\")","v":""},{"$f":"IF(AND($B4=1,$A4<>\"\"),\nIF(MATCH(1,$B5:$B65,0)<  $B4+MATCH(1,$B4:$B21,0)+COLUMN(B$1)-2,\"\",\nINDEX($A4:$A65,$B4+MATCH(1,$B4:$B21,0)+COLUMN(B$1)-2)),\"\")","v":""},{"$f":"IF(AND($B4=1,$A4<>\"\"),\nIF(MATCH(1,$B5:$B65,0)<  $B4+MATCH(1,$B4:$B21,0)+COLUMN(C$1)-2,\"\",\nINDEX($A4:$A65,$B4+MATCH(1,$B4:$B21,0)+COLUMN(C$1)-2)),\"\")","v":""},{"$f":"IF(AND($B4=1,$A4<>\"\"),\nIF(MATCH(1,$B5:$B65,0)<  $B4+MATCH(1,$B4:$B21,0)+COLUMN(D$1)-2,\"\",\nINDEX($A4:$A65,$B4+MATCH(1,$B4:$B21,0)+COLUMN(D$1)-2)),\"\")","v":""},{"$f":"IF(AND($B4=1,$A4<>\"\"),\nIF(MATCH(1,$B5:$B65,0)<  $B4+MATCH(1,$B4:$B21,0)+COLUMN(E$1)-2,\"\",\nINDEX($A4:$A65,$B4+MATCH(1,$B4:$B21,0)+COLUMN(E$1)-2)),\"\")","v":""},{"$f":"IF(AND($B4=1,$A4<>\"\"),\nIF(MATCH(1,$B5:$B65,0)<  $B4+MATCH(1,$B4:$B21,0)+COLUMN(F$1)-2,\"\",\nINDEX($A4:$A65,$B4+MATCH(1,$B4:$B21,0)+COLUMN(F$1)-2)),\"\")","v":""},{"$f":"IF(AND($B4=1,$A4<>\"\"),\nIF(MATCH(1,$B5:$B65,0)<  $B4+MATCH(1,$B4:$B21,0)+COLUMN(G$1)-2,\"\",\nINDEX($A4:$A65,$B4+MATCH(1,$B4:$B21,0)+COLUMN(G$1)-2)),\"\")","v":""},{"$f":"IF(AND($B4=1,$A4<>\"\"),\nIF(MATCH(1,$B5:$B65,0)<  $B4+MATCH(1,$B4:$B21,0)+COLUMN(H$1)-2,\"\",\nINDEX($A4:$A65,$B4+MATCH(1,$B4:$B21,0)+COLUMN(H$1)-2)),\"\")","v":""},{"$f":"IF(AND($B4=1,$A4<>\"\"),\nIF(MATCH(1,$B5:$B65,0)<  $B4+MATCH(1,$B4:$B21,0)+COLUMN(I$1)-2,\"\",\nINDEX($A4:$A65,$B4+MATCH(1,$B4:$B21,0)+COLUMN(I$1)-2)),\"\")","v":""},{"$f":"IF(AND($B4=1,$A4<>\"\"),\nIF(MATCH(1,$B5:$B65,0)<  $B4+MATCH(1,$B4:$B21,0)+COLUMN(J$1)-2,\"\",\nINDEX($A4:$A65,$B4+MATCH(1,$B4:$B21,0)+COLUMN(J$1)-2)),\"\")","v":""},{"$f":"IF(AND($B4=1,$A4<>\"\"),\nIF(MATCH(1,$B5:$B65,0)<  $B4+MATCH(1,$B4:$B21,0)+COLUMN(K$1)-2,\"\",\nINDEX($A4:$A65,$B4+MATCH(1,$B4:$B21,0)+COLUMN(K$1)-2)),\"\")","v":""},{"$f":"IF(AND($B4=1,$A4<>\"\"),\nIF(MATCH(1,$B5:$B65,0)<  $B4+MATCH(1,$B4:$B21,0)+COLUMN(L$1)-2,\"\",\nINDEX($A4:$A65,$B4+MATCH(1,$B4:$B21,0)+COLUMN(L$1)-2)),\"\")","v":""},{"$f":"IF(AND($B4=1,$A4<>\"\"),\nIF(MATCH(1,$B5:$B65,0)<  $B4+MATCH(1,$B4:$B21,0)+COLUMN(M$1)-2,\"\",\nINDEX($A4:$A65,$B4+MATCH(1,$B4:$B21,0)+COLUMN(M$1)-2)),\"\")","v":""},{"$f":"IF(AND($B4=1,$A4<>\"\"),\nIF(MATCH(1,$B5:$B65,0)<  $B4+MATCH(1,$B4:$B21,0)+COLUMN(N$1)-2,\"\",\nINDEX($A4:$A65,$B4+MATCH(1,$B4:$B21,0)+COLUMN(N$1)-2)),\"\")","v":""},{"$f":"IF(AND($B4=1,$A4<>\"\"),\nIF(MATCH(1,$B5:$B65,0)<  $B4+MATCH(1,$B4:$B21,0)+COLUMN(O$1)-2,\"\",\nINDEX($A4:$A65,$B4+MATCH(1,$B4:$B21,0)+COLUMN(O$1)-2)),\"\")","v":""}]
["адрес: 461300 г.Оренбург, ул.Советская, 60 ",{"$f":"IF(OR(ISNUMBER(--LEFTB(A5,SEARCH(\".\",A5,1)-1)),COUNTA(A5:$A$9123)=0),1,B4+1)","v":3},{"$f":"IF(AND($B5=1,$A5<>\"\"),\nIF(MATCH(1,$B6:$B65,0)<  $B5+MATCH(1,$B5:$B22,0)+COLUMN(A$1)-2,\"\",\nINDEX($A5:$A65,$B5+MATCH(1,$B5:$B22,0)+COLUMN(A$1)-2)),\"\")","v":""},{"$f":"IF(AND($B5=1,$A5<>\"\"),\nIF(MATCH(1,$B6:$B65,0)<  $B5+MATCH(1,$B5:$B22,0)+COLUMN(B$1)-2,\"\",\nINDEX($A5:$A65,$B5+MATCH(1,$B5:$B22,0)+COLUMN(B$1)-2)),\"\")","v":""},{"$f":"IF(AND($B5=1,$A5<>\"\"),\nIF(MATCH(1,$B6:$B65,0)<  $B5+MATCH(1,$B5:$B22,0)+COLUMN(C$1)-2,\"\",\nINDEX($A5:$A65,$B5+MATCH(1,$B5:$B22,0)+COLUMN(C$1)-2)),\"\")","v":""},{"$f":"IF(AND($B5=1,$A5<>\"\"),\nIF(MATCH(1,$B6:$B65,0)<  $B5+MATCH(1,$B5:$B22,0)+COLUMN(D$1)-2,\"\",\nINDEX($A5:$A65,$B5+MATCH(1,$B5:$B22,0)+COLUMN(D$1)-2)),\"\")","v":""},{"$f":"IF(AND($B5=1,$A5<>\"\"),\nIF(MATCH(1,$B6:$B65,0)<  $B5+MATCH(1,$B5:$B22,0)+COLUMN(E$1)-2,\"\",\nINDEX($A5:$A65,$B5+MATCH(1,$B5:$B22,0)+COLUMN(E$1)-2)),\"\")","v":""},{"$f":"IF(AND($B5=1,$A5<>\"\"),\nIF(MATCH(1,$B6:$B65,0)<  $B5+MATCH(1,$B5:$B22,0)+COLUMN(F$1)-2,\"\",\nINDEX($A5:$A65,$B5+MATCH(1,$B5:$B22,0)+COLUMN(F$1)-2)),\"\")","v":""},{"$f":"IF(AND($B5=1,$A5<>\"\"),\nIF(MATCH(1,$B6:$B65,0)<  $B5+MATCH(1,$B5:$B22,0)+COLUMN(G$1)-2,\"\",\nINDEX($A5:$A65,$B5+MATCH(1,$B5:$B22,0)+COLUMN(G$1)-2)),\"\")","v":""},{"$f":"IF(AND($B5=1,$A5<>\"\"),\nIF(MATCH(1,$B6:$B65,0)<  $B5+MATCH(1,$B5:$B22,0)+COLUMN(H$1)-2,\"\",\nINDEX($A5:$A65,$B5+MATCH(1,$B5:$B22,0)+COLUMN(H$1)-2)),\"\")","v":""},{"$f":"IF(AND($B5=1,$A5<>\"\"),\nIF(MATCH(1,$B6:$B65,0)<  $B5+MATCH(1,$B5:$B22,0)+COLUMN(I$1)-2,\"\",\nINDEX($A5:$A65,$B5+MATCH(1,$B5:$B22,0)+COLUMN(I$1)-2)),\"\")","v":""},{"$f":"IF(AND($B5=1,$A5<>\"\"),\nIF(MATCH(1,$B6:$B65,0)<  $B5+MATCH(1,$B5:$B22,0)+COLUMN(J$1)-2,\"\",\nINDEX($A5:$A65,$B5+MATCH(1,$B5:$B22,0)+COLUMN(J$1)-2)),\"\")","v":""},{"$f":"IF(AND($B5=1,$A5<>\"\"),\nIF(MATCH(1,$B6:$B65,0)<  $B5+MATCH(1,$B5:$B22,0)+COLUMN(K$1)-2,\"\",\nINDEX($A5:$A65,$B5+MATCH(1,$B5:$B22,0)+COLUMN(K$1)-2)),\"\")","v":""},{"$f":"IF(AND($B5=1,$A5<>\"\"),\nIF(MATCH(1,$B6:$B65,0)<  $B5+MATCH(1,$B5:$B22,0)+COLUMN(L$1)-2,\"\",\nINDEX($A5:$A65,$B5+MATCH(1,$B5:$B22,0)+COLUMN(L$1)-2)),\"\")","v":""},{"$f":"IF(AND($B5=1,$A5<>\"\"),\nIF(MATCH(1,$B6:$B65,0)<  $B5+MATCH(1,$B5:$B22,0)+COLUMN(M$1)-2,\"\",\nINDEX($A5:$A65,$B5+MATCH(1,$B5:$B22,0)+COLUMN(M$1)-2)),\"\")","v":""},{"$f":"IF(AND($B5=1,$A5<>\"\"),\nIF(MATCH(1,$B6:$B65,0)<  $B5+MATCH(1,$B5:$B22,0)+COLUMN(N$1)-2,\"\",\nINDEX($A5:$A65,$B5+MATCH(1,$B5:$B22,0)+COLUMN(N$1)-2)),\"\")","v":""},{"$f":"IF(AND($B5=1,$A5<>\"\"),\nIF(MATCH(1,$B6:$B65,0)<  $B5+MATCH(1,$B5:$B22,0)+COLUMN(O$1)-2,\"\",\nINDEX($A5:$A65,$B5+MATCH(1,$B5:$B22,0)+COLUMN(O$1)-2)),\"\")","v":""}]
["Приемная: т. 98-70-10, факс 98-77-66;  e-mail: glava@admin.orenburg.ru ",{"$f":"IF(OR(ISNUMBER(--LEFTB(A6,SEARCH(\".\",A6,1)-1)),COUNTA(A6:$A$9123)=0),1,B5+1)","v":4},{"$f":"IF(AND($B6=1,$A6<>\"\"),\nIF(MATCH(1,$B7:$B65,0)<  $B6+MATCH(1,$B6:$B23,0)+COLUMN(A$1)-2,\"\",\nINDEX($A6:$A65,$B6+MATCH(1,$B6:$B23,0)+COLUMN(A$1)-2)),\"\")","v":""},{"$f":"IF(AND($B6=1,$A6<>\"\"),\nIF(MATCH(1,$B7:$B65,0)<  $B6+MATCH(1,$B6:$B23,0)+COLUMN(B$1)-2,\"\",\nINDEX($A6:$A65,$B6+MATCH(1,$B6:$B23,0)+COLUMN(B$1)-2)),\"\")","v":""},{"$f":"IF(AND($B6=1,$A6<>\"\"),\nIF(MATCH(1,$B7:$B65,0)<  $B6+MATCH(1,$B6:$B23,0)+COLUMN(C$1)-2,\"\",\nINDEX($A6:$A65,$B6+MATCH(1,$B6:$B23,0)+COLUMN(C$1)-2)),\"\")","v":""},{"$f":"IF(AND($B6=1,$A6<>\"\"),\nIF(MATCH(1,$B7:$B65,0)<  $B6+MATCH(1,$B6:$B23,0)+COLUMN(D$1)-2,\"\",\nINDEX($A6:$A65,$B6+MATCH(1,$B6:$B23,0)+COLUMN(D$1)-2)),\"\")","v":""},{"$f":"IF(AND($B6=1,$A6<>\"\"),\nIF(MATCH(1,$B7:$B65,0)<  $B6+MATCH(1,$B6:$B23,0)+COLUMN(E$1)-2,\"\",\nINDEX($A6:$A65,$B6+MATCH(1,$B6:$B23,0)+COLUMN(E$1)-2)),\"\")","v":""},{"$f":"IF(AND($B6=1,$A6<>\"\"),\nIF(MATCH(1,$B7:$B65,0)<  $B6+MATCH(1,$B6:$B23,0)+COLUMN(F$1)-2,\"\",\nINDEX($A6:$A65,$B6+MATCH(1,$B6:$B23,0)+COLUMN(F$1)-2)),\"\")","v":""},{"$f":"IF(AND($B6=1,$A6<>\"\"),\nIF(MATCH(1,$B7:$B65,0)<  $B6+MATCH(1,$B6:$B23,0)+COLUMN(G$1)-2,\"\",\nINDEX($A6:$A65,$B6+MATCH(1,$B6:$B23,0)+COLUMN(G$1)-2)),\"\")","v":""},{"$f":"IF(AND($B6=1,$A6<>\"\"),\nIF(MATCH(1,$B7:$B65,0)<  $B6+MATCH(1,$B6:$B23,0)+COLUMN(H$1)-2,\"\",\nINDEX($A6:$A65,$B6+MATCH(1,$B6:$B23,0)+COLUMN(H$1)-2)),\"\")","v":""},{"$f":"IF(AND($B6=1,$A6<>\"\"),\nIF(MATCH(1,$B7:$B65,0)<  $B6+MATCH(1,$B6:$B23,0)+COLUMN(I$1)-2,\"\",\nINDEX($A6:$A65,$B6+MATCH(1,$B6:$B23,0)+COLUMN(I$1)-2)),\"\")","v":""},{"$f":"IF(AND($B6=1,$A6<>\"\"),\nIF(MATCH(1,$B7:$B65,0)<  $B6+MATCH(1,$B6:$B23,0)+COLUMN(J$1)-2,\"\",\nINDEX($A6:$A65,$B6+MATCH(1,$B6:$B23,0)+COLUMN(J$1)-2)),\"\")","v":""},{"$f":"IF(AND($B6=1,$A6<>\"\"),\nIF(MATCH(1,$B7:$B65,0)<  $B6+MATCH(1,$B6:$B23,0)+COLUMN(K$1)-2,\"\",\nINDEX($A6:$A65,$B6+MATCH(1,$B6:$B23,0)+COLUMN(K$1)-2)),\"\")","v":""},{"$f":"IF(AND($B6=1,$A6<>\"\"),\nIF(MATCH(1,$B7:$B65,0)<  $B6+MATCH(1,$B6:$B23,0)+COLUMN(L$1)-2,\"\",\nINDEX($A6:$A65,$B6+MATCH(1,$B6:$B23,0)+COLUMN(L$1)-2)),\"\")","v":""},{"$f":"IF(AND($B6=1,$A6<>\"\"),\nIF(MATCH(1,$B7:$B65,0)<  $B6+MATCH(1,$B6:$B23,0)+COLUMN(M$1)-2,\"\",\nINDEX($A6:$A65,$B6+MATCH(1,$B6:$B23,0)+COLUMN(M$1)-2)),\"\")","v":""},{"$f":"IF(AND($B6=1,$A6<>\"\"),\nIF(MATCH(1,$B7:$B65,0)<  $B6+MATCH(1,$B6:$B23,0)+COLUMN(N$1)-2,\"\",\nINDEX($A6:$A65,$B6+MATCH(1,$B6:$B23,0)+COLUMN(N$1)-2)),\"\")","v":""},{"$f":"IF(AND($B6=1,$A6<>\"\"),\nIF(MATCH(1,$B7:$B65,0)<  $B6+MATCH(1,$B6:$B23,0)+COLUMN(O$1)-2,\"\",\nINDEX($A6:$A65,$B6+MATCH(1,$B6:$B23,0)+COLUMN(O$1)-2)),\"\")","v":""}]
["Канцелярия: т. 98-71-17; факс: 98-77-88; e-mail: general@admin.orenburg.ru ",{"$f":"IF(OR(ISNUMBER(--LEFTB(A7,SEARCH(\".\",A7,1)-1)),COUNTA(A7:$A$9123)=0),1,B6+1)","v":5},{"$f":"IF(AND($B7=1,$A7<>\"\"),\nIF(MATCH(1,$B8:$B65,0)<  $B7+MATCH(1,$B7:$B24,0)+COLUMN(A$1)-2,\"\",\nINDEX($A7:$A65,$B7+MATCH(1,$B7:$B24,0)+COLUMN(A$1)-2)),\"\")","v":""},{"$f":"IF(AND($B7=1,$A7<>\"\"),\nIF(MATCH(1,$B8:$B65,0)<  $B7+MATCH(1,$B7:$B24,0)+COLUMN(B$1)-2,\"\",\nINDEX($A7:$A65,$B7+MATCH(1,$B7:$B24,0)+COLUMN(B$1)-2)),\"\")","v":""},{"$f":"IF(AND($B7=1,$A7<>\"\"),\nIF(MATCH(1,$B8:$B65,0)<  $B7+MATCH(1,$B7:$B24,0)+COLUMN(C$1)-2,\"\",\nINDEX($A7:$A65,$B7+MATCH(1,$B7:$B24,0)+COLUMN(C$1)-2)),\"\")","v":""},{"$f":"IF(AND($B7=1,$A7<>\"\"),\nIF(MATCH(1,$B8:$B65,0)<  $B7+MATCH(1,$B7:$B24,0)+COLUMN(D$1)-2,\"\",\nINDEX($A7:$A65,$B7+MATCH(1,$B7:$B24,0)+COLUMN(D$1)-2)),\"\")","v":""},{"$f":"IF(AND($B7=1,$A7<>\"\"),\nIF(MATCH(1,$B8:$B65,0)<  $B7+MATCH(1,$B7:$B24,0)+COLUMN(E$1)-2,\"\",\nINDEX($A7:$A65,$B7+MATCH(1,$B7:$B24,0)+COLUMN(E$1)-2)),\"\")","v":""},{"$f":"IF(AND($B7=1,$A7<>\"\"),\nIF(MATCH(1,$B8:$B65,0)<  $B7+MATCH(1,$B7:$B24,0)+COLUMN(F$1)-2,\"\",\nINDEX($A7:$A65,$B7+MATCH(1,$B7:$B24,0)+COLUMN(F$1)-2)),\"\")","v":""},{"$f":"IF(AND($B7=1,$A7<>\"\"),\nIF(MATCH(1,$B8:$B65,0)<  $B7+MATCH(1,$B7:$B24,0)+COLUMN(G$1)-2,\"\",\nINDEX($A7:$A65,$B7+MATCH(1,$B7:$B24,0)+COLUMN(G$1)-2)),\"\")","v":""},{"$f":"IF(AND($B7=1,$A7<>\"\"),\nIF(MATCH(1,$B8:$B65,0)<  $B7+MATCH(1,$B7:$B24,0)+COLUMN(H$1)-2,\"\",\nINDEX($A7:$A65,$B7+MATCH(1,$B7:$B24,0)+COLUMN(H$1)-2)),\"\")","v":""},{"$f":"IF(AND($B7=1,$A7<>\"\"),\nIF(MATCH(1,$B8:$B65,0)<  $B7+MATCH(1,$B7:$B24,0)+COLUMN(I$1)-2,\"\",\nINDEX($A7:$A65,$B7+MATCH(1,$B7:$B24,0)+COLUMN(I$1)-2)),\"\")","v":""},{"$f":"IF(AND($B7=1,$A7<>\"\"),\nIF(MATCH(1,$B8:$B65,0)<  $B7+MATCH(1,$B7:$B24,0)+COLUMN(J$1)-2,\"\",\nINDEX($A7:$A65,$B7+MATCH(1,$B7:$B24,0)+COLUMN(J$1)-2)),\"\")","v":""},{"$f":"IF(AND($B7=1,$A7<>\"\"),\nIF(MATCH(1,$B8:$B65,0)<  $B7+MATCH(1,$B7:$B24,0)+COLUMN(K$1)-2,\"\",\nINDEX($A7:$A65,$B7+MATCH(1,$B7:$B24,0)+COLUMN(K$1)-2)),\"\")","v":""},{"$f":"IF(AND($B7=1,$A7<>\"\"),\nIF(MATCH(1,$B8:$B65,0)<  $B7+MATCH(1,$B7:$B24,0)+COLUMN(L$1)-2,\"\",\nINDEX($A7:$A65,$B7+MATCH(1,$B7:$B24,0)+COLUMN(L$1)-2)),\"\")","v":""},{"$f":"IF(AND($B7=1,$A7<>\"\"),\nIF(MATCH(1,$B8:$B65,0)<  $B7+MATCH(1,$B7:$B24,0)+COLUMN(M$1)-2,\"\",\nINDEX($A7:$A65,$B7+MATCH(1,$B7:$B24,0)+COLUMN(M$1)-2)),\"\")","v":""},{"$f":"IF(AND($B7=1,$A7<>\"\"),\nIF(MATCH(1,$B8:$B65,0)<  $B7+MATCH(1,$B7:$B24,0)+COLUMN(N$1)-2,\"\",\nINDEX($A7:$A65,$B7+MATCH(1,$B7:$B24,0)+COLUMN(N$1)-2)),\"\")","v":""},{"$f":"IF(AND($B7=1,$A7<>\"\"),\nIF(MATCH(1,$B8:$B65,0)<  $B7+MATCH(1,$B7:$B24,0)+COLUMN(O$1)-2,\"\",\nINDEX($A7:$A65,$B7+MATCH(1,$B7:$B24,0)+COLUMN(O$1)-2)),\"\")","v":""}]
["Сайт: www.admin.orenburg.ru ",{"$f":"IF(OR(ISNUMBER(--LEFTB(A8,SEARCH(\".\",A8,1)-1)),COUNTA(A8:$A$9123)=0),1,B7+1)","v":6},{"$f":"IF(AND($B8=1,$A8<>\"\"),\nIF(MATCH(1,$B9:$B65,0)<  $B8+MATCH(1,$B8:$B25,0)+COLUMN(A$1)-2,\"\",\nINDEX($A8:$A65,$B8+MATCH(1,$B8:$B25,0)+COLUMN(A$1)-2)),\"\")","v":""},{"$f":"IF(AND($B8=1,$A8<>\"\"),\nIF(MATCH(1,$B9:$B65,0)<  $B8+MATCH(1,$B8:$B25,0)+COLUMN(B$1)-2,\"\",\nINDEX($A8:$A65,$B8+MATCH(1,$B8:$B25,0)+COLUMN(B$1)-2)),\"\")","v":""},{"$f":"IF(AND($B8=1,$A8<>\"\"),\nIF(MATCH(1,$B9:$B65,0)<  $B8+MATCH(1,$B8:$B25,0)+COLUMN(C$1)-2,\"\",\nINDEX($A8:$A65,$B8+MATCH(1,$B8:$B25,0)+COLUMN(C$1)-2)),\"\")","v":""},{"$f":"IF(AND($B8=1,$A8<>\"\"),\nIF(MATCH(1,$B9:$B65,0)<  $B8+MATCH(1,$B8:$B25,0)+COLUMN(D$1)-2,\"\",\nINDEX($A8:$A65,$B8+MATCH(1,$B8:$B25,0)+COLUMN(D$1)-2)),\"\")","v":""},{"$f":"IF(AND($B8=1,$A8<>\"\"),\nIF(MATCH(1,$B9:$B65,0)<  $B8+MATCH(1,$B8:$B25,0)+COLUMN(E$1)-2,\"\",\nINDEX($A8:$A65,$B8+MATCH(1,$B8:$B25,0)+COLUMN(E$1)-2)),\"\")","v":""},{"$f":"IF(AND($B8=1,$A8<>\"\"),\nIF(MATCH(1,$B9:$B65,0)<  $B8+MATCH(1,$B8:$B25,0)+COLUMN(F$1)-2,\"\",\nINDEX($A8:$A65,$B8+MATCH(1,$B8:$B25,0)+COLUMN(F$1)-2)),\"\")","v":""},{"$f":"IF(AND($B8=1,$A8<>\"\"),\nIF(MATCH(1,$B9:$B65,0)<  $B8+MATCH(1,$B8:$B25,0)+COLUMN(G$1)-2,\"\",\nINDEX($A8:$A65,$B8+MATCH(1,$B8:$B25,0)+COLUMN(G$1)-2)),\"\")","v":""},{"$f":"IF(AND($B8=1,$A8<>\"\"),\nIF(MATCH(1,$B9:$B65,0)<  $B8+MATCH(1,$B8:$B25,0)+COLUMN(H$1)-2,\"\",\nINDEX($A8:$A65,$B8+MATCH(1,$B8:$B25,0)+COLUMN(H$1)-2)),\"\")","v":""},{"$f":"IF(AND($B8=1,$A8<>\"\"),\nIF(MATCH(1,$B9:$B65,0)<  $B8+MATCH(1,$B8:$B25,0)+COLUMN(I$1)-2,\"\",\nINDEX($A8:$A65,$B8+MATCH(1,$B8:$B25,0)+COLUMN(I$1)-2)),\"\")","v":""},{"$f":"IF(AND($B8=1,$A8<>\"\"),\nIF(MATCH(1,$B9:$B65,0)<  $B8+MATCH(1,$B8:$B25,0)+COLUMN(J$1)-2,\"\",\nINDEX($A8:$A65,$B8+MATCH(1,$B8:$B25,0)+COLUMN(J$1)-2)),\"\")","v":""},{"$f":"IF(AND($B8=1,$A8<>\"\"),\nIF(MATCH(1,$B9:$B65,0)<  $B8+MATCH(1,$B8:$B25,0)+COLUMN(K$1)-2,\"\",\nINDEX($A8:$A65,$B8+MATCH(1,$B8:$B25,0)+COLUMN(K$1)-2)),\"\")","v":""},{"$f":"IF(AND($B8=1,$A8<>\"\"),\nIF(MATCH(1,$B9:$B65,0)<  $B8+MATCH(1,$B8:$B25,0)+COLUMN(L$1)-2,\"\",\nINDEX($A8:$A65,$B8+MATCH(1,$B8:$B25,0)+COLUMN(L$1)-2)),\"\")","v":""},{"$f":"IF(AND($B8=1,$A8<>\"\"),\nIF(MATCH(1,$B9:$B65,0)<  $B8+MATCH(1,$B8:$B25,0)+COLUMN(M$1)-2,\"\",\nINDEX($A8:$A65,$B8+MATCH(1,$B8:$B25,0)+COLUMN(M$1)-2)),\"\")","v":""},{"$f":"IF(AND($B8=1,$A8<>\"\"),\nIF(MATCH(1,$B9:$B65,0)<  $B8+MATCH(1,$B8:$B25,0)+COLUMN(N$1)-2,\"\",\nINDEX($A8:$A65,$B8+MATCH(1,$B8:$B25,0)+COLUMN(N$1)-2)),\"\")","v":""},{"$f":"IF(AND($B8=1,$A8<>\"\"),\nIF(MATCH(1,$B9:$B65,0)<  $B8+MATCH(1,$B8:$B25,0)+COLUMN(O$1)-2,\"\",\nINDEX($A8:$A65,$B8+MATCH(1,$B8:$B25,0)+COLUMN(O$1)-2)),\"\")","v":""}]
["2.    ООО «Торговый Дом» «Саракташский молочный завод»",{"$f":"IF(OR(ISNUMBER(--LEFTB(A9,SEARCH(\".\",A9,1)-1)),COUNTA(A9:$A$9123)=0),1,B8+1)","v":1},{"$f":"IF(AND($B9=1,$A9<>\"\"),\nIF(MATCH(1,$B10:$B65,0)<  $B9+MATCH(1,$B9:$B26,0)+COLUMN(A$1)-2,\"\",\nINDEX($A9:$A65,$B9+MATCH(1,$B9:$B26,0)+COLUMN(A$1)-2)),\"\")","v":"2.    ООО «Торговый Дом» «Саракташский молочный завод»"},{"$f":"IF(AND($B9=1,$A9<>\"\"),\nIF(MATCH(1,$B10:$B65,0)<  $B9+MATCH(1,$B9:$B26,0)+COLUMN(B$1)-2,\"\",\nINDEX($A9:$A65,$B9+MATCH(1,$B9:$B26,0)+COLUMN(B$1)-2)),\"\")","v":"Генеральный директор Ахмеров Наиль Ирфатович "},{"$f":"IF(AND($B9=1,$A9<>\"\"),\nIF(MATCH(1,$B10:$B65,0)<  $B9+MATCH(1,$B9:$B26,0)+COLUMN(C$1)-2,\"\",\nINDEX($A9:$A65,$B9+MATCH(1,$B9:$B26,0)+COLUMN(C$1)-2)),\"\")","v":"адрес: 460038 г.Оренбург, ул. Братская,6"},{"$f":"IF(AND($B9=1,$A9<>\"\"),\nIF(MATCH(1,$B10:$B65,0)<  $B9+MATCH(1,$B9:$B26,0)+COLUMN(D$1)-2,\"\",\nINDEX($A9:$A65,$B9+MATCH(1,$B9:$B26,0)+COLUMN(D$1)-2)),\"\")","v":"т/ф. 64-65-29, 38-21-21, e-ральская стальmail: td-saraktash@yandex.ru или td-saraktash@mail.ru"},{"$f":"IF(AND($B9=1,$A9<>\"\"),\nIF(MATCH(1,$B10:$B65,0)<  $B9+MATCH(1,$B9:$B26,0)+COLUMN(E$1)-2,\"\",\nINDEX($A9:$A65,$B9+MATCH(1,$B9:$B26,0)+COLUMN(E$1)-2)),\"\")","v":"сайт: www.anairzavod.ru"},{"$f":"IF(AND($B9=1,$A9<>\"\"),\nIF(MATCH(1,$B10:$B65,0)<  $B9+MATCH(1,$B9:$B26,0)+COLUMN(F$1)-2,\"\",\nINDEX($A9:$A65,$B9+MATCH(1,$B9:$B26,0)+COLUMN(F$1)-2)),\"\")","v":""},{"$f":"IF(AND($B9=1,$A9<>\"\"),\nIF(MATCH(1,$B10:$B65,0)<  $B9+MATCH(1,$B9:$B26,0)+COLUMN(G$1)-2,\"\",\nINDEX($A9:$A65,$B9+MATCH(1,$B9:$B26,0)+COLUMN(G$1)-2)),\"\")","v":""},{"$f":"IF(AND($B9=1,$A9<>\"\"),\nIF(MATCH(1,$B10:$B65,0)<  $B9+MATCH(1,$B9:$B26,0)+COLUMN(H$1)-2,\"\",\nINDEX($A9:$A65,$B9+MATCH(1,$B9:$B26,0)+COLUMN(H$1)-2)),\"\")","v":""},{"$f":"IF(AND($B9=1,$A9<>\"\"),\nIF(MATCH(1,$B10:$B65,0)<  $B9+MATCH(1,$B9:$B26,0)+COLUMN(I$1)-2,\"\",\nINDEX($A9:$A65,$B9+MATCH(1,$B9:$B26,0)+COLUMN(I$1)-2)),\"\")","v":""},{"$f":"IF(AND($B9=1,$A9<>\"\"),\nIF(MATCH(1,$B10:$B65,0)<  $B9+MATCH(1,$B9:$B26,0)+COLUMN(J$1)-2,\"\",\nINDEX($A9:$A65,$B9+MATCH(1,$B9:$B26,0)+COLUMN(J$1)-2)),\"\")","v":""},{"$f":"IF(AND($B9=1,$A9<>\"\"),\nIF(MATCH(1,$B10:$B65,0)<  $B9+MATCH(1,$B9:$B26,0)+COLUMN(K$1)-2,\"\",\nINDEX($A9:$A65,$B9+MATCH(1,$B9:$B26,0)+COLUMN(K$1)-2)),\"\")","v":""},{"$f":"IF(AND($B9=1,$A9<>\"\"),\nIF(MATCH(1,$B10:$B65,0)<  $B9+MATCH(1,$B9:$B26,0)+COLUMN(L$1)-2,\"\",\nINDEX($A9:$A65,$B9+MATCH(1,$B9:$B26,0)+COLUMN(L$1)-2)),\"\")","v":""},{"$f":"IF(AND($B9=1,$A9<>\"\"),\nIF(MATCH(1,$B10:$B65,0)<  $B9+MATCH(1,$B9:$B26,0)+COLUMN(M$1)-2,\"\",\nINDEX($A9:$A65,$B9+MATCH(1,$B9:$B26,0)+COLUMN(M$1)-2)),\"\")","v":""},{"$f":"IF(AND($B9=1,$A9<>\"\"),\nIF(MATCH(1,$B10:$B65,0)<  $B9+MATCH(1,$B9:$B26,0)+COLUMN(N$1)-2,\"\",\nINDEX($A9:$A65,$B9+MATCH(1,$B9:$B26,0)+COLUMN(N$1)-2)),\"\")","v":""},{"$f":"IF(AND($B9=1,$A9<>\"\"),\nIF(MATCH(1,$B10:$B65,0)<  $B9+MATCH(1,$B9:$B26,0)+COLUMN(O$1)-2,\"\",\nINDEX($A9:$A65,$B9+MATCH(1,$B9:$B26,0)+COLUMN(O$1)-2)),\"\")","v":""}]
["Генеральный директор Ахмеров Наиль Ирфатович ",{"$f":"IF(OR(ISNUMBER(--LEFTB(A10,SEARCH(\".\",A10,1)-1)),COUNTA(A10:$A$9123)=0),1,B9+1)","v":2},{"$f":"IF(AND($B10=1,$A10<>\"\"),\nIF(MATCH(1,$B11:$B65,0)<  $B10+MATCH(1,$B10:$B27,0)+COLUMN(A$1)-2,\"\",\nINDEX($A10:$A65,$B10+MATCH(1,$B10:$B27,0)+COLUMN(A$1)-2)),\"\")","v":""},{"$f":"IF(AND($B10=1,$A10<>\"\"),\nIF(MATCH(1,$B11:$B65,0)<  $B10+MATCH(1,$B10:$B27,0)+COLUMN(B$1)-2,\"\",\nINDEX($A10:$A65,$B10+MATCH(1,$B10:$B27,0)+COLUMN(B$1)-2)),\"\")","v":""},{"$f":"IF(AND($B10=1,$A10<>\"\"),\nIF(MATCH(1,$B11:$B65,0)<  $B10+MATCH(1,$B10:$B27,0)+COLUMN(C$1)-2,\"\",\nINDEX($A10:$A65,$B10+MATCH(1,$B10:$B27,0)+COLUMN(C$1)-2)),\"\")","v":""},{"$f":"IF(AND($B10=1,$A10<>\"\"),\nIF(MATCH(1,$B11:$B65,0)<  $B10+MATCH(1,$B10:$B27,0)+COLUMN(D$1)-2,\"\",\nINDEX($A10:$A65,$B10+MATCH(1,$B10:$B27,0)+COLUMN(D$1)-2)),\"\")","v":""},{"$f":"IF(AND($B10=1,$A10<>\"\"),\nIF(MATCH(1,$B11:$B65,0)<  $B10+MATCH(1,$B10:$B27,0)+COLUMN(E$1)-2,\"\",\nINDEX($A10:$A65,$B10+MATCH(1,$B10:$B27,0)+COLUMN(E$1)-2)),\"\")","v":""},{"$f":"IF(AND($B10=1,$A10<>\"\"),\nIF(MATCH(1,$B11:$B65,0)<  $B10+MATCH(1,$B10:$B27,0)+COLUMN(F$1)-2,\"\",\nINDEX($A10:$A65,$B10+MATCH(1,$B10:$B27,0)+COLUMN(F$1)-2)),\"\")","v":""},{"$f":"IF(AND($B10=1,$A10<>\"\"),\nIF(MATCH(1,$B11:$B65,0)<  $B10+MATCH(1,$B10:$B27,0)+COLUMN(G$1)-2,\"\",\nINDEX($A10:$A65,$B10+MATCH(1,$B10:$B27,0)+COLUMN(G$1)-2)),\"\")","v":""},{"$f":"IF(AND($B10=1,$A10<>\"\"),\nIF(MATCH(1,$B11:$B65,0)<  $B10+MATCH(1,$B10:$B27,0)+COLUMN(H$1)-2,\"\",\nINDEX($A10:$A65,$B10+MATCH(1,$B10:$B27,0)+COLUMN(H$1)-2)),\"\")","v":""},{"$f":"IF(AND($B10=1,$A10<>\"\"),\nIF(MATCH(1,$B11:$B65,0)<  $B10+MATCH(1,$B10:$B27,0)+COLUMN(I$1)-2,\"\",\nINDEX($A10:$A65,$B10+MATCH(1,$B10:$B27,0)+COLUMN(I$1)-2)),\"\")","v":""},{"$f":"IF(AND($B10=1,$A10<>\"\"),\nIF(MATCH(1,$B11:$B65,0)<  $B10+MATCH(1,$B10:$B27,0)+COLUMN(J$1)-2,\"\",\nINDEX($A10:$A65,$B10+MATCH(1,$B10:$B27,0)+COLUMN(J$1)-2)),\"\")","v":""},{"$f":"IF(AND($B10=1,$A10<>\"\"),\nIF(MATCH(1,$B11:$B65,0)<  $B10+MATCH(1,$B10:$B27,0)+COLUMN(K$1)-2,\"\",\nINDEX($A10:$A65,$B10+MATCH(1,$B10:$B27,0)+COLUMN(K$1)-2)),\"\")","v":""},{"$f":"IF(AND($B10=1,$A10<>\"\"),\nIF(MATCH(1,$B11:$B65,0)<  $B10+MATCH(1,$B10:$B27,0)+COLUMN(L$1)-2,\"\",\nINDEX($A10:$A65,$B10+MATCH(1,$B10:$B27,0)+COLUMN(L$1)-2)),\"\")","v":""},{"$f":"IF(AND($B10=1,$A10<>\"\"),\nIF(MATCH(1,$B11:$B65,0)<  $B10+MATCH(1,$B10:$B27,0)+COLUMN(M$1)-2,\"\",\nINDEX($A10:$A65,$B10+MATCH(1,$B10:$B27,0)+COLUMN(M$1)-2)),\"\")","v":""},{"$f":"IF(AND($B10=1,$A10<>\"\"),\nIF(MATCH(1,$B11:$B65,0)<  $B10+MATCH(1,$B10:$B27,0)+COLUMN(N$1)-2,\"\",\nINDEX($A10:$A65,$B10+MATCH(1,$B10:$B27,0)+COLUMN(N$1)-2)),\"\")","v":""},{"$f":"IF(AND($B10=1,$A10<>\"\"),\nIF(MATCH(1,$B11:$B65,0)<  $B10+MATCH(1,$B10:$B27,0)+COLUMN(O$1)-2,\"\",\nINDEX($A10:$A65,$B10+MATCH(1,$B10:$B27,0)+COLUMN(O$1)-2)),\"\")","v":""}]
["адрес: 460038 г.Оренбург, ул. Братская,6",{"$f":"IF(OR(ISNUMBER(--LEFTB(A11,SEARCH(\".\",A11,1)-1)),COUNTA(A11:$A$9123)=0),1,B10+1)","v":3},{"$f":"IF(AND($B11=1,$A11<>\"\"),\nIF(MATCH(1,$B12:$B65,0)<  $B11+MATCH(1,$B11:$B28,0)+COLUMN(A$1)-2,\"\",\nINDEX($A11:$A65,$B11+MATCH(1,$B11:$B28,0)+COLUMN(A$1)-2)),\"\")","v":""},{"$f":"IF(AND($B11=1,$A11<>\"\"),\nIF(MATCH(1,$B12:$B65,0)<  $B11+MATCH(1,$B11:$B28,0)+COLUMN(B$1)-2,\"\",\nINDEX($A11:$A65,$B11+MATCH(1,$B11:$B28,0)+COLUMN(B$1)-2)),\"\")","v":""},{"$f":"IF(AND($B11=1,$A11<>\"\"),\nIF(MATCH(1,$B12:$B65,0)<  $B11+MATCH(1,$B11:$B28,0)+COLUMN(C$1)-2,\"\",\nINDEX($A11:$A65,$B11+MATCH(1,$B11:$B28,0)+COLUMN(C$1)-2)),\"\")","v":""},{"$f":"IF(AND($B11=1,$A11<>\"\"),\nIF(MATCH(1,$B12:$B65,0)<  $B11+MATCH(1,$B11:$B28,0)+COLUMN(D$1)-2,\"\",\nINDEX($A11:$A65,$B11+MATCH(1,$B11:$B28,0)+COLUMN(D$1)-2)),\"\")","v":""},{"$f":"IF(AND($B11=1,$A11<>\"\"),\nIF(MATCH(1,$B12:$B65,0)<  $B11+MATCH(1,$B11:$B28,0)+COLUMN(E$1)-2,\"\",\nINDEX($A11:$A65,$B11+MATCH(1,$B11:$B28,0)+COLUMN(E$1)-2)),\"\")","v":""},{"$f":"IF(AND($B11=1,$A11<>\"\"),\nIF(MATCH(1,$B12:$B65,0)<  $B11+MATCH(1,$B11:$B28,0)+COLUMN(F$1)-2,\"\",\nINDEX($A11:$A65,$B11+MATCH(1,$B11:$B28,0)+COLUMN(F$1)-2)),\"\")","v":""},{"$f":"IF(AND($B11=1,$A11<>\"\"),\nIF(MATCH(1,$B12:$B65,0)<  $B11+MATCH(1,$B11:$B28,0)+COLUMN(G$1)-2,\"\",\nINDEX($A11:$A65,$B11+MATCH(1,$B11:$B28,0)+COLUMN(G$1)-2)),\"\")","v":""},{"$f":"IF(AND($B11=1,$A11<>\"\"),\nIF(MATCH(1,$B12:$B65,0)<  $B11+MATCH(1,$B11:$B28,0)+COLUMN(H$1)-2,\"\",\nINDEX($A11:$A65,$B11+MATCH(1,$B11:$B28,0)+COLUMN(H$1)-2)),\"\")","v":""},{"$f":"IF(AND($B11=1,$A11<>\"\"),\nIF(MATCH(1,$B12:$B65,0)<  $B11+MATCH(1,$B11:$B28,0)+COLUMN(I$1)-2,\"\",\nINDEX($A11:$A65,$B11+MATCH(1,$B11:$B28,0)+COLUMN(I$1)-2)),\"\")","v":""},{"$f":"IF(AND($B11=1,$A11<>\"\"),\nIF(MATCH(1,$B12:$B65,0)<  $B11+MATCH(1,$B11:$B28,0)+COLUMN(J$1)-2,\"\",\nINDEX($A11:$A65,$B11+MATCH(1,$B11:$B28,0)+COLUMN(J$1)-2)),\"\")","v":""},{"$f":"IF(AND($B11=1,$A11<>\"\"),\nIF(MATCH(1,$B12:$B65,0)<  $B11+MATCH(1,$B11:$B28,0)+COLUMN(K$1)-2,\"\",\nINDEX($A11:$A65,$B11+MATCH(1,$B11:$B28,0)+COLUMN(K$1)-2)),\"\")","v":""},{"$f":"IF(AND($B11=1,$A11<>\"\"),\nIF(MATCH(1,$B12:$B65,0)<  $B11+MATCH(1,$B11:$B28,0)+COLUMN(L$1)-2,\"\",\nINDEX($A11:$A65,$B11+MATCH(1,$B11:$B28,0)+COLUMN(L$1)-2)),\"\")","v":""},{"$f":"IF(AND($B11=1,$A11<>\"\"),\nIF(MATCH(1,$B12:$B65,0)<  $B11+MATCH(1,$B11:$B28,0)+COLUMN(M$1)-2,\"\",\nINDEX($A11:$A65,$B11+MATCH(1,$B11:$B28,0)+COLUMN(M$1)-2)),\"\")","v":""},{"$f":"IF(AND($B11=1,$A11<>\"\"),\nIF(MATCH(1,$B12:$B65,0)<  $B11+MATCH(1,$B11:$B28,0)+COLUMN(N$1)-2,\"\",\nINDEX($A11:$A65,$B11+MATCH(1,$B11:$B28,0)+COLUMN(N$1)-2)),\"\")","v":""},{"$f":"IF(AND($B11=1,$A11<>\"\"),\nIF(MATCH(1,$B12:$B65,0)<  $B11+MATCH(1,$B11:$B28,0)+COLUMN(O$1)-2,\"\",\nINDEX($A11:$A65,$B11+MATCH(1,$B11:$B28,0)+COLUMN(O$1)-2)),\"\")","v":""}]
["т/ф. 64-65-29, 38-21-21, e-ральская стальmail: td-saraktash@yandex.ru или td-saraktash@mail.ru",{"$f":"IF(OR(ISNUMBER(--LEFTB(A12,SEARCH(\".\",A12,1)-1)),COUNTA(A12:$A$9123)=0),1,B11+1)","v":4},{"$f":"IF(AND($B12=1,$A12<>\"\"),\nIF(MATCH(1,$B13:$B65,0)<  $B12+MATCH(1,$B12:$B29,0)+COLUMN(A$1)-2,\"\",\nINDEX($A12:$A65,$B12+MATCH(1,$B12:$B29,0)+COLUMN(A$1)-2)),\"\")","v":""},{"$f":"IF(AND($B12=1,$A12<>\"\"),\nIF(MATCH(1,$B13:$B65,0)<  $B12+MATCH(1,$B12:$B29,0)+COLUMN(B$1)-2,\"\",\nINDEX($A12:$A65,$B12+MATCH(1,$B12:$B29,0)+COLUMN(B$1)-2)),\"\")","v":""},{"$f":"IF(AND($B12=1,$A12<>\"\"),\nIF(MATCH(1,$B13:$B65,0)<  $B12+MATCH(1,$B12:$B29,0)+COLUMN(C$1)-2,\"\",\nINDEX($A12:$A65,$B12+MATCH(1,$B12:$B29,0)+COLUMN(C$1)-2)),\"\")","v":""},{"$f":"IF(AND($B12=1,$A12<>\"\"),\nIF(MATCH(1,$B13:$B65,0)<  $B12+MATCH(1,$B12:$B29,0)+COLUMN(D$1)-2,\"\",\nINDEX($A12:$A65,$B12+MATCH(1,$B12:$B29,0)+COLUMN(D$1)-2)),\"\")","v":""},{"$f":"IF(AND($B12=1,$A12<>\"\"),\nIF(MATCH(1,$B13:$B65,0)<  $B12+MATCH(1,$B12:$B29,0)+COLUMN(E$1)-2,\"\",\nINDEX($A12:$A65,$B12+MATCH(1,$B12:$B29,0)+COLUMN(E$1)-2)),\"\")","v":""},{"$f":"IF(AND($B12=1,$A12<>\"\"),\nIF(MATCH(1,$B13:$B65,0)<  $B12+MATCH(1,$B12:$B29,0)+COLUMN(F$1)-2,\"\",\nINDEX($A12:$A65,$B12+MATCH(1,$B12:$B29,0)+COLUMN(F$1)-2)),\"\")","v":""},{"$f":"IF(AND($B12=1,$A12<>\"\"),\nIF(MATCH(1,$B13:$B65,0)<  $B12+MATCH(1,$B12:$B29,0)+COLUMN(G$1)-2,\"\",\nINDEX($A12:$A65,$B12+MATCH(1,$B12:$B29,0)+COLUMN(G$1)-2)),\"\")","v":""},{"$f":"IF(AND($B12=1,$A12<>\"\"),\nIF(MATCH(1,$B13:$B65,0)<  $B12+MATCH(1,$B12:$B29,0)+COLUMN(H$1)-2,\"\",\nINDEX($A12:$A65,$B12+MATCH(1,$B12:$B29,0)+COLUMN(H$1)-2)),\"\")","v":""},{"$f":"IF(AND($B12=1,$A12<>\"\"),\nIF(MATCH(1,$B13:$B65,0)<  $B12+MATCH(1,$B12:$B29,0)+COLUMN(I$1)-2,\"\",\nINDEX($A12:$A65,$B12+MATCH(1,$B12:$B29,0)+COLUMN(I$1)-2)),\"\")","v":""},{"$f":"IF(AND($B12=1,$A12<>\"\"),\nIF(MATCH(1,$B13:$B65,0)<  $B12+MATCH(1,$B12:$B29,0)+COLUMN(J$1)-2,\"\",\nINDEX($A12:$A65,$B12+MATCH(1,$B12:$B29,0)+COLUMN(J$1)-2)),\"\")","v":""},{"$f":"IF(AND($B12=1,$A12<>\"\"),\nIF(MATCH(1,$B13:$B65,0)<  $B12+MATCH(1,$B12:$B29,0)+COLUMN(K$1)-2,\"\",\nINDEX($A12:$A65,$B12+MATCH(1,$B12:$B29,0)+COLUMN(K$1)-2)),\"\")","v":""},{"$f":"IF(AND($B12=1,$A12<>\"\"),\nIF(MATCH(1,$B13:$B65,0)<  $B12+MATCH(1,$B12:$B29,0)+COLUMN(L$1)-2,\"\",\nINDEX($A12:$A65,$B12+MATCH(1,$B12:$B29,0)+COLUMN(L$1)-2)),\"\")","v":""},{"$f":"IF(AND($B12=1,$A12<>\"\"),\nIF(MATCH(1,$B13:$B65,0)<  $B12+MATCH(1,$B12:$B29,0)+COLUMN(M$1)-2,\"\",\nINDEX($A12:$A65,$B12+MATCH(1,$B12:$B29,0)+COLUMN(M$1)-2)),\"\")","v":""},{"$f":"IF(AND($B12=1,$A12<>\"\"),\nIF(MATCH(1,$B13:$B65,0)<  $B12+MATCH(1,$B12:$B29,0)+COLUMN(N$1)-2,\"\",\nINDEX($A12:$A65,$B12+MATCH(1,$B12:$B29,0)+COLUMN(N$1)-2)),\"\")","v":""},{"$f":"IF(AND($B12=1,$A12<>\"\"),\nIF(MATCH(1,$B13:$B65,0)<  $B12+MATCH(1,$B12:$B29,0)+COLUMN(O$1)-2,\"\",\nINDEX($A12:$A65,$B12+MATCH(1,$B12:$B29,0)+COLUMN(O$1)-2)),\"\")","v":""}]
["сайт: www.anairzavod.ru",{"$f":"IF(OR(ISNUMBER(--LEFTB(A13,SEARCH(\".\",A13,1)-1)),COUNTA(A13:$A$9123)=0),1,B12+1)","v":5},{"$f":"IF(AND($B13=1,$A13<>\"\"),\nIF(MATCH(1,$B14:$B65,0)<  $B13+MATCH(1,$B13:$B30,0)+COLUMN(A$1)-2,\"\",\nINDEX($A13:$A65,$B13+MATCH(1,$B13:$B30,0)+COLUMN(A$1)-2)),\"\")","v":""},{"$f":"IF(AND($B13=1,$A13<>\"\"),\nIF(MATCH(1,$B14:$B65,0)<  $B13+MATCH(1,$B13:$B30,0)+COLUMN(B$1)-2,\"\",\nINDEX($A13:$A65,$B13+MATCH(1,$B13:$B30,0)+COLUMN(B$1)-2)),\"\")","v":""},{"$f":"IF(AND($B13=1,$A13<>\"\"),\nIF(MATCH(1,$B14:$B65,0)<  $B13+MATCH(1,$B13:$B30,0)+COLUMN(C$1)-2,\"\",\nINDEX($A13:$A65,$B13+MATCH(1,$B13:$B30,0)+COLUMN(C$1)-2)),\"\")","v":""},{"$f":"IF(AND($B13=1,$A13<>\"\"),\nIF(MATCH(1,$B14:$B65,0)<  $B13+MATCH(1,$B13:$B30,0)+COLUMN(D$1)-2,\"\",\nINDEX($A13:$A65,$B13+MATCH(1,$B13:$B30,0)+COLUMN(D$1)-2)),\"\")","v":""},{"$f":"IF(AND($B13=1,$A13<>\"\"),\nIF(MATCH(1,$B14:$B65,0)<  $B13+MATCH(1,$B13:$B30,0)+COLUMN(E$1)-2,\"\",\nINDEX($A13:$A65,$B13+MATCH(1,$B13:$B30,0)+COLUMN(E$1)-2)),\"\")","v":""},{"$f":"IF(AND($B13=1,$A13<>\"\"),\nIF(MATCH(1,$B14:$B65,0)<  $B13+MATCH(1,$B13:$B30,0)+COLUMN(F$1)-2,\"\",\nINDEX($A13:$A65,$B13+MATCH(1,$B13:$B30,0)+COLUMN(F$1)-2)),\"\")","v":""},{"$f":"IF(AND($B13=1,$A13<>\"\"),\nIF(MATCH(1,$B14:$B65,0)<  $B13+MATCH(1,$B13:$B30,0)+COLUMN(G$1)-2,\"\",\nINDEX($A13:$A65,$B13+MATCH(1,$B13:$B30,0)+COLUMN(G$1)-2)),\"\")","v":""},{"$f":"IF(AND($B13=1,$A13<>\"\"),\nIF(MATCH(1,$B14:$B65,0)<  $B13+MATCH(1,$B13:$B30,0)+COLUMN(H$1)-2,\"\",\nINDEX($A13:$A65,$B13+MATCH(1,$B13:$B30,0)+COLUMN(H$1)-2)),\"\")","v":""},{"$f":"IF(AND($B13=1,$A13<>\"\"),\nIF(MATCH(1,$B14:$B65,0)<  $B13+MATCH(1,$B13:$B30,0)+COLUMN(I$1)-2,\"\",\nINDEX($A13:$A65,$B13+MATCH(1,$B13:$B30,0)+COLUMN(I$1)-2)),\"\")","v":""},{"$f":"IF(AND($B13=1,$A13<>\"\"),\nIF(MATCH(1,$B14:$B65,0)<  $B13+MATCH(1,$B13:$B30,0)+COLUMN(J$1)-2,\"\",\nINDEX($A13:$A65,$B13+MATCH(1,$B13:$B30,0)+COLUMN(J$1)-2)),\"\")","v":""},{"$f":"IF(AND($B13=1,$A13<>\"\"),\nIF(MATCH(1,$B14:$B65,0)<  $B13+MATCH(1,$B13:$B30,0)+COLUMN(K$1)-2,\"\",\nINDEX($A13:$A65,$B13+MATCH(1,$B13:$B30,0)+COLUMN(K$1)-2)),\"\")","v":""},{"$f":"IF(AND($B13=1,$A13<>\"\"),\nIF(MATCH(1,$B14:$B65,0)<  $B13+MATCH(1,$B13:$B30,0)+COLUMN(L$1)-2,\"\",\nINDEX($A13:$A65,$B13+MATCH(1,$B13:$B30,0)+COLUMN(L$1)-2)),\"\")","v":""},{"$f":"IF(AND($B13=1,$A13<>\"\"),\nIF(MATCH(1,$B14:$B65,0)<  $B13+MATCH(1,$B13:$B30,0)+COLUMN(M$1)-2,\"\",\nINDEX($A13:$A65,$B13+MATCH(1,$B13:$B30,0)+COLUMN(M$1)-2)),\"\")","v":""},{"$f":"IF(AND($B13=1,$A13<>\"\"),\nIF(MATCH(1,$B14:$B65,0)<  $B13+MATCH(1,$B13:$B30,0)+COLUMN(N$1)-2,\"\",\nINDEX($A13:$A65,$B13+MATCH(1,$B13:$B30,0)+COLUMN(N$1)-2)),\"\")","v":""},{"$f":"IF(AND($B13=1,$A13<>\"\"),\nIF(MATCH(1,$B14:$B65,0)<  $B13+MATCH(1,$B13:$B30,0)+COLUMN(O$1)-2,\"\",\nINDEX($A13:$A65,$B13+MATCH(1,$B13:$B30,0)+COLUMN(O$1)-2)),\"\")","v":""}]
["3.    ОАО \"Банк \"Оренбург\" ",{"$f":"IF(OR(ISNUMBER(--LEFTB(A14,SEARCH(\".\",A14,1)-1)),COUNTA(A14:$A$9123)=0),1,B13+1)","v":1},{"$f":"IF(AND($B14=1,$A14<>\"\"),\nIF(MATCH(1,$B15:$B65,0)<  $B14+MATCH(1,$B14:$B31,0)+COLUMN(A$1)-2,\"\",\nINDEX($A14:$A65,$B14+MATCH(1,$B14:$B31,0)+COLUMN(A$1)-2)),\"\")","v":"3.    ОАО \"Банк \"Оренбург\" "},{"$f":"IF(AND($B14=1,$A14<>\"\"),\nIF(MATCH(1,$B15:$B65,0)<  $B14+MATCH(1,$B14:$B31,0)+COLUMN(B$1)-2,\"\",\nINDEX($A14:$A65,$B14+MATCH(1,$B14:$B31,0)+COLUMN(B$1)-2)),\"\")","v":"Председатель Правления Самойлов Юрий Владимирович"},{"$f":"IF(AND($B14=1,$A14<>\"\"),\nIF(MATCH(1,$B15:$B65,0)<  $B14+MATCH(1,$B14:$B31,0)+COLUMN(C$1)-2,\"\",\nINDEX($A14:$A65,$B14+MATCH(1,$B14:$B31,0)+COLUMN(C$1)-2)),\"\")","v":"адрес: 460024 г.Оренбург, ул.Маршала Г.К. Жукова, 25 "},{"$f":"IF(AND($B14=1,$A14<>\"\"),\nIF(MATCH(1,$B15:$B65,0)<  $B14+MATCH(1,$B14:$B31,0)+COLUMN(D$1)-2,\"\",\nINDEX($A14:$A65,$B14+MATCH(1,$B14:$B31,0)+COLUMN(D$1)-2)),\"\")","v":"Тел. 343-000;  факс: 343-111; приемная 343-008"},{"$f":"IF(AND($B14=1,$A14<>\"\"),\nIF(MATCH(1,$B15:$B65,0)<  $B14+MATCH(1,$B14:$B31,0)+COLUMN(E$1)-2,\"\",\nINDEX($A14:$A65,$B14+MATCH(1,$B14:$B31,0)+COLUMN(E$1)-2)),\"\")","v":"e-mail: info@orbank.ru; сайт: www.orbank.ru"},{"$f":"IF(AND($B14=1,$A14<>\"\"),\nIF(MATCH(1,$B15:$B65,0)<  $B14+MATCH(1,$B14:$B31,0)+COLUMN(F$1)-2,\"\",\nINDEX($A14:$A65,$B14+MATCH(1,$B14:$B31,0)+COLUMN(F$1)-2)),\"\")","v":""},{"$f":"IF(AND($B14=1,$A14<>\"\"),\nIF(MATCH(1,$B15:$B65,0)<  $B14+MATCH(1,$B14:$B31,0)+COLUMN(G$1)-2,\"\",\nINDEX($A14:$A65,$B14+MATCH(1,$B14:$B31,0)+COLUMN(G$1)-2)),\"\")","v":""},{"$f":"IF(AND($B14=1,$A14<>\"\"),\nIF(MATCH(1,$B15:$B65,0)<  $B14+MATCH(1,$B14:$B31,0)+COLUMN(H$1)-2,\"\",\nINDEX($A14:$A65,$B14+MATCH(1,$B14:$B31,0)+COLUMN(H$1)-2)),\"\")","v":""},{"$f":"IF(AND($B14=1,$A14<>\"\"),\nIF(MATCH(1,$B15:$B65,0)<  $B14+MATCH(1,$B14:$B31,0)+COLUMN(I$1)-2,\"\",\nINDEX($A14:$A65,$B14+MATCH(1,$B14:$B31,0)+COLUMN(I$1)-2)),\"\")","v":""},{"$f":"IF(AND($B14=1,$A14<>\"\"),\nIF(MATCH(1,$B15:$B65,0)<  $B14+MATCH(1,$B14:$B31,0)+COLUMN(J$1)-2,\"\",\nINDEX($A14:$A65,$B14+MATCH(1,$B14:$B31,0)+COLUMN(J$1)-2)),\"\")","v":""},{"$f":"IF(AND($B14=1,$A14<>\"\"),\nIF(MATCH(1,$B15:$B65,0)<  $B14+MATCH(1,$B14:$B31,0)+COLUMN(K$1)-2,\"\",\nINDEX($A14:$A65,$B14+MATCH(1,$B14:$B31,0)+COLUMN(K$1)-2)),\"\")","v":""},{"$f":"IF(AND($B14=1,$A14<>\"\"),\nIF(MATCH(1,$B15:$B65,0)<  $B14+MATCH(1,$B14:$B31,0)+COLUMN(L$1)-2,\"\",\nINDEX($A14:$A65,$B14+MATCH(1,$B14:$B31,0)+COLUMN(L$1)-2)),\"\")","v":""},{"$f":"IF(AND($B14=1,$A14<>\"\"),\nIF(MATCH(1,$B15:$B65,0)<  $B14+MATCH(1,$B14:$B31,0)+COLUMN(M$1)-2,\"\",\nINDEX($A14:$A65,$B14+MATCH(1,$B14:$B31,0)+COLUMN(M$1)-2)),\"\")","v":""},{"$f":"IF(AND($B14=1,$A14<>\"\"),\nIF(MATCH(1,$B15:$B65,0)<  $B14+MATCH(1,$B14:$B31,0)+COLUMN(N$1)-2,\"\",\nINDEX($A14:$A65,$B14+MATCH(1,$B14:$B31,0)+COLUMN(N$1)-2)),\"\")","v":""},{"$f":"IF(AND($B14=1,$A14<>\"\"),\nIF(MATCH(1,$B15:$B65,0)<  $B14+MATCH(1,$B14:$B31,0)+COLUMN(O$1)-2,\"\",\nINDEX($A14:$A65,$B14+MATCH(1,$B14:$B31,0)+COLUMN(O$1)-2)),\"\")","v":""}]
["Председатель Правления Самойлов Юрий Владимирович",{"$f":"IF(OR(ISNUMBER(--LEFTB(A15,SEARCH(\".\",A15,1)-1)),COUNTA(A15:$A$9123)=0),1,B14+1)","v":2},{"$f":"IF(AND($B15=1,$A15<>\"\"),\nIF(MATCH(1,$B16:$B65,0)<  $B15+MATCH(1,$B15:$B32,0)+COLUMN(A$1)-2,\"\",\nINDEX($A15:$A65,$B15+MATCH(1,$B15:$B32,0)+COLUMN(A$1)-2)),\"\")","v":""},{"$f":"IF(AND($B15=1,$A15<>\"\"),\nIF(MATCH(1,$B16:$B65,0)<  $B15+MATCH(1,$B15:$B32,0)+COLUMN(B$1)-2,\"\",\nINDEX($A15:$A65,$B15+MATCH(1,$B15:$B32,0)+COLUMN(B$1)-2)),\"\")","v":""},{"$f":"IF(AND($B15=1,$A15<>\"\"),\nIF(MATCH(1,$B16:$B65,0)<  $B15+MATCH(1,$B15:$B32,0)+COLUMN(C$1)-2,\"\",\nINDEX($A15:$A65,$B15+MATCH(1,$B15:$B32,0)+COLUMN(C$1)-2)),\"\")","v":""},{"$f":"IF(AND($B15=1,$A15<>\"\"),\nIF(MATCH(1,$B16:$B65,0)<  $B15+MATCH(1,$B15:$B32,0)+COLUMN(D$1)-2,\"\",\nINDEX($A15:$A65,$B15+MATCH(1,$B15:$B32,0)+COLUMN(D$1)-2)),\"\")","v":""},{"$f":"IF(AND($B15=1,$A15<>\"\"),\nIF(MATCH(1,$B16:$B65,0)<  $B15+MATCH(1,$B15:$B32,0)+COLUMN(E$1)-2,\"\",\nINDEX($A15:$A65,$B15+MATCH(1,$B15:$B32,0)+COLUMN(E$1)-2)),\"\")","v":""},{"$f":"IF(AND($B15=1,$A15<>\"\"),\nIF(MATCH(1,$B16:$B65,0)<  $B15+MATCH(1,$B15:$B32,0)+COLUMN(F$1)-2,\"\",\nINDEX($A15:$A65,$B15+MATCH(1,$B15:$B32,0)+COLUMN(F$1)-2)),\"\")","v":""},{"$f":"IF(AND($B15=1,$A15<>\"\"),\nIF(MATCH(1,$B16:$B65,0)<  $B15+MATCH(1,$B15:$B32,0)+COLUMN(G$1)-2,\"\",\nINDEX($A15:$A65,$B15+MATCH(1,$B15:$B32,0)+COLUMN(G$1)-2)),\"\")","v":""},{"$f":"IF(AND($B15=1,$A15<>\"\"),\nIF(MATCH(1,$B16:$B65,0)<  $B15+MATCH(1,$B15:$B32,0)+COLUMN(H$1)-2,\"\",\nINDEX($A15:$A65,$B15+MATCH(1,$B15:$B32,0)+COLUMN(H$1)-2)),\"\")","v":""},{"$f":"IF(AND($B15=1,$A15<>\"\"),\nIF(MATCH(1,$B16:$B65,0)<  $B15+MATCH(1,$B15:$B32,0)+COLUMN(I$1)-2,\"\",\nINDEX($A15:$A65,$B15+MATCH(1,$B15:$B32,0)+COLUMN(I$1)-2)),\"\")","v":""},{"$f":"IF(AND($B15=1,$A15<>\"\"),\nIF(MATCH(1,$B16:$B65,0)<  $B15+MATCH(1,$B15:$B32,0)+COLUMN(J$1)-2,\"\",\nINDEX($A15:$A65,$B15+MATCH(1,$B15:$B32,0)+COLUMN(J$1)-2)),\"\")","v":""},{"$f":"IF(AND($B15=1,$A15<>\"\"),\nIF(MATCH(1,$B16:$B65,0)<  $B15+MATCH(1,$B15:$B32,0)+COLUMN(K$1)-2,\"\",\nINDEX($A15:$A65,$B15+MATCH(1,$B15:$B32,0)+COLUMN(K$1)-2)),\"\")","v":""},{"$f":"IF(AND($B15=1,$A15<>\"\"),\nIF(MATCH(1,$B16:$B65,0)<  $B15+MATCH(1,$B15:$B32,0)+COLUMN(L$1)-2,\"\",\nINDEX($A15:$A65,$B15+MATCH(1,$B15:$B32,0)+COLUMN(L$1)-2)),\"\")","v":""},{"$f":"IF(AND($B15=1,$A15<>\"\"),\nIF(MATCH(1,$B16:$B65,0)<  $B15+MATCH(1,$B15:$B32,0)+COLUMN(M$1)-2,\"\",\nINDEX($A15:$A65,$B15+MATCH(1,$B15:$B32,0)+COLUMN(M$1)-2)),\"\")","v":""},{"$f":"IF(AND($B15=1,$A15<>\"\"),\nIF(MATCH(1,$B16:$B65,0)<  $B15+MATCH(1,$B15:$B32,0)+COLUMN(N$1)-2,\"\",\nINDEX($A15:$A65,$B15+MATCH(1,$B15:$B32,0)+COLUMN(N$1)-2)),\"\")","v":""},{"$f":"IF(AND($B15=1,$A15<>\"\"),\nIF(MATCH(1,$B16:$B65,0)<  $B15+MATCH(1,$B15:$B32,0)+COLUMN(O$1)-2,\"\",\nINDEX($A15:$A65,$B15+MATCH(1,$B15:$B32,0)+COLUMN(O$1)-2)),\"\")","v":""}]
["адрес: 460024 г.Оренбург, ул.Маршала Г.К. Жукова, 25 ",{"$f":"IF(OR(ISNUMBER(--LEFTB(A16,SEARCH(\".\",A16,1)-1)),COUNTA(A16:$A$9123)=0),1,B15+1)","v":3},{"$f":"IF(AND($B16=1,$A16<>\"\"),\nIF(MATCH(1,$B17:$B65,0)<  $B16+MATCH(1,$B16:$B33,0)+COLUMN(A$1)-2,\"\",\nINDEX($A16:$A65,$B16+MATCH(1,$B16:$B33,0)+COLUMN(A$1)-2)),\"\")","v":""},{"$f":"IF(AND($B16=1,$A16<>\"\"),\nIF(MATCH(1,$B17:$B65,0)<  $B16+MATCH(1,$B16:$B33,0)+COLUMN(B$1)-2,\"\",\nINDEX($A16:$A65,$B16+MATCH(1,$B16:$B33,0)+COLUMN(B$1)-2)),\"\")","v":""},{"$f":"IF(AND($B16=1,$A16<>\"\"),\nIF(MATCH(1,$B17:$B65,0)<  $B16+MATCH(1,$B16:$B33,0)+COLUMN(C$1)-2,\"\",\nINDEX($A16:$A65,$B16+MATCH(1,$B16:$B33,0)+COLUMN(C$1)-2)),\"\")","v":""},{"$f":"IF(AND($B16=1,$A16<>\"\"),\nIF(MATCH(1,$B17:$B65,0)<  $B16+MATCH(1,$B16:$B33,0)+COLUMN(D$1)-2,\"\",\nINDEX($A16:$A65,$B16+MATCH(1,$B16:$B33,0)+COLUMN(D$1)-2)),\"\")","v":""},{"$f":"IF(AND($B16=1,$A16<>\"\"),\nIF(MATCH(1,$B17:$B65,0)<  $B16+MATCH(1,$B16:$B33,0)+COLUMN(E$1)-2,\"\",\nINDEX($A16:$A65,$B16+MATCH(1,$B16:$B33,0)+COLUMN(E$1)-2)),\"\")","v":""},{"$f":"IF(AND($B16=1,$A16<>\"\"),\nIF(MATCH(1,$B17:$B65,0)<  $B16+MATCH(1,$B16:$B33,0)+COLUMN(F$1)-2,\"\",\nINDEX($A16:$A65,$B16+MATCH(1,$B16:$B33,0)+COLUMN(F$1)-2)),\"\")","v":""},{"$f":"IF(AND($B16=1,$A16<>\"\"),\nIF(MATCH(1,$B17:$B65,0)<  $B16+MATCH(1,$B16:$B33,0)+COLUMN(G$1)-2,\"\",\nINDEX($A16:$A65,$B16+MATCH(1,$B16:$B33,0)+COLUMN(G$1)-2)),\"\")","v":""},{"$f":"IF(AND($B16=1,$A16<>\"\"),\nIF(MATCH(1,$B17:$B65,0)<  $B16+MATCH(1,$B16:$B33,0)+COLUMN(H$1)-2,\"\",\nINDEX($A16:$A65,$B16+MATCH(1,$B16:$B33,0)+COLUMN(H$1)-2)),\"\")","v":""},{"$f":"IF(AND($B16=1,$A16<>\"\"),\nIF(MATCH(1,$B17:$B65,0)<  $B16+MATCH(1,$B16:$B33,0)+COLUMN(I$1)-2,\"\",\nINDEX($A16:$A65,$B16+MATCH(1,$B16:$B33,0)+COLUMN(I$1)-2)),\"\")","v":""},{"$f":"IF(AND($B16=1,$A16<>\"\"),\nIF(MATCH(1,$B17:$B65,0)<  $B16+MATCH(1,$B16:$B33,0)+COLUMN(J$1)-2,\"\",\nINDEX($A16:$A65,$B16+MATCH(1,$B16:$B33,0)+COLUMN(J$1)-2)),\"\")","v":""},{"$f":"IF(AND($B16=1,$A16<>\"\"),\nIF(MATCH(1,$B17:$B65,0)<  $B16+MATCH(1,$B16:$B33,0)+COLUMN(K$1)-2,\"\",\nINDEX($A16:$A65,$B16+MATCH(1,$B16:$B33,0)+COLUMN(K$1)-2)),\"\")","v":""},{"$f":"IF(AND($B16=1,$A16<>\"\"),\nIF(MATCH(1,$B17:$B65,0)<  $B16+MATCH(1,$B16:$B33,0)+COLUMN(L$1)-2,\"\",\nINDEX($A16:$A65,$B16+MATCH(1,$B16:$B33,0)+COLUMN(L$1)-2)),\"\")","v":""},{"$f":"IF(AND($B16=1,$A16<>\"\"),\nIF(MATCH(1,$B17:$B65,0)<  $B16+MATCH(1,$B16:$B33,0)+COLUMN(M$1)-2,\"\",\nINDEX($A16:$A65,$B16+MATCH(1,$B16:$B33,0)+COLUMN(M$1)-2)),\"\")","v":""},{"$f":"IF(AND($B16=1,$A16<>\"\"),\nIF(MATCH(1,$B17:$B65,0)<  $B16+MATCH(1,$B16:$B33,0)+COLUMN(N$1)-2,\"\",\nINDEX($A16:$A65,$B16+MATCH(1,$B16:$B33,0)+COLUMN(N$1)-2)),\"\")","v":""},{"$f":"IF(AND($B16=1,$A16<>\"\"),\nIF(MATCH(1,$B17:$B65,0)<  $B16+MATCH(1,$B16:$B33,0)+COLUMN(O$1)-2,\"\",\nINDEX($A16:$A65,$B16+MATCH(1,$B16:$B33,0)+COLUMN(O$1)-2)),\"\")","v":""}]
["Тел. 343-000;  факс: 343-111; приемная 343-008",{"$f":"IF(OR(ISNUMBER(--LEFTB(A17,SEARCH(\".\",A17,1)-1)),COUNTA(A17:$A$9123)=0),1,B16+1)","v":4},{"$f":"IF(AND($B17=1,$A17<>\"\"),\nIF(MATCH(1,$B18:$B65,0)<  $B17+MATCH(1,$B17:$B34,0)+COLUMN(A$1)-2,\"\",\nINDEX($A17:$A65,$B17+MATCH(1,$B17:$B34,0)+COLUMN(A$1)-2)),\"\")","v":""},{"$f":"IF(AND($B17=1,$A17<>\"\"),\nIF(MATCH(1,$B18:$B65,0)<  $B17+MATCH(1,$B17:$B34,0)+COLUMN(B$1)-2,\"\",\nINDEX($A17:$A65,$B17+MATCH(1,$B17:$B34,0)+COLUMN(B$1)-2)),\"\")","v":""},{"$f":"IF(AND($B17=1,$A17<>\"\"),\nIF(MATCH(1,$B18:$B65,0)<  $B17+MATCH(1,$B17:$B34,0)+COLUMN(C$1)-2,\"\",\nINDEX($A17:$A65,$B17+MATCH(1,$B17:$B34,0)+COLUMN(C$1)-2)),\"\")","v":""},{"$f":"IF(AND($B17=1,$A17<>\"\"),\nIF(MATCH(1,$B18:$B65,0)<  $B17+MATCH(1,$B17:$B34,0)+COLUMN(D$1)-2,\"\",\nINDEX($A17:$A65,$B17+MATCH(1,$B17:$B34,0)+COLUMN(D$1)-2)),\"\")","v":""},{"$f":"IF(AND($B17=1,$A17<>\"\"),\nIF(MATCH(1,$B18:$B65,0)<  $B17+MATCH(1,$B17:$B34,0)+COLUMN(E$1)-2,\"\",\nINDEX($A17:$A65,$B17+MATCH(1,$B17:$B34,0)+COLUMN(E$1)-2)),\"\")","v":""},{"$f":"IF(AND($B17=1,$A17<>\"\"),\nIF(MATCH(1,$B18:$B65,0)<  $B17+MATCH(1,$B17:$B34,0)+COLUMN(F$1)-2,\"\",\nINDEX($A17:$A65,$B17+MATCH(1,$B17:$B34,0)+COLUMN(F$1)-2)),\"\")","v":""},{"$f":"IF(AND($B17=1,$A17<>\"\"),\nIF(MATCH(1,$B18:$B65,0)<  $B17+MATCH(1,$B17:$B34,0)+COLUMN(G$1)-2,\"\",\nINDEX($A17:$A65,$B17+MATCH(1,$B17:$B34,0)+COLUMN(G$1)-2)),\"\")","v":""},{"$f":"IF(AND($B17=1,$A17<>\"\"),\nIF(MATCH(1,$B18:$B65,0)<  $B17+MATCH(1,$B17:$B34,0)+COLUMN(H$1)-2,\"\",\nINDEX($A17:$A65,$B17+MATCH(1,$B17:$B34,0)+COLUMN(H$1)-2)),\"\")","v":""},{"$f":"IF(AND($B17=1,$A17<>\"\"),\nIF(MATCH(1,$B18:$B65,0)<  $B17+MATCH(1,$B17:$B34,0)+COLUMN(I$1)-2,\"\",\nINDEX($A17:$A65,$B17+MATCH(1,$B17:$B34,0)+COLUMN(I$1)-2)),\"\")","v":""},{"$f":"IF(AND($B17=1,$A17<>\"\"),\nIF(MATCH(1,$B18:$B65,0)<  $B17+MATCH(1,$B17:$B34,0)+COLUMN(J$1)-2,\"\",\nINDEX($A17:$A65,$B17+MATCH(1,$B17:$B34,0)+COLUMN(J$1)-2)),\"\")","v":""},{"$f":"IF(AND($B17=1,$A17<>\"\"),\nIF(MATCH(1,$B18:$B65,0)<  $B17+MATCH(1,$B17:$B34,0)+COLUMN(K$1)-2,\"\",\nINDEX($A17:$A65,$B17+MATCH(1,$B17:$B34,0)+COLUMN(K$1)-2)),\"\")","v":""},{"$f":"IF(AND($B17=1,$A17<>\"\"),\nIF(MATCH(1,$B18:$B65,0)<  $B17+MATCH(1,$B17:$B34,0)+COLUMN(L$1)-2,\"\",\nINDEX($A17:$A65,$B17+MATCH(1,$B17:$B34,0)+COLUMN(L$1)-2)),\"\")","v":""},{"$f":"IF(AND($B17=1,$A17<>\"\"),\nIF(MATCH(1,$B18:$B65,0)<  $B17+MATCH(1,$B17:$B34,0)+COLUMN(M$1)-2,\"\",\nINDEX($A17:$A65,$B17+MATCH(1,$B17:$B34,0)+COLUMN(M$1)-2)),\"\")","v":""},{"$f":"IF(AND($B17=1,$A17<>\"\"),\nIF(MATCH(1,$B18:$B65,0)<  $B17+MATCH(1,$B17:$B34,0)+COLUMN(N$1)-2,\"\",\nINDEX($A17:$A65,$B17+MATCH(1,$B17:$B34,0)+COLUMN(N$1)-2)),\"\")","v":""},{"$f":"IF(AND($B17=1,$A17<>\"\"),\nIF(MATCH(1,$B18:$B65,0)<  $B17+MATCH(1,$B17:$B34,0)+COLUMN(O$1)-2,\"\",\nINDEX($A17:$A65,$B17+MATCH(1,$B17:$B34,0)+COLUMN(O$1)-2)),\"\")","v":""}]
["e-mail: info@orbank.ru; сайт: www.orbank.ru",{"$f":"IF(OR(ISNUMBER(--LEFTB(A18,SEARCH(\".\",A18,1)-1)),COUNTA(A18:$A$9123)=0),1,B17+1)","v":5},{"$f":"IF(AND($B18=1,$A18<>\"\"),\nIF(MATCH(1,$B19:$B65,0)<  $B18+MATCH(1,$B18:$B35,0)+COLUMN(A$1)-2,\"\",\nINDEX($A18:$A65,$B18+MATCH(1,$B18:$B35,0)+COLUMN(A$1)-2)),\"\")","v":""},{"$f":"IF(AND($B18=1,$A18<>\"\"),\nIF(MATCH(1,$B19:$B65,0)<  $B18+MATCH(1,$B18:$B35,0)+COLUMN(B$1)-2,\"\",\nINDEX($A18:$A65,$B18+MATCH(1,$B18:$B35,0)+COLUMN(B$1)-2)),\"\")","v":""},{"$f":"IF(AND($B18=1,$A18<>\"\"),\nIF(MATCH(1,$B19:$B65,0)<  $B18+MATCH(1,$B18:$B35,0)+COLUMN(C$1)-2,\"\",\nINDEX($A18:$A65,$B18+MATCH(1,$B18:$B35,0)+COLUMN(C$1)-2)),\"\")","v":""},{"$f":"IF(AND($B18=1,$A18<>\"\"),\nIF(MATCH(1,$B19:$B65,0)<  $B18+MATCH(1,$B18:$B35,0)+COLUMN(D$1)-2,\"\",\nINDEX($A18:$A65,$B18+MATCH(1,$B18:$B35,0)+COLUMN(D$1)-2)),\"\")","v":""},{"$f":"IF(AND($B18=1,$A18<>\"\"),\nIF(MATCH(1,$B19:$B65,0)<  $B18+MATCH(1,$B18:$B35,0)+COLUMN(E$1)-2,\"\",\nINDEX($A18:$A65,$B18+MATCH(1,$B18:$B35,0)+COLUMN(E$1)-2)),\"\")","v":""},{"$f":"IF(AND($B18=1,$A18<>\"\"),\nIF(MATCH(1,$B19:$B65,0)<  $B18+MATCH(1,$B18:$B35,0)+COLUMN(F$1)-2,\"\",\nINDEX($A18:$A65,$B18+MATCH(1,$B18:$B35,0)+COLUMN(F$1)-2)),\"\")","v":""},{"$f":"IF(AND($B18=1,$A18<>\"\"),\nIF(MATCH(1,$B19:$B65,0)<  $B18+MATCH(1,$B18:$B35,0)+COLUMN(G$1)-2,\"\",\nINDEX($A18:$A65,$B18+MATCH(1,$B18:$B35,0)+COLUMN(G$1)-2)),\"\")","v":""},{"$f":"IF(AND($B18=1,$A18<>\"\"),\nIF(MATCH(1,$B19:$B65,0)<  $B18+MATCH(1,$B18:$B35,0)+COLUMN(H$1)-2,\"\",\nINDEX($A18:$A65,$B18+MATCH(1,$B18:$B35,0)+COLUMN(H$1)-2)),\"\")","v":""},{"$f":"IF(AND($B18=1,$A18<>\"\"),\nIF(MATCH(1,$B19:$B65,0)<  $B18+MATCH(1,$B18:$B35,0)+COLUMN(I$1)-2,\"\",\nINDEX($A18:$A65,$B18+MATCH(1,$B18:$B35,0)+COLUMN(I$1)-2)),\"\")","v":""},{"$f":"IF(AND($B18=1,$A18<>\"\"),\nIF(MATCH(1,$B19:$B65,0)<  $B18+MATCH(1,$B18:$B35,0)+COLUMN(J$1)-2,\"\",\nINDEX($A18:$A65,$B18+MATCH(1,$B18:$B35,0)+COLUMN(J$1)-2)),\"\")","v":""},{"$f":"IF(AND($B18=1,$A18<>\"\"),\nIF(MATCH(1,$B19:$B65,0)<  $B18+MATCH(1,$B18:$B35,0)+COLUMN(K$1)-2,\"\",\nINDEX($A18:$A65,$B18+MATCH(1,$B18:$B35,0)+COLUMN(K$1)-2)),\"\")","v":""},{"$f":"IF(AND($B18=1,$A18<>\"\"),\nIF(MATCH(1,$B19:$B65,0)<  $B18+MATCH(1,$B18:$B35,0)+COLUMN(L$1)-2,\"\",\nINDEX($A18:$A65,$B18+MATCH(1,$B18:$B35,0)+COLUMN(L$1)-2)),\"\")","v":""},{"$f":"IF(AND($B18=1,$A18<>\"\"),\nIF(MATCH(1,$B19:$B65,0)<  $B18+MATCH(1,$B18:$B35,0)+COLUMN(M$1)-2,\"\",\nINDEX($A18:$A65,$B18+MATCH(1,$B18:$B35,0)+COLUMN(M$1)-2)),\"\")","v":""},{"$f":"IF(AND($B18=1,$A18<>\"\"),\nIF(MATCH(1,$B19:$B65,0)<  $B18+MATCH(1,$B18:$B35,0)+COLUMN(N$1)-2,\"\",\nINDEX($A18:$A65,$B18+MATCH(1,$B18:$B35,0)+COLUMN(N$1)-2)),\"\")","v":""},{"$f":"IF(AND($B18=1,$A18<>\"\"),\nIF(MATCH(1,$B19:$B65,0)<  $B18+MATCH(1,$B18:$B35,0)+COLUMN(O$1)-2,\"\",\nINDEX($A18:$A65,$B18+MATCH(1,$B18:$B35,0)+COLUMN(O$1)-2)),\"\")","v":""}]
["4.    ООО «Научно-производственное объединение «ВЕЛТ»",{"$f":"IF(OR(ISNUMBER(--LEFTB(A19,SEARCH(\".\",A19,1)-1)),COUNTA(A19:$A$9123)=0),1,B18+1)","v":1},{"$f":"IF(AND($B19=1,$A19<>\"\"),\nIF(MATCH(1,$B20:$B65,0)<  $B19+MATCH(1,$B19:$B36,0)+COLUMN(A$1)-2,\"\",\nINDEX($A19:$A65,$B19+MATCH(1,$B19:$B36,0)+COLUMN(A$1)-2)),\"\")","v":"4.    ООО «Научно-производственное объединение «ВЕЛТ»"},{"$f":"IF(AND($B19=1,$A19<>\"\"),\nIF(MATCH(1,$B20:$B65,0)<  $B19+MATCH(1,$B19:$B36,0)+COLUMN(B$1)-2,\"\",\nINDEX($A19:$A65,$B19+MATCH(1,$B19:$B36,0)+COLUMN(B$1)-2)),\"\")","v":"Генеральный директор Иванова Елена Борисовна "},{"$f":"IF(AND($B19=1,$A19<>\"\"),\nIF(MATCH(1,$B20:$B65,0)<  $B19+MATCH(1,$B19:$B36,0)+COLUMN(C$1)-2,\"\",\nINDEX($A19:$A65,$B19+MATCH(1,$B19:$B36,0)+COLUMN(C$1)-2)),\"\")","v":"адрес: 460000 г. Оренбург, пер. Хлебный, 9 "},{"$f":"IF(AND($B19=1,$A19<>\"\"),\nIF(MATCH(1,$B20:$B65,0)<  $B19+MATCH(1,$B19:$B36,0)+COLUMN(D$1)-2,\"\",\nINDEX($A19:$A65,$B19+MATCH(1,$B19:$B36,0)+COLUMN(D$1)-2)),\"\")","v":"Тел./факс 77-04-59, факс 77-43-89"},{"$f":"IF(AND($B19=1,$A19<>\"\"),\nIF(MATCH(1,$B20:$B65,0)<  $B19+MATCH(1,$B19:$B36,0)+COLUMN(E$1)-2,\"\",\nINDEX($A19:$A65,$B19+MATCH(1,$B19:$B36,0)+COLUMN(E$1)-2)),\"\")","v":"e-mail: velt@esoo.ru, сайт: www.velt-npo.ru"},{"$f":"IF(AND($B19=1,$A19<>\"\"),\nIF(MATCH(1,$B20:$B65,0)<  $B19+MATCH(1,$B19:$B36,0)+COLUMN(F$1)-2,\"\",\nINDEX($A19:$A65,$B19+MATCH(1,$B19:$B36,0)+COLUMN(F$1)-2)),\"\")","v":""},{"$f":"IF(AND($B19=1,$A19<>\"\"),\nIF(MATCH(1,$B20:$B65,0)<  $B19+MATCH(1,$B19:$B36,0)+COLUMN(G$1)-2,\"\",\nINDEX($A19:$A65,$B19+MATCH(1,$B19:$B36,0)+COLUMN(G$1)-2)),\"\")","v":""},{"$f":"IF(AND($B19=1,$A19<>\"\"),\nIF(MATCH(1,$B20:$B65,0)<  $B19+MATCH(1,$B19:$B36,0)+COLUMN(H$1)-2,\"\",\nINDEX($A19:$A65,$B19+MATCH(1,$B19:$B36,0)+COLUMN(H$1)-2)),\"\")","v":""},{"$f":"IF(AND($B19=1,$A19<>\"\"),\nIF(MATCH(1,$B20:$B65,0)<  $B19+MATCH(1,$B19:$B36,0)+COLUMN(I$1)-2,\"\",\nINDEX($A19:$A65,$B19+MATCH(1,$B19:$B36,0)+COLUMN(I$1)-2)),\"\")","v":""},{"$f":"IF(AND($B19=1,$A19<>\"\"),\nIF(MATCH(1,$B20:$B65,0)<  $B19+MATCH(1,$B19:$B36,0)+COLUMN(J$1)-2,\"\",\nINDEX($A19:$A65,$B19+MATCH(1,$B19:$B36,0)+COLUMN(J$1)-2)),\"\")","v":""},{"$f":"IF(AND($B19=1,$A19<>\"\"),\nIF(MATCH(1,$B20:$B65,0)<  $B19+MATCH(1,$B19:$B36,0)+COLUMN(K$1)-2,\"\",\nINDEX($A19:$A65,$B19+MATCH(1,$B19:$B36,0)+COLUMN(K$1)-2)),\"\")","v":""},{"$f":"IF(AND($B19=1,$A19<>\"\"),\nIF(MATCH(1,$B20:$B65,0)<  $B19+MATCH(1,$B19:$B36,0)+COLUMN(L$1)-2,\"\",\nINDEX($A19:$A65,$B19+MATCH(1,$B19:$B36,0)+COLUMN(L$1)-2)),\"\")","v":""},{"$f":"IF(AND($B19=1,$A19<>\"\"),\nIF(MATCH(1,$B20:$B65,0)<  $B19+MATCH(1,$B19:$B36,0)+COLUMN(M$1)-2,\"\",\nINDEX($A19:$A65,$B19+MATCH(1,$B19:$B36,0)+COLUMN(M$1)-2)),\"\")","v":""},{"$f":"IF(AND($B19=1,$A19<>\"\"),\nIF(MATCH(1,$B20:$B65,0)<  $B19+MATCH(1,$B19:$B36,0)+COLUMN(N$1)-2,\"\",\nINDEX($A19:$A65,$B19+MATCH(1,$B19:$B36,0)+COLUMN(N$1)-2)),\"\")","v":""},{"$f":"IF(AND($B19=1,$A19<>\"\"),\nIF(MATCH(1,$B20:$B65,0)<  $B19+MATCH(1,$B19:$B36,0)+COLUMN(O$1)-2,\"\",\nINDEX($A19:$A65,$B19+MATCH(1,$B19:$B36,0)+COLUMN(O$1)-2)),\"\")","v":""}]
["Генеральный директор Иванова Елена Борисовна ",{"$f":"IF(OR(ISNUMBER(--LEFTB(A20,SEARCH(\".\",A20,1)-1)),COUNTA(A20:$A$9123)=0),1,B19+1)","v":2},{"$f":"IF(AND($B20=1,$A20<>\"\"),\nIF(MATCH(1,$B21:$B65,0)<  $B20+MATCH(1,$B20:$B37,0)+COLUMN(A$1)-2,\"\",\nINDEX($A20:$A65,$B20+MATCH(1,$B20:$B37,0)+COLUMN(A$1)-2)),\"\")","v":""},{"$f":"IF(AND($B20=1,$A20<>\"\"),\nIF(MATCH(1,$B21:$B65,0)<  $B20+MATCH(1,$B20:$B37,0)+COLUMN(B$1)-2,\"\",\nINDEX($A20:$A65,$B20+MATCH(1,$B20:$B37,0)+COLUMN(B$1)-2)),\"\")","v":""},{"$f":"IF(AND($B20=1,$A20<>\"\"),\nIF(MATCH(1,$B21:$B65,0)<  $B20+MATCH(1,$B20:$B37,0)+COLUMN(C$1)-2,\"\",\nINDEX($A20:$A65,$B20+MATCH(1,$B20:$B37,0)+COLUMN(C$1)-2)),\"\")","v":""},{"$f":"IF(AND($B20=1,$A20<>\"\"),\nIF(MATCH(1,$B21:$B65,0)<  $B20+MATCH(1,$B20:$B37,0)+COLUMN(D$1)-2,\"\",\nINDEX($A20:$A65,$B20+MATCH(1,$B20:$B37,0)+COLUMN(D$1)-2)),\"\")","v":""},{"$f":"IF(AND($B20=1,$A20<>\"\"),\nIF(MATCH(1,$B21:$B65,0)<  $B20+MATCH(1,$B20:$B37,0)+COLUMN(E$1)-2,\"\",\nINDEX($A20:$A65,$B20+MATCH(1,$B20:$B37,0)+COLUMN(E$1)-2)),\"\")","v":""},{"$f":"IF(AND($B20=1,$A20<>\"\"),\nIF(MATCH(1,$B21:$B65,0)<  $B20+MATCH(1,$B20:$B37,0)+COLUMN(F$1)-2,\"\",\nINDEX($A20:$A65,$B20+MATCH(1,$B20:$B37,0)+COLUMN(F$1)-2)),\"\")","v":""},{"$f":"IF(AND($B20=1,$A20<>\"\"),\nIF(MATCH(1,$B21:$B65,0)<  $B20+MATCH(1,$B20:$B37,0)+COLUMN(G$1)-2,\"\",\nINDEX($A20:$A65,$B20+MATCH(1,$B20:$B37,0)+COLUMN(G$1)-2)),\"\")","v":""},{"$f":"IF(AND($B20=1,$A20<>\"\"),\nIF(MATCH(1,$B21:$B65,0)<  $B20+MATCH(1,$B20:$B37,0)+COLUMN(H$1)-2,\"\",\nINDEX($A20:$A65,$B20+MATCH(1,$B20:$B37,0)+COLUMN(H$1)-2)),\"\")","v":""},{"$f":"IF(AND($B20=1,$A20<>\"\"),\nIF(MATCH(1,$B21:$B65,0)<  $B20+MATCH(1,$B20:$B37,0)+COLUMN(I$1)-2,\"\",\nINDEX($A20:$A65,$B20+MATCH(1,$B20:$B37,0)+COLUMN(I$1)-2)),\"\")","v":""},{"$f":"IF(AND($B20=1,$A20<>\"\"),\nIF(MATCH(1,$B21:$B65,0)<  $B20+MATCH(1,$B20:$B37,0)+COLUMN(J$1)-2,\"\",\nINDEX($A20:$A65,$B20+MATCH(1,$B20:$B37,0)+COLUMN(J$1)-2)),\"\")","v":""},{"$f":"IF(AND($B20=1,$A20<>\"\"),\nIF(MATCH(1,$B21:$B65,0)<  $B20+MATCH(1,$B20:$B37,0)+COLUMN(K$1)-2,\"\",\nINDEX($A20:$A65,$B20+MATCH(1,$B20:$B37,0)+COLUMN(K$1)-2)),\"\")","v":""},{"$f":"IF(AND($B20=1,$A20<>\"\"),\nIF(MATCH(1,$B21:$B65,0)<  $B20+MATCH(1,$B20:$B37,0)+COLUMN(L$1)-2,\"\",\nINDEX($A20:$A65,$B20+MATCH(1,$B20:$B37,0)+COLUMN(L$1)-2)),\"\")","v":""},{"$f":"IF(AND($B20=1,$A20<>\"\"),\nIF(MATCH(1,$B21:$B65,0)<  $B20+MATCH(1,$B20:$B37,0)+COLUMN(M$1)-2,\"\",\nINDEX($A20:$A65,$B20+MATCH(1,$B20:$B37,0)+COLUMN(M$1)-2)),\"\")","v":""},{"$f":"IF(AND($B20=1,$A20<>\"\"),\nIF(MATCH(1,$B21:$B65,0)<  $B20+MATCH(1,$B20:$B37,0)+COLUMN(N$1)-2,\"\",\nINDEX($A20:$A65,$B20+MATCH(1,$B20:$B37,0)+COLUMN(N$1)-2)),\"\")","v":""},{"$f":"IF(AND($B20=1,$A20<>\"\"),\nIF(MATCH(1,$B21:$B65,0)<  $B20+MATCH(1,$B20:$B37,0)+COLUMN(O$1)-2,\"\",\nINDEX($A20:$A65,$B20+MATCH(1,$B20:$B37,0)+COLUMN(O$1)-2)),\"\")","v":""}]
["адрес: 460000 г. Оренбург, пер. Хлебный, 9 ",{"$f":"IF(OR(ISNUMBER(--LEFTB(A21,SEARCH(\".\",A21,1)-1)),COUNTA(A21:$A$9123)=0),1,B20+1)","v":3},{"$f":"IF(AND($B21=1,$A21<>\"\"),\nIF(MATCH(1,$B22:$B65,0)<  $B21+MATCH(1,$B21:$B38,0)+COLUMN(A$1)-2,\"\",\nINDEX($A21:$A65,$B21+MATCH(1,$B21:$B38,0)+COLUMN(A$1)-2)),\"\")","v":""},{"$f":"IF(AND($B21=1,$A21<>\"\"),\nIF(MATCH(1,$B22:$B65,0)<  $B21+MATCH(1,$B21:$B38,0)+COLUMN(B$1)-2,\"\",\nINDEX($A21:$A65,$B21+MATCH(1,$B21:$B38,0)+COLUMN(B$1)-2)),\"\")","v":""},{"$f":"IF(AND($B21=1,$A21<>\"\"),\nIF(MATCH(1,$B22:$B65,0)<  $B21+MATCH(1,$B21:$B38,0)+COLUMN(C$1)-2,\"\",\nINDEX($A21:$A65,$B21+MATCH(1,$B21:$B38,0)+COLUMN(C$1)-2)),\"\")","v":""},{"$f":"IF(AND($B21=1,$A21<>\"\"),\nIF(MATCH(1,$B22:$B65,0)<  $B21+MATCH(1,$B21:$B38,0)+COLUMN(D$1)-2,\"\",\nINDEX($A21:$A65,$B21+MATCH(1,$B21:$B38,0)+COLUMN(D$1)-2)),\"\")","v":""},{"$f":"IF(AND($B21=1,$A21<>\"\"),\nIF(MATCH(1,$B22:$B65,0)<  $B21+MATCH(1,$B21:$B38,0)+COLUMN(E$1)-2,\"\",\nINDEX($A21:$A65,$B21+MATCH(1,$B21:$B38,0)+COLUMN(E$1)-2)),\"\")","v":""},{"$f":"IF(AND($B21=1,$A21<>\"\"),\nIF(MATCH(1,$B22:$B65,0)<  $B21+MATCH(1,$B21:$B38,0)+COLUMN(F$1)-2,\"\",\nINDEX($A21:$A65,$B21+MATCH(1,$B21:$B38,0)+COLUMN(F$1)-2)),\"\")","v":""},{"$f":"IF(AND($B21=1,$A21<>\"\"),\nIF(MATCH(1,$B22:$B65,0)<  $B21+MATCH(1,$B21:$B38,0)+COLUMN(G$1)-2,\"\",\nINDEX($A21:$A65,$B21+MATCH(1,$B21:$B38,0)+COLUMN(G$1)-2)),\"\")","v":""},{"$f":"IF(AND($B21=1,$A21<>\"\"),\nIF(MATCH(1,$B22:$B65,0)<  $B21+MATCH(1,$B21:$B38,0)+COLUMN(H$1)-2,\"\",\nINDEX($A21:$A65,$B21+MATCH(1,$B21:$B38,0)+COLUMN(H$1)-2)),\"\")","v":""},{"$f":"IF(AND($B21=1,$A21<>\"\"),\nIF(MATCH(1,$B22:$B65,0)<  $B21+MATCH(1,$B21:$B38,0)+COLUMN(I$1)-2,\"\",\nINDEX($A21:$A65,$B21+MATCH(1,$B21:$B38,0)+COLUMN(I$1)-2)),\"\")","v":""},{"$f":"IF(AND($B21=1,$A21<>\"\"),\nIF(MATCH(1,$B22:$B65,0)<  $B21+MATCH(1,$B21:$B38,0)+COLUMN(J$1)-2,\"\",\nINDEX($A21:$A65,$B21+MATCH(1,$B21:$B38,0)+COLUMN(J$1)-2)),\"\")","v":""},{"$f":"IF(AND($B21=1,$A21<>\"\"),\nIF(MATCH(1,$B22:$B65,0)<  $B21+MATCH(1,$B21:$B38,0)+COLUMN(K$1)-2,\"\",\nINDEX($A21:$A65,$B21+MATCH(1,$B21:$B38,0)+COLUMN(K$1)-2)),\"\")","v":""},{"$f":"IF(AND($B21=1,$A21<>\"\"),\nIF(MATCH(1,$B22:$B65,0)<  $B21+MATCH(1,$B21:$B38,0)+COLUMN(L$1)-2,\"\",\nINDEX($A21:$A65,$B21+MATCH(1,$B21:$B38,0)+COLUMN(L$1)-2)),\"\")","v":""},{"$f":"IF(AND($B21=1,$A21<>\"\"),\nIF(MATCH(1,$B22:$B65,0)<  $B21+MATCH(1,$B21:$B38,0)+COLUMN(M$1)-2,\"\",\nINDEX($A21:$A65,$B21+MATCH(1,$B21:$B38,0)+COLUMN(M$1)-2)),\"\")","v":""},{"$f":"IF(AND($B21=1,$A21<>\"\"),\nIF(MATCH(1,$B22:$B65,0)<  $B21+MATCH(1,$B21:$B38,0)+COLUMN(N$1)-2,\"\",\nINDEX($A21:$A65,$B21+MATCH(1,$B21:$B38,0)+COLUMN(N$1)-2)),\"\")","v":""},{"$f":"IF(AND($B21=1,$A21<>\"\"),\nIF(MATCH(1,$B22:$B65,0)<  $B21+MATCH(1,$B21:$B38,0)+COLUMN(O$1)-2,\"\",\nINDEX($A21:$A65,$B21+MATCH(1,$B21:$B38,0)+COLUMN(O$1)-2)),\"\")","v":""}]
["Тел./факс 77-04-59, факс 77-43-89",{"$f":"IF(OR(ISNUMBER(--LEFTB(A22,SEARCH(\".\",A22,1)-1)),COUNTA(A22:$A$9123)=0),1,B21+1)","v":4},{"$f":"IF(AND($B22=1,$A22<>\"\"),\nIF(MATCH(1,$B23:$B65,0)<  $B22+MATCH(1,$B22:$B39,0)+COLUMN(A$1)-2,\"\",\nINDEX($A22:$A65,$B22+MATCH(1,$B22:$B39,0)+COLUMN(A$1)-2)),\"\")","v":""},{"$f":"IF(AND($B22=1,$A22<>\"\"),\nIF(MATCH(1,$B23:$B65,0)<  $B22+MATCH(1,$B22:$B39,0)+COLUMN(B$1)-2,\"\",\nINDEX($A22:$A65,$B22+MATCH(1,$B22:$B39,0)+COLUMN(B$1)-2)),\"\")","v":""},{"$f":"IF(AND($B22=1,$A22<>\"\"),\nIF(MATCH(1,$B23:$B65,0)<  $B22+MATCH(1,$B22:$B39,0)+COLUMN(C$1)-2,\"\",\nINDEX($A22:$A65,$B22+MATCH(1,$B22:$B39,0)+COLUMN(C$1)-2)),\"\")","v":""},{"$f":"IF(AND($B22=1,$A22<>\"\"),\nIF(MATCH(1,$B23:$B65,0)<  $B22+MATCH(1,$B22:$B39,0)+COLUMN(D$1)-2,\"\",\nINDEX($A22:$A65,$B22+MATCH(1,$B22:$B39,0)+COLUMN(D$1)-2)),\"\")","v":""},{"$f":"IF(AND($B22=1,$A22<>\"\"),\nIF(MATCH(1,$B23:$B65,0)<  $B22+MATCH(1,$B22:$B39,0)+COLUMN(E$1)-2,\"\",\nINDEX($A22:$A65,$B22+MATCH(1,$B22:$B39,0)+COLUMN(E$1)-2)),\"\")","v":""},{"$f":"IF(AND($B22=1,$A22<>\"\"),\nIF(MATCH(1,$B23:$B65,0)<  $B22+MATCH(1,$B22:$B39,0)+COLUMN(F$1)-2,\"\",\nINDEX($A22:$A65,$B22+MATCH(1,$B22:$B39,0)+COLUMN(F$1)-2)),\"\")","v":""},{"$f":"IF(AND($B22=1,$A22<>\"\"),\nIF(MATCH(1,$B23:$B65,0)<  $B22+MATCH(1,$B22:$B39,0)+COLUMN(G$1)-2,\"\",\nINDEX($A22:$A65,$B22+MATCH(1,$B22:$B39,0)+COLUMN(G$1)-2)),\"\")","v":""},{"$f":"IF(AND($B22=1,$A22<>\"\"),\nIF(MATCH(1,$B23:$B65,0)<  $B22+MATCH(1,$B22:$B39,0)+COLUMN(H$1)-2,\"\",\nINDEX($A22:$A65,$B22+MATCH(1,$B22:$B39,0)+COLUMN(H$1)-2)),\"\")","v":""},{"$f":"IF(AND($B22=1,$A22<>\"\"),\nIF(MATCH(1,$B23:$B65,0)<  $B22+MATCH(1,$B22:$B39,0)+COLUMN(I$1)-2,\"\",\nINDEX($A22:$A65,$B22+MATCH(1,$B22:$B39,0)+COLUMN(I$1)-2)),\"\")","v":""},{"$f":"IF(AND($B22=1,$A22<>\"\"),\nIF(MATCH(1,$B23:$B65,0)<  $B22+MATCH(1,$B22:$B39,0)+COLUMN(J$1)-2,\"\",\nINDEX($A22:$A65,$B22+MATCH(1,$B22:$B39,0)+COLUMN(J$1)-2)),\"\")","v":""},{"$f":"IF(AND($B22=1,$A22<>\"\"),\nIF(MATCH(1,$B23:$B65,0)<  $B22+MATCH(1,$B22:$B39,0)+COLUMN(K$1)-2,\"\",\nINDEX($A22:$A65,$B22+MATCH(1,$B22:$B39,0)+COLUMN(K$1)-2)),\"\")","v":""},{"$f":"IF(AND($B22=1,$A22<>\"\"),\nIF(MATCH(1,$B23:$B65,0)<  $B22+MATCH(1,$B22:$B39,0)+COLUMN(L$1)-2,\"\",\nINDEX($A22:$A65,$B22+MATCH(1,$B22:$B39,0)+COLUMN(L$1)-2)),\"\")","v":""},{"$f":"IF(AND($B22=1,$A22<>\"\"),\nIF(MATCH(1,$B23:$B65,0)<  $B22+MATCH(1,$B22:$B39,0)+COLUMN(M$1)-2,\"\",\nINDEX($A22:$A65,$B22+MATCH(1,$B22:$B39,0)+COLUMN(M$1)-2)),\"\")","v":""},{"$f":"IF(AND($B22=1,$A22<>\"\"),\nIF(MATCH(1,$B23:$B65,0)<  $B22+MATCH(1,$B22:$B39,0)+COLUMN(N$1)-2,\"\",\nINDEX($A22:$A65,$B22+MATCH(1,$B22:$B39,0)+COLUMN(N$1)-2)),\"\")","v":""},{"$f":"IF(AND($B22=1,$A22<>\"\"),\nIF(MATCH(1,$B23:$B65,0)<  $B22+MATCH(1,$B22:$B39,0)+COLUMN(O$1)-2,\"\",\nINDEX($A22:$A65,$B22+MATCH(1,$B22:$B39,0)+COLUMN(O$1)-2)),\"\")","v":""}]
["e-mail: velt@esoo.ru, сайт: www.velt-npo.ru",{"$f":"IF(OR(ISNUMBER(--LEFTB(A23,SEARCH(\".\",A23,1)-1)),COUNTA(A23:$A$9123)=0),1,B22+1)","v":5},{"$f":"IF(AND($B23=1,$A23<>\"\"),\nIF(MATCH(1,$B24:$B65,0)<  $B23+MATCH(1,$B23:$B40,0)+COLUMN(A$1)-2,\"\",\nINDEX($A23:$A65,$B23+MATCH(1,$B23:$B40,0)+COLUMN(A$1)-2)),\"\")","v":""},{"$f":"IF(AND($B23=1,$A23<>\"\"),\nIF(MATCH(1,$B24:$B65,0)<  $B23+MATCH(1,$B23:$B40,0)+COLUMN(B$1)-2,\"\",\nINDEX($A23:$A65,$B23+MATCH(1,$B23:$B40,0)+COLUMN(B$1)-2)),\"\")","v":""},{"$f":"IF(AND($B23=1,$A23<>\"\"),\nIF(MATCH(1,$B24:$B65,0)<  $B23+MATCH(1,$B23:$B40,0)+COLUMN(C$1)-2,\"\",\nINDEX($A23:$A65,$B23+MATCH(1,$B23:$B40,0)+COLUMN(C$1)-2)),\"\")","v":""},{"$f":"IF(AND($B23=1,$A23<>\"\"),\nIF(MATCH(1,$B24:$B65,0)<  $B23+MATCH(1,$B23:$B40,0)+COLUMN(D$1)-2,\"\",\nINDEX($A23:$A65,$B23+MATCH(1,$B23:$B40,0)+COLUMN(D$1)-2)),\"\")","v":""},{"$f":"IF(AND($B23=1,$A23<>\"\"),\nIF(MATCH(1,$B24:$B65,0)<  $B23+MATCH(1,$B23:$B40,0)+COLUMN(E$1)-2,\"\",\nINDEX($A23:$A65,$B23+MATCH(1,$B23:$B40,0)+COLUMN(E$1)-2)),\"\")","v":""},{"$f":"IF(AND($B23=1,$A23<>\"\"),\nIF(MATCH(1,$B24:$B65,0)<  $B23+MATCH(1,$B23:$B40,0)+COLUMN(F$1)-2,\"\",\nINDEX($A23:$A65,$B23+MATCH(1,$B23:$B40,0)+COLUMN(F$1)-2)),\"\")","v":""},{"$f":"IF(AND($B23=1,$A23<>\"\"),\nIF(MATCH(1,$B24:$B65,0)<  $B23+MATCH(1,$B23:$B40,0)+COLUMN(G$1)-2,\"\",\nINDEX($A23:$A65,$B23+MATCH(1,$B23:$B40,0)+COLUMN(G$1)-2)),\"\")","v":""},{"$f":"IF(AND($B23=1,$A23<>\"\"),\nIF(MATCH(1,$B24:$B65,0)<  $B23+MATCH(1,$B23:$B40,0)+COLUMN(H$1)-2,\"\",\nINDEX($A23:$A65,$B23+MATCH(1,$B23:$B40,0)+COLUMN(H$1)-2)),\"\")","v":""},{"$f":"IF(AND($B23=1,$A23<>\"\"),\nIF(MATCH(1,$B24:$B65,0)<  $B23+MATCH(1,$B23:$B40,0)+COLUMN(I$1)-2,\"\",\nINDEX($A23:$A65,$B23+MATCH(1,$B23:$B40,0)+COLUMN(I$1)-2)),\"\")","v":""},{"$f":"IF(AND($B23=1,$A23<>\"\"),\nIF(MATCH(1,$B24:$B65,0)<  $B23+MATCH(1,$B23:$B40,0)+COLUMN(J$1)-2,\"\",\nINDEX($A23:$A65,$B23+MATCH(1,$B23:$B40,0)+COLUMN(J$1)-2)),\"\")","v":""},{"$f":"IF(AND($B23=1,$A23<>\"\"),\nIF(MATCH(1,$B24:$B65,0)<  $B23+MATCH(1,$B23:$B40,0)+COLUMN(K$1)-2,\"\",\nINDEX($A23:$A65,$B23+MATCH(1,$B23:$B40,0)+COLUMN(K$1)-2)),\"\")","v":""},{"$f":"IF(AND($B23=1,$A23<>\"\"),\nIF(MATCH(1,$B24:$B65,0)<  $B23+MATCH(1,$B23:$B40,0)+COLUMN(L$1)-2,\"\",\nINDEX($A23:$A65,$B23+MATCH(1,$B23:$B40,0)+COLUMN(L$1)-2)),\"\")","v":""},{"$f":"IF(AND($B23=1,$A23<>\"\"),\nIF(MATCH(1,$B24:$B65,0)<  $B23+MATCH(1,$B23:$B40,0)+COLUMN(M$1)-2,\"\",\nINDEX($A23:$A65,$B23+MATCH(1,$B23:$B40,0)+COLUMN(M$1)-2)),\"\")","v":""},{"$f":"IF(AND($B23=1,$A23<>\"\"),\nIF(MATCH(1,$B24:$B65,0)<  $B23+MATCH(1,$B23:$B40,0)+COLUMN(N$1)-2,\"\",\nINDEX($A23:$A65,$B23+MATCH(1,$B23:$B40,0)+COLUMN(N$1)-2)),\"\")","v":""},{"$f":"IF(AND($B23=1,$A23<>\"\"),\nIF(MATCH(1,$B24:$B65,0)<  $B23+MATCH(1,$B23:$B40,0)+COLUMN(O$1)-2,\"\",\nINDEX($A23:$A65,$B23+MATCH(1,$B23:$B40,0)+COLUMN(O$1)-2)),\"\")","v":""}]
["5.    Оренбургский филиал ОАО «Ростелеком»",{"$f":"IF(OR(ISNUMBER(--LEFTB(A24,SEARCH(\".\",A24,1)-1)),COUNTA(A24:$A$9123)=0),1,B23+1)","v":1},{"$f":"IF(AND($B24=1,$A24<>\"\"),\nIF(MATCH(1,$B25:$B65,0)<  $B24+MATCH(1,$B24:$B41,0)+COLUMN(A$1)-2,\"\",\nINDEX($A24:$A65,$B24+MATCH(1,$B24:$B41,0)+COLUMN(A$1)-2)),\"\")","v":"5.    Оренбургский филиал ОАО «Ростелеком»"},{"$f":"IF(AND($B24=1,$A24<>\"\"),\nIF(MATCH(1,$B25:$B65,0)<  $B24+MATCH(1,$B24:$B41,0)+COLUMN(B$1)-2,\"\",\nINDEX($A24:$A65,$B24+MATCH(1,$B24:$B41,0)+COLUMN(B$1)-2)),\"\")","v":"Директор Оренбургского филиала Никифоров Дмитрий Степанович"},{"$f":"IF(AND($B24=1,$A24<>\"\"),\nIF(MATCH(1,$B25:$B65,0)<  $B24+MATCH(1,$B24:$B41,0)+COLUMN(C$1)-2,\"\",\nINDEX($A24:$A65,$B24+MATCH(1,$B24:$B41,0)+COLUMN(C$1)-2)),\"\")","v":"Недочетов Константин Юрьевич – первый заместитель директора, главный инженер "},{"$f":"IF(AND($B24=1,$A24<>\"\"),\nIF(MATCH(1,$B25:$B65,0)<  $B24+MATCH(1,$B24:$B41,0)+COLUMN(D$1)-2,\"\",\nINDEX($A24:$A65,$B24+MATCH(1,$B24:$B41,0)+COLUMN(D$1)-2)),\"\")","v":"адрес: 460000  г. Оренбург, ул.Володарского, 11 "},{"$f":"IF(AND($B24=1,$A24<>\"\"),\nIF(MATCH(1,$B25:$B65,0)<  $B24+MATCH(1,$B24:$B41,0)+COLUMN(E$1)-2,\"\",\nINDEX($A24:$A65,$B24+MATCH(1,$B24:$B41,0)+COLUMN(E$1)-2)),\"\")","v":"  т. 77-34-10 факс 72-01-62, e-mail: office@orenburg.volga.rt.ru, www.orenburg.vt.ru "},{"$f":"IF(AND($B24=1,$A24<>\"\"),\nIF(MATCH(1,$B25:$B65,0)<  $B24+MATCH(1,$B24:$B41,0)+COLUMN(F$1)-2,\"\",\nINDEX($A24:$A65,$B24+MATCH(1,$B24:$B41,0)+COLUMN(F$1)-2)),\"\")","v":""},{"$f":"IF(AND($B24=1,$A24<>\"\"),\nIF(MATCH(1,$B25:$B65,0)<  $B24+MATCH(1,$B24:$B41,0)+COLUMN(G$1)-2,\"\",\nINDEX($A24:$A65,$B24+MATCH(1,$B24:$B41,0)+COLUMN(G$1)-2)),\"\")","v":""},{"$f":"IF(AND($B24=1,$A24<>\"\"),\nIF(MATCH(1,$B25:$B65,0)<  $B24+MATCH(1,$B24:$B41,0)+COLUMN(H$1)-2,\"\",\nINDEX($A24:$A65,$B24+MATCH(1,$B24:$B41,0)+COLUMN(H$1)-2)),\"\")","v":""},{"$f":"IF(AND($B24=1,$A24<>\"\"),\nIF(MATCH(1,$B25:$B65,0)<  $B24+MATCH(1,$B24:$B41,0)+COLUMN(I$1)-2,\"\",\nINDEX($A24:$A65,$B24+MATCH(1,$B24:$B41,0)+COLUMN(I$1)-2)),\"\")","v":""},{"$f":"IF(AND($B24=1,$A24<>\"\"),\nIF(MATCH(1,$B25:$B65,0)<  $B24+MATCH(1,$B24:$B41,0)+COLUMN(J$1)-2,\"\",\nINDEX($A24:$A65,$B24+MATCH(1,$B24:$B41,0)+COLUMN(J$1)-2)),\"\")","v":""},{"$f":"IF(AND($B24=1,$A24<>\"\"),\nIF(MATCH(1,$B25:$B65,0)<  $B24+MATCH(1,$B24:$B41,0)+COLUMN(K$1)-2,\"\",\nINDEX($A24:$A65,$B24+MATCH(1,$B24:$B41,0)+COLUMN(K$1)-2)),\"\")","v":""},{"$f":"IF(AND($B24=1,$A24<>\"\"),\nIF(MATCH(1,$B25:$B65,0)<  $B24+MATCH(1,$B24:$B41,0)+COLUMN(L$1)-2,\"\",\nINDEX($A24:$A65,$B24+MATCH(1,$B24:$B41,0)+COLUMN(L$1)-2)),\"\")","v":""},{"$f":"IF(AND($B24=1,$A24<>\"\"),\nIF(MATCH(1,$B25:$B65,0)<  $B24+MATCH(1,$B24:$B41,0)+COLUMN(M$1)-2,\"\",\nINDEX($A24:$A65,$B24+MATCH(1,$B24:$B41,0)+COLUMN(M$1)-2)),\"\")","v":""},{"$f":"IF(AND($B24=1,$A24<>\"\"),\nIF(MATCH(1,$B25:$B65,0)<  $B24+MATCH(1,$B24:$B41,0)+COLUMN(N$1)-2,\"\",\nINDEX($A24:$A65,$B24+MATCH(1,$B24:$B41,0)+COLUMN(N$1)-2)),\"\")","v":""},{"$f":"IF(AND($B24=1,$A24<>\"\"),\nIF(MATCH(1,$B25:$B65,0)<  $B24+MATCH(1,$B24:$B41,0)+COLUMN(O$1)-2,\"\",\nINDEX($A24:$A65,$B24+MATCH(1,$B24:$B41,0)+COLUMN(O$1)-2)),\"\")","v":""}]
["Директор Оренбургского филиала Никифоров Дмитрий Степанович",{"$f":"IF(OR(ISNUMBER(--LEFTB(A25,SEARCH(\".\",A25,1)-1)),COUNTA(A25:$A$9123)=0),1,B24+1)","v":2},{"$f":"IF(AND($B25=1,$A25<>\"\"),\nIF(MATCH(1,$B26:$B65,0)<  $B25+MATCH(1,$B25:$B42,0)+COLUMN(A$1)-2,\"\",\nINDEX($A25:$A65,$B25+MATCH(1,$B25:$B42,0)+COLUMN(A$1)-2)),\"\")","v":""},{"$f":"IF(AND($B25=1,$A25<>\"\"),\nIF(MATCH(1,$B26:$B65,0)<  $B25+MATCH(1,$B25:$B42,0)+COLUMN(B$1)-2,\"\",\nINDEX($A25:$A65,$B25+MATCH(1,$B25:$B42,0)+COLUMN(B$1)-2)),\"\")","v":""},{"$f":"IF(AND($B25=1,$A25<>\"\"),\nIF(MATCH(1,$B26:$B65,0)<  $B25+MATCH(1,$B25:$B42,0)+COLUMN(C$1)-2,\"\",\nINDEX($A25:$A65,$B25+MATCH(1,$B25:$B42,0)+COLUMN(C$1)-2)),\"\")","v":""},{"$f":"IF(AND($B25=1,$A25<>\"\"),\nIF(MATCH(1,$B26:$B65,0)<  $B25+MATCH(1,$B25:$B42,0)+COLUMN(D$1)-2,\"\",\nINDEX($A25:$A65,$B25+MATCH(1,$B25:$B42,0)+COLUMN(D$1)-2)),\"\")","v":""},{"$f":"IF(AND($B25=1,$A25<>\"\"),\nIF(MATCH(1,$B26:$B65,0)<  $B25+MATCH(1,$B25:$B42,0)+COLUMN(E$1)-2,\"\",\nINDEX($A25:$A65,$B25+MATCH(1,$B25:$B42,0)+COLUMN(E$1)-2)),\"\")","v":""},{"$f":"IF(AND($B25=1,$A25<>\"\"),\nIF(MATCH(1,$B26:$B65,0)<  $B25+MATCH(1,$B25:$B42,0)+COLUMN(F$1)-2,\"\",\nINDEX($A25:$A65,$B25+MATCH(1,$B25:$B42,0)+COLUMN(F$1)-2)),\"\")","v":""},{"$f":"IF(AND($B25=1,$A25<>\"\"),\nIF(MATCH(1,$B26:$B65,0)<  $B25+MATCH(1,$B25:$B42,0)+COLUMN(G$1)-2,\"\",\nINDEX($A25:$A65,$B25+MATCH(1,$B25:$B42,0)+COLUMN(G$1)-2)),\"\")","v":""},{"$f":"IF(AND($B25=1,$A25<>\"\"),\nIF(MATCH(1,$B26:$B65,0)<  $B25+MATCH(1,$B25:$B42,0)+COLUMN(H$1)-2,\"\",\nINDEX($A25:$A65,$B25+MATCH(1,$B25:$B42,0)+COLUMN(H$1)-2)),\"\")","v":""},{"$f":"IF(AND($B25=1,$A25<>\"\"),\nIF(MATCH(1,$B26:$B65,0)<  $B25+MATCH(1,$B25:$B42,0)+COLUMN(I$1)-2,\"\",\nINDEX($A25:$A65,$B25+MATCH(1,$B25:$B42,0)+COLUMN(I$1)-2)),\"\")","v":""},{"$f":"IF(AND($B25=1,$A25<>\"\"),\nIF(MATCH(1,$B26:$B65,0)<  $B25+MATCH(1,$B25:$B42,0)+COLUMN(J$1)-2,\"\",\nINDEX($A25:$A65,$B25+MATCH(1,$B25:$B42,0)+COLUMN(J$1)-2)),\"\")","v":""},{"$f":"IF(AND($B25=1,$A25<>\"\"),\nIF(MATCH(1,$B26:$B65,0)<  $B25+MATCH(1,$B25:$B42,0)+COLUMN(K$1)-2,\"\",\nINDEX($A25:$A65,$B25+MATCH(1,$B25:$B42,0)+COLUMN(K$1)-2)),\"\")","v":""},{"$f":"IF(AND($B25=1,$A25<>\"\"),\nIF(MATCH(1,$B26:$B65,0)<  $B25+MATCH(1,$B25:$B42,0)+COLUMN(L$1)-2,\"\",\nINDEX($A25:$A65,$B25+MATCH(1,$B25:$B42,0)+COLUMN(L$1)-2)),\"\")","v":""},{"$f":"IF(AND($B25=1,$A25<>\"\"),\nIF(MATCH(1,$B26:$B65,0)<  $B25+MATCH(1,$B25:$B42,0)+COLUMN(M$1)-2,\"\",\nINDEX($A25:$A65,$B25+MATCH(1,$B25:$B42,0)+COLUMN(M$1)-2)),\"\")","v":""},{"$f":"IF(AND($B25=1,$A25<>\"\"),\nIF(MATCH(1,$B26:$B65,0)<  $B25+MATCH(1,$B25:$B42,0)+COLUMN(N$1)-2,\"\",\nINDEX($A25:$A65,$B25+MATCH(1,$B25:$B42,0)+COLUMN(N$1)-2)),\"\")","v":""},{"$f":"IF(AND($B25=1,$A25<>\"\"),\nIF(MATCH(1,$B26:$B65,0)<  $B25+MATCH(1,$B25:$B42,0)+COLUMN(O$1)-2,\"\",\nINDEX($A25:$A65,$B25+MATCH(1,$B25:$B42,0)+COLUMN(O$1)-2)),\"\")","v":""}]
["Недочетов Константин Юрьевич – первый заместитель директора, главный инженер ",{"$f":"IF(OR(ISNUMBER(--LEFTB(A26,SEARCH(\".\",A26,1)-1)),COUNTA(A26:$A$9123)=0),1,B25+1)","v":3},{"$f":"IF(AND($B26=1,$A26<>\"\"),\nIF(MATCH(1,$B27:$B65,0)<  $B26+MATCH(1,$B26:$B43,0)+COLUMN(A$1)-2,\"\",\nINDEX($A26:$A65,$B26+MATCH(1,$B26:$B43,0)+COLUMN(A$1)-2)),\"\")","v":""},{"$f":"IF(AND($B26=1,$A26<>\"\"),\nIF(MATCH(1,$B27:$B65,0)<  $B26+MATCH(1,$B26:$B43,0)+COLUMN(B$1)-2,\"\",\nINDEX($A26:$A65,$B26+MATCH(1,$B26:$B43,0)+COLUMN(B$1)-2)),\"\")","v":""},{"$f":"IF(AND($B26=1,$A26<>\"\"),\nIF(MATCH(1,$B27:$B65,0)<  $B26+MATCH(1,$B26:$B43,0)+COLUMN(C$1)-2,\"\",\nINDEX($A26:$A65,$B26+MATCH(1,$B26:$B43,0)+COLUMN(C$1)-2)),\"\")","v":""},{"$f":"IF(AND($B26=1,$A26<>\"\"),\nIF(MATCH(1,$B27:$B65,0)<  $B26+MATCH(1,$B26:$B43,0)+COLUMN(D$1)-2,\"\",\nINDEX($A26:$A65,$B26+MATCH(1,$B26:$B43,0)+COLUMN(D$1)-2)),\"\")","v":""},{"$f":"IF(AND($B26=1,$A26<>\"\"),\nIF(MATCH(1,$B27:$B65,0)<  $B26+MATCH(1,$B26:$B43,0)+COLUMN(E$1)-2,\"\",\nINDEX($A26:$A65,$B26+MATCH(1,$B26:$B43,0)+COLUMN(E$1)-2)),\"\")","v":""},{"$f":"IF(AND($B26=1,$A26<>\"\"),\nIF(MATCH(1,$B27:$B65,0)<  $B26+MATCH(1,$B26:$B43,0)+COLUMN(F$1)-2,\"\",\nINDEX($A26:$A65,$B26+MATCH(1,$B26:$B43,0)+COLUMN(F$1)-2)),\"\")","v":""},{"$f":"IF(AND($B26=1,$A26<>\"\"),\nIF(MATCH(1,$B27:$B65,0)<  $B26+MATCH(1,$B26:$B43,0)+COLUMN(G$1)-2,\"\",\nINDEX($A26:$A65,$B26+MATCH(1,$B26:$B43,0)+COLUMN(G$1)-2)),\"\")","v":""},{"$f":"IF(AND($B26=1,$A26<>\"\"),\nIF(MATCH(1,$B27:$B65,0)<  $B26+MATCH(1,$B26:$B43,0)+COLUMN(H$1)-2,\"\",\nINDEX($A26:$A65,$B26+MATCH(1,$B26:$B43,0)+COLUMN(H$1)-2)),\"\")","v":""},{"$f":"IF(AND($B26=1,$A26<>\"\"),\nIF(MATCH(1,$B27:$B65,0)<  $B26+MATCH(1,$B26:$B43,0)+COLUMN(I$1)-2,\"\",\nINDEX($A26:$A65,$B26+MATCH(1,$B26:$B43,0)+COLUMN(I$1)-2)),\"\")","v":""},{"$f":"IF(AND($B26=1,$A26<>\"\"),\nIF(MATCH(1,$B27:$B65,0)<  $B26+MATCH(1,$B26:$B43,0)+COLUMN(J$1)-2,\"\",\nINDEX($A26:$A65,$B26+MATCH(1,$B26:$B43,0)+COLUMN(J$1)-2)),\"\")","v":""},{"$f":"IF(AND($B26=1,$A26<>\"\"),\nIF(MATCH(1,$B27:$B65,0)<  $B26+MATCH(1,$B26:$B43,0)+COLUMN(K$1)-2,\"\",\nINDEX($A26:$A65,$B26+MATCH(1,$B26:$B43,0)+COLUMN(K$1)-2)),\"\")","v":""},{"$f":"IF(AND($B26=1,$A26<>\"\"),\nIF(MATCH(1,$B27:$B65,0)<  $B26+MATCH(1,$B26:$B43,0)+COLUMN(L$1)-2,\"\",\nINDEX($A26:$A65,$B26+MATCH(1,$B26:$B43,0)+COLUMN(L$1)-2)),\"\")","v":""},{"$f":"IF(AND($B26=1,$A26<>\"\"),\nIF(MATCH(1,$B27:$B65,0)<  $B26+MATCH(1,$B26:$B43,0)+COLUMN(M$1)-2,\"\",\nINDEX($A26:$A65,$B26+MATCH(1,$B26:$B43,0)+COLUMN(M$1)-2)),\"\")","v":""},{"$f":"IF(AND($B26=1,$A26<>\"\"),\nIF(MATCH(1,$B27:$B65,0)<  $B26+MATCH(1,$B26:$B43,0)+COLUMN(N$1)-2,\"\",\nINDEX($A26:$A65,$B26+MATCH(1,$B26:$B43,0)+COLUMN(N$1)-2)),\"\")","v":""},{"$f":"IF(AND($B26=1,$A26<>\"\"),\nIF(MATCH(1,$B27:$B65,0)<  $B26+MATCH(1,$B26:$B43,0)+COLUMN(O$1)-2,\"\",\nINDEX($A26:$A65,$B26+MATCH(1,$B26:$B43,0)+COLUMN(O$1)-2)),\"\")","v":""}]
["адрес: 460000  г. Оренбург, ул.Володарского, 11 ",{"$f":"IF(OR(ISNUMBER(--LEFTB(A27,SEARCH(\".\",A27,1)-1)),COUNTA(A27:$A$9123)=0),1,B26+1)","v":4},{"$f":"IF(AND($B27=1,$A27<>\"\"),\nIF(MATCH(1,$B28:$B65,0)<  $B27+MATCH(1,$B27:$B44,0)+COLUMN(A$1)-2,\"\",\nINDEX($A27:$A65,$B27+MATCH(1,$B27:$B44,0)+COLUMN(A$1)-2)),\"\")","v":""},{"$f":"IF(AND($B27=1,$A27<>\"\"),\nIF(MATCH(1,$B28:$B65,0)<  $B27+MATCH(1,$B27:$B44,0)+COLUMN(B$1)-2,\"\",\nINDEX($A27:$A65,$B27+MATCH(1,$B27:$B44,0)+COLUMN(B$1)-2)),\"\")","v":""},{"$f":"IF(AND($B27=1,$A27<>\"\"),\nIF(MATCH(1,$B28:$B65,0)<  $B27+MATCH(1,$B27:$B44,0)+COLUMN(C$1)-2,\"\",\nINDEX($A27:$A65,$B27+MATCH(1,$B27:$B44,0)+COLUMN(C$1)-2)),\"\")","v":""},{"$f":"IF(AND($B27=1,$A27<>\"\"),\nIF(MATCH(1,$B28:$B65,0)<  $B27+MATCH(1,$B27:$B44,0)+COLUMN(D$1)-2,\"\",\nINDEX($A27:$A65,$B27+MATCH(1,$B27:$B44,0)+COLUMN(D$1)-2)),\"\")","v":""},{"$f":"IF(AND($B27=1,$A27<>\"\"),\nIF(MATCH(1,$B28:$B65,0)<  $B27+MATCH(1,$B27:$B44,0)+COLUMN(E$1)-2,\"\",\nINDEX($A27:$A65,$B27+MATCH(1,$B27:$B44,0)+COLUMN(E$1)-2)),\"\")","v":""},{"$f":"IF(AND($B27=1,$A27<>\"\"),\nIF(MATCH(1,$B28:$B65,0)<  $B27+MATCH(1,$B27:$B44,0)+COLUMN(F$1)-2,\"\",\nINDEX($A27:$A65,$B27+MATCH(1,$B27:$B44,0)+COLUMN(F$1)-2)),\"\")","v":""},{"$f":"IF(AND($B27=1,$A27<>\"\"),\nIF(MATCH(1,$B28:$B65,0)<  $B27+MATCH(1,$B27:$B44,0)+COLUMN(G$1)-2,\"\",\nINDEX($A27:$A65,$B27+MATCH(1,$B27:$B44,0)+COLUMN(G$1)-2)),\"\")","v":""},{"$f":"IF(AND($B27=1,$A27<>\"\"),\nIF(MATCH(1,$B28:$B65,0)<  $B27+MATCH(1,$B27:$B44,0)+COLUMN(H$1)-2,\"\",\nINDEX($A27:$A65,$B27+MATCH(1,$B27:$B44,0)+COLUMN(H$1)-2)),\"\")","v":""},{"$f":"IF(AND($B27=1,$A27<>\"\"),\nIF(MATCH(1,$B28:$B65,0)<  $B27+MATCH(1,$B27:$B44,0)+COLUMN(I$1)-2,\"\",\nINDEX($A27:$A65,$B27+MATCH(1,$B27:$B44,0)+COLUMN(I$1)-2)),\"\")","v":""},{"$f":"IF(AND($B27=1,$A27<>\"\"),\nIF(MATCH(1,$B28:$B65,0)<  $B27+MATCH(1,$B27:$B44,0)+COLUMN(J$1)-2,\"\",\nINDEX($A27:$A65,$B27+MATCH(1,$B27:$B44,0)+COLUMN(J$1)-2)),\"\")","v":""},{"$f":"IF(AND($B27=1,$A27<>\"\"),\nIF(MATCH(1,$B28:$B65,0)<  $B27+MATCH(1,$B27:$B44,0)+COLUMN(K$1)-2,\"\",\nINDEX($A27:$A65,$B27+MATCH(1,$B27:$B44,0)+COLUMN(K$1)-2)),\"\")","v":""},{"$f":"IF(AND($B27=1,$A27<>\"\"),\nIF(MATCH(1,$B28:$B65,0)<  $B27+MATCH(1,$B27:$B44,0)+COLUMN(L$1)-2,\"\",\nINDEX($A27:$A65,$B27+MATCH(1,$B27:$B44,0)+COLUMN(L$1)-2)),\"\")","v":""},{"$f":"IF(AND($B27=1,$A27<>\"\"),\nIF(MATCH(1,$B28:$B65,0)<  $B27+MATCH(1,$B27:$B44,0)+COLUMN(M$1)-2,\"\",\nINDEX($A27:$A65,$B27+MATCH(1,$B27:$B44,0)+COLUMN(M$1)-2)),\"\")","v":""},{"$f":"IF(AND($B27=1,$A27<>\"\"),\nIF(MATCH(1,$B28:$B65,0)<  $B27+MATCH(1,$B27:$B44,0)+COLUMN(N$1)-2,\"\",\nINDEX($A27:$A65,$B27+MATCH(1,$B27:$B44,0)+COLUMN(N$1)-2)),\"\")","v":""},{"$f":"IF(AND($B27=1,$A27<>\"\"),\nIF(MATCH(1,$B28:$B65,0)<  $B27+MATCH(1,$B27:$B44,0)+COLUMN(O$1)-2,\"\",\nINDEX($A27:$A65,$B27+MATCH(1,$B27:$B44,0)+COLUMN(O$1)-2)),\"\")","v":""}]
["  т. 77-34-10 факс 72-01-62, e-mail: office@orenburg.volga.rt.ru, www.orenburg.vt.ru ",{"$f":"IF(OR(ISNUMBER(--LEFTB(A28,SEARCH(\".\",A28,1)-1)),COUNTA(A28:$A$9123)=0),1,B27+1)","v":5},{"$f":"IF(AND($B28=1,$A28<>\"\"),\nIF(MATCH(1,$B29:$B65,0)<  $B28+MATCH(1,$B28:$B45,0)+COLUMN(A$1)-2,\"\",\nINDEX($A28:$A65,$B28+MATCH(1,$B28:$B45,0)+COLUMN(A$1)-2)),\"\")","v":""},{"$f":"IF(AND($B28=1,$A28<>\"\"),\nIF(MATCH(1,$B29:$B65,0)<  $B28+MATCH(1,$B28:$B45,0)+COLUMN(B$1)-2,\"\",\nINDEX($A28:$A65,$B28+MATCH(1,$B28:$B45,0)+COLUMN(B$1)-2)),\"\")","v":""},{"$f":"IF(AND($B28=1,$A28<>\"\"),\nIF(MATCH(1,$B29:$B65,0)<  $B28+MATCH(1,$B28:$B45,0)+COLUMN(C$1)-2,\"\",\nINDEX($A28:$A65,$B28+MATCH(1,$B28:$B45,0)+COLUMN(C$1)-2)),\"\")","v":""},{"$f":"IF(AND($B28=1,$A28<>\"\"),\nIF(MATCH(1,$B29:$B65,0)<  $B28+MATCH(1,$B28:$B45,0)+COLUMN(D$1)-2,\"\",\nINDEX($A28:$A65,$B28+MATCH(1,$B28:$B45,0)+COLUMN(D$1)-2)),\"\")","v":""},{"$f":"IF(AND($B28=1,$A28<>\"\"),\nIF(MATCH(1,$B29:$B65,0)<  $B28+MATCH(1,$B28:$B45,0)+COLUMN(E$1)-2,\"\",\nINDEX($A28:$A65,$B28+MATCH(1,$B28:$B45,0)+COLUMN(E$1)-2)),\"\")","v":""},{"$f":"IF(AND($B28=1,$A28<>\"\"),\nIF(MATCH(1,$B29:$B65,0)<  $B28+MATCH(1,$B28:$B45,0)+COLUMN(F$1)-2,\"\",\nINDEX($A28:$A65,$B28+MATCH(1,$B28:$B45,0)+COLUMN(F$1)-2)),\"\")","v":""},{"$f":"IF(AND($B28=1,$A28<>\"\"),\nIF(MATCH(1,$B29:$B65,0)<  $B28+MATCH(1,$B28:$B45,0)+COLUMN(G$1)-2,\"\",\nINDEX($A28:$A65,$B28+MATCH(1,$B28:$B45,0)+COLUMN(G$1)-2)),\"\")","v":""},{"$f":"IF(AND($B28=1,$A28<>\"\"),\nIF(MATCH(1,$B29:$B65,0)<  $B28+MATCH(1,$B28:$B45,0)+COLUMN(H$1)-2,\"\",\nINDEX($A28:$A65,$B28+MATCH(1,$B28:$B45,0)+COLUMN(H$1)-2)),\"\")","v":""},{"$f":"IF(AND($B28=1,$A28<>\"\"),\nIF(MATCH(1,$B29:$B65,0)<  $B28+MATCH(1,$B28:$B45,0)+COLUMN(I$1)-2,\"\",\nINDEX($A28:$A65,$B28+MATCH(1,$B28:$B45,0)+COLUMN(I$1)-2)),\"\")","v":""},{"$f":"IF(AND($B28=1,$A28<>\"\"),\nIF(MATCH(1,$B29:$B65,0)<  $B28+MATCH(1,$B28:$B45,0)+COLUMN(J$1)-2,\"\",\nINDEX($A28:$A65,$B28+MATCH(1,$B28:$B45,0)+COLUMN(J$1)-2)),\"\")","v":""},{"$f":"IF(AND($B28=1,$A28<>\"\"),\nIF(MATCH(1,$B29:$B65,0)<  $B28+MATCH(1,$B28:$B45,0)+COLUMN(K$1)-2,\"\",\nINDEX($A28:$A65,$B28+MATCH(1,$B28:$B45,0)+COLUMN(K$1)-2)),\"\")","v":""},{"$f":"IF(AND($B28=1,$A28<>\"\"),\nIF(MATCH(1,$B29:$B65,0)<  $B28+MATCH(1,$B28:$B45,0)+COLUMN(L$1)-2,\"\",\nINDEX($A28:$A65,$B28+MATCH(1,$B28:$B45,0)+COLUMN(L$1)-2)),\"\")","v":""},{"$f":"IF(AND($B28=1,$A28<>\"\"),\nIF(MATCH(1,$B29:$B65,0)<  $B28+MATCH(1,$B28:$B45,0)+COLUMN(M$1)-2,\"\",\nINDEX($A28:$A65,$B28+MATCH(1,$B28:$B45,0)+COLUMN(M$1)-2)),\"\")","v":""},{"$f":"IF(AND($B28=1,$A28<>\"\"),\nIF(MATCH(1,$B29:$B65,0)<  $B28+MATCH(1,$B28:$B45,0)+COLUMN(N$1)-2,\"\",\nINDEX($A28:$A65,$B28+MATCH(1,$B28:$B45,0)+COLUMN(N$1)-2)),\"\")","v":""},{"$f":"IF(AND($B28=1,$A28<>\"\"),\nIF(MATCH(1,$B29:$B65,0)<  $B28+MATCH(1,$B28:$B45,0)+COLUMN(O$1)-2,\"\",\nINDEX($A28:$A65,$B28+MATCH(1,$B28:$B45,0)+COLUMN(O$1)-2)),\"\")","v":""}]
["6.    ООО \"ВолгоУрал НИПИгаз\" ",{"$f":"IF(OR(ISNUMBER(--LEFTB(A29,SEARCH(\".\",A29,1)-1)),COUNTA(A29:$A$9123)=0),1,B28+1)","v":1},{"$f":"IF(AND($B29=1,$A29<>\"\"),\nIF(MATCH(1,$B30:$B65,0)<  $B29+MATCH(1,$B29:$B46,0)+COLUMN(A$1)-2,\"\",\nINDEX($A29:$A65,$B29+MATCH(1,$B29:$B46,0)+COLUMN(A$1)-2)),\"\")","v":"6.    ООО \"ВолгоУрал НИПИгаз\" "},{"$f":"IF(AND($B29=1,$A29<>\"\"),\nIF(MATCH(1,$B30:$B65,0)<  $B29+MATCH(1,$B29:$B46,0)+COLUMN(B$1)-2,\"\",\nINDEX($A29:$A65,$B29+MATCH(1,$B29:$B46,0)+COLUMN(B$1)-2)),\"\")","v":"Директор Пантелеев Дмитрий Вячеславович "},{"$f":"IF(AND($B29=1,$A29<>\"\"),\nIF(MATCH(1,$B30:$B65,0)<  $B29+MATCH(1,$B29:$B46,0)+COLUMN(C$1)-2,\"\",\nINDEX($A29:$A65,$B29+MATCH(1,$B29:$B46,0)+COLUMN(C$1)-2)),\"\")","v":"адрес: 460000 г. Оренбург, ул. Пушкинская, 20 "},{"$f":"IF(AND($B29=1,$A29<>\"\"),\nIF(MATCH(1,$B30:$B65,0)<  $B29+MATCH(1,$B29:$B46,0)+COLUMN(D$1)-2,\"\",\nINDEX($A29:$A65,$B29+MATCH(1,$B29:$B46,0)+COLUMN(D$1)-2)),\"\")","v":"тел. 340-450, 77-09-93, ф.73-12-18 e-mail: info@VUNIPIGAZ.RU  "},{"$f":"IF(AND($B29=1,$A29<>\"\"),\nIF(MATCH(1,$B30:$B65,0)<  $B29+MATCH(1,$B29:$B46,0)+COLUMN(E$1)-2,\"\",\nINDEX($A29:$A65,$B29+MATCH(1,$B29:$B46,0)+COLUMN(E$1)-2)),\"\")","v":""},{"$f":"IF(AND($B29=1,$A29<>\"\"),\nIF(MATCH(1,$B30:$B65,0)<  $B29+MATCH(1,$B29:$B46,0)+COLUMN(F$1)-2,\"\",\nINDEX($A29:$A65,$B29+MATCH(1,$B29:$B46,0)+COLUMN(F$1)-2)),\"\")","v":""},{"$f":"IF(AND($B29=1,$A29<>\"\"),\nIF(MATCH(1,$B30:$B65,0)<  $B29+MATCH(1,$B29:$B46,0)+COLUMN(G$1)-2,\"\",\nINDEX($A29:$A65,$B29+MATCH(1,$B29:$B46,0)+COLUMN(G$1)-2)),\"\")","v":""},{"$f":"IF(AND($B29=1,$A29<>\"\"),\nIF(MATCH(1,$B30:$B65,0)<  $B29+MATCH(1,$B29:$B46,0)+COLUMN(H$1)-2,\"\",\nINDEX($A29:$A65,$B29+MATCH(1,$B29:$B46,0)+COLUMN(H$1)-2)),\"\")","v":""},{"$f":"IF(AND($B29=1,$A29<>\"\"),\nIF(MATCH(1,$B30:$B65,0)<  $B29+MATCH(1,$B29:$B46,0)+COLUMN(I$1)-2,\"\",\nINDEX($A29:$A65,$B29+MATCH(1,$B29:$B46,0)+COLUMN(I$1)-2)),\"\")","v":""},{"$f":"IF(AND($B29=1,$A29<>\"\"),\nIF(MATCH(1,$B30:$B65,0)<  $B29+MATCH(1,$B29:$B46,0)+COLUMN(J$1)-2,\"\",\nINDEX($A29:$A65,$B29+MATCH(1,$B29:$B46,0)+COLUMN(J$1)-2)),\"\")","v":""},{"$f":"IF(AND($B29=1,$A29<>\"\"),\nIF(MATCH(1,$B30:$B65,0)<  $B29+MATCH(1,$B29:$B46,0)+COLUMN(K$1)-2,\"\",\nINDEX($A29:$A65,$B29+MATCH(1,$B29:$B46,0)+COLUMN(K$1)-2)),\"\")","v":""},{"$f":"IF(AND($B29=1,$A29<>\"\"),\nIF(MATCH(1,$B30:$B65,0)<  $B29+MATCH(1,$B29:$B46,0)+COLUMN(L$1)-2,\"\",\nINDEX($A29:$A65,$B29+MATCH(1,$B29:$B46,0)+COLUMN(L$1)-2)),\"\")","v":""},{"$f":"IF(AND($B29=1,$A29<>\"\"),\nIF(MATCH(1,$B30:$B65,0)<  $B29+MATCH(1,$B29:$B46,0)+COLUMN(M$1)-2,\"\",\nINDEX($A29:$A65,$B29+MATCH(1,$B29:$B46,0)+COLUMN(M$1)-2)),\"\")","v":""},{"$f":"IF(AND($B29=1,$A29<>\"\"),\nIF(MATCH(1,$B30:$B65,0)<  $B29+MATCH(1,$B29:$B46,0)+COLUMN(N$1)-2,\"\",\nINDEX($A29:$A65,$B29+MATCH(1,$B29:$B46,0)+COLUMN(N$1)-2)),\"\")","v":""},{"$f":"IF(AND($B29=1,$A29<>\"\"),\nIF(MATCH(1,$B30:$B65,0)<  $B29+MATCH(1,$B29:$B46,0)+COLUMN(O$1)-2,\"\",\nINDEX($A29:$A65,$B29+MATCH(1,$B29:$B46,0)+COLUMN(O$1)-2)),\"\")","v":""}]
["Директор Пантелеев Дмитрий Вячеславович ",{"$f":"IF(OR(ISNUMBER(--LEFTB(A30,SEARCH(\".\",A30,1)-1)),COUNTA(A30:$A$9123)=0),1,B29+1)","v":2},{"$f":"IF(AND($B30=1,$A30<>\"\"),\nIF(MATCH(1,$B31:$B65,0)<  $B30+MATCH(1,$B30:$B47,0)+COLUMN(A$1)-2,\"\",\nINDEX($A30:$A65,$B30+MATCH(1,$B30:$B47,0)+COLUMN(A$1)-2)),\"\")","v":""},{"$f":"IF(AND($B30=1,$A30<>\"\"),\nIF(MATCH(1,$B31:$B65,0)<  $B30+MATCH(1,$B30:$B47,0)+COLUMN(B$1)-2,\"\",\nINDEX($A30:$A65,$B30+MATCH(1,$B30:$B47,0)+COLUMN(B$1)-2)),\"\")","v":""},{"$f":"IF(AND($B30=1,$A30<>\"\"),\nIF(MATCH(1,$B31:$B65,0)<  $B30+MATCH(1,$B30:$B47,0)+COLUMN(C$1)-2,\"\",\nINDEX($A30:$A65,$B30+MATCH(1,$B30:$B47,0)+COLUMN(C$1)-2)),\"\")","v":""},{"$f":"IF(AND($B30=1,$A30<>\"\"),\nIF(MATCH(1,$B31:$B65,0)<  $B30+MATCH(1,$B30:$B47,0)+COLUMN(D$1)-2,\"\",\nINDEX($A30:$A65,$B30+MATCH(1,$B30:$B47,0)+COLUMN(D$1)-2)),\"\")","v":""},{"$f":"IF(AND($B30=1,$A30<>\"\"),\nIF(MATCH(1,$B31:$B65,0)<  $B30+MATCH(1,$B30:$B47,0)+COLUMN(E$1)-2,\"\",\nINDEX($A30:$A65,$B30+MATCH(1,$B30:$B47,0)+COLUMN(E$1)-2)),\"\")","v":""},{"$f":"IF(AND($B30=1,$A30<>\"\"),\nIF(MATCH(1,$B31:$B65,0)<  $B30+MATCH(1,$B30:$B47,0)+COLUMN(F$1)-2,\"\",\nINDEX($A30:$A65,$B30+MATCH(1,$B30:$B47,0)+COLUMN(F$1)-2)),\"\")","v":""},{"$f":"IF(AND($B30=1,$A30<>\"\"),\nIF(MATCH(1,$B31:$B65,0)<  $B30+MATCH(1,$B30:$B47,0)+COLUMN(G$1)-2,\"\",\nINDEX($A30:$A65,$B30+MATCH(1,$B30:$B47,0)+COLUMN(G$1)-2)),\"\")","v":""},{"$f":"IF(AND($B30=1,$A30<>\"\"),\nIF(MATCH(1,$B31:$B65,0)<  $B30+MATCH(1,$B30:$B47,0)+COLUMN(H$1)-2,\"\",\nINDEX($A30:$A65,$B30+MATCH(1,$B30:$B47,0)+COLUMN(H$1)-2)),\"\")","v":""},{"$f":"IF(AND($B30=1,$A30<>\"\"),\nIF(MATCH(1,$B31:$B65,0)<  $B30+MATCH(1,$B30:$B47,0)+COLUMN(I$1)-2,\"\",\nINDEX($A30:$A65,$B30+MATCH(1,$B30:$B47,0)+COLUMN(I$1)-2)),\"\")","v":""},{"$f":"IF(AND($B30=1,$A30<>\"\"),\nIF(MATCH(1,$B31:$B65,0)<  $B30+MATCH(1,$B30:$B47,0)+COLUMN(J$1)-2,\"\",\nINDEX($A30:$A65,$B30+MATCH(1,$B30:$B47,0)+COLUMN(J$1)-2)),\"\")","v":""},{"$f":"IF(AND($B30=1,$A30<>\"\"),\nIF(MATCH(1,$B31:$B65,0)<  $B30+MATCH(1,$B30:$B47,0)+COLUMN(K$1)-2,\"\",\nINDEX($A30:$A65,$B30+MATCH(1,$B30:$B47,0)+COLUMN(K$1)-2)),\"\")","v":""},{"$f":"IF(AND($B30=1,$A30<>\"\"),\nIF(MATCH(1,$B31:$B65,0)<  $B30+MATCH(1,$B30:$B47,0)+COLUMN(L$1)-2,\"\",\nINDEX($A30:$A65,$B30+MATCH(1,$B30:$B47,0)+COLUMN(L$1)-2)),\"\")","v":""},{"$f":"IF(AND($B30=1,$A30<>\"\"),\nIF(MATCH(1,$B31:$B65,0)<  $B30+MATCH(1,$B30:$B47,0)+COLUMN(M$1)-2,\"\",\nINDEX($A30:$A65,$B30+MATCH(1,$B30:$B47,0)+COLUMN(M$1)-2)),\"\")","v":""},{"$f":"IF(AND($B30=1,$A30<>\"\"),\nIF(MATCH(1,$B31:$B65,0)<  $B30+MATCH(1,$B30:$B47,0)+COLUMN(N$1)-2,\"\",\nINDEX($A30:$A65,$B30+MATCH(1,$B30:$B47,0)+COLUMN(N$1)-2)),\"\")","v":""},{"$f":"IF(AND($B30=1,$A30<>\"\"),\nIF(MATCH(1,$B31:$B65,0)<  $B30+MATCH(1,$B30:$B47,0)+COLUMN(O$1)-2,\"\",\nINDEX($A30:$A65,$B30+MATCH(1,$B30:$B47,0)+COLUMN(O$1)-2)),\"\")","v":""}]
["адрес: 460000 г. Оренбург, ул. Пушкинская, 20 ",{"$f":"IF(OR(ISNUMBER(--LEFTB(A31,SEARCH(\".\",A31,1)-1)),COUNTA(A31:$A$9123)=0),1,B30+1)","v":3},{"$f":"IF(AND($B31=1,$A31<>\"\"),\nIF(MATCH(1,$B32:$B65,0)<  $B31+MATCH(1,$B31:$B48,0)+COLUMN(A$1)-2,\"\",\nINDEX($A31:$A65,$B31+MATCH(1,$B31:$B48,0)+COLUMN(A$1)-2)),\"\")","v":""},{"$f":"IF(AND($B31=1,$A31<>\"\"),\nIF(MATCH(1,$B32:$B65,0)<  $B31+MATCH(1,$B31:$B48,0)+COLUMN(B$1)-2,\"\",\nINDEX($A31:$A65,$B31+MATCH(1,$B31:$B48,0)+COLUMN(B$1)-2)),\"\")","v":""},{"$f":"IF(AND($B31=1,$A31<>\"\"),\nIF(MATCH(1,$B32:$B65,0)<  $B31+MATCH(1,$B31:$B48,0)+COLUMN(C$1)-2,\"\",\nINDEX($A31:$A65,$B31+MATCH(1,$B31:$B48,0)+COLUMN(C$1)-2)),\"\")","v":""},{"$f":"IF(AND($B31=1,$A31<>\"\"),\nIF(MATCH(1,$B32:$B65,0)<  $B31+MATCH(1,$B31:$B48,0)+COLUMN(D$1)-2,\"\",\nINDEX($A31:$A65,$B31+MATCH(1,$B31:$B48,0)+COLUMN(D$1)-2)),\"\")","v":""},{"$f":"IF(AND($B31=1,$A31<>\"\"),\nIF(MATCH(1,$B32:$B65,0)<  $B31+MATCH(1,$B31:$B48,0)+COLUMN(E$1)-2,\"\",\nINDEX($A31:$A65,$B31+MATCH(1,$B31:$B48,0)+COLUMN(E$1)-2)),\"\")","v":""},{"$f":"IF(AND($B31=1,$A31<>\"\"),\nIF(MATCH(1,$B32:$B65,0)<  $B31+MATCH(1,$B31:$B48,0)+COLUMN(F$1)-2,\"\",\nINDEX($A31:$A65,$B31+MATCH(1,$B31:$B48,0)+COLUMN(F$1)-2)),\"\")","v":""},{"$f":"IF(AND($B31=1,$A31<>\"\"),\nIF(MATCH(1,$B32:$B65,0)<  $B31+MATCH(1,$B31:$B48,0)+COLUMN(G$1)-2,\"\",\nINDEX($A31:$A65,$B31+MATCH(1,$B31:$B48,0)+COLUMN(G$1)-2)),\"\")","v":""},{"$f":"IF(AND($B31=1,$A31<>\"\"),\nIF(MATCH(1,$B32:$B65,0)<  $B31+MATCH(1,$B31:$B48,0)+COLUMN(H$1)-2,\"\",\nINDEX($A31:$A65,$B31+MATCH(1,$B31:$B48,0)+COLUMN(H$1)-2)),\"\")","v":""},{"$f":"IF(AND($B31=1,$A31<>\"\"),\nIF(MATCH(1,$B32:$B65,0)<  $B31+MATCH(1,$B31:$B48,0)+COLUMN(I$1)-2,\"\",\nINDEX($A31:$A65,$B31+MATCH(1,$B31:$B48,0)+COLUMN(I$1)-2)),\"\")","v":""},{"$f":"IF(AND($B31=1,$A31<>\"\"),\nIF(MATCH(1,$B32:$B65,0)<  $B31+MATCH(1,$B31:$B48,0)+COLUMN(J$1)-2,\"\",\nINDEX($A31:$A65,$B31+MATCH(1,$B31:$B48,0)+COLUMN(J$1)-2)),\"\")","v":""},{"$f":"IF(AND($B31=1,$A31<>\"\"),\nIF(MATCH(1,$B32:$B65,0)<  $B31+MATCH(1,$B31:$B48,0)+COLUMN(K$1)-2,\"\",\nINDEX($A31:$A65,$B31+MATCH(1,$B31:$B48,0)+COLUMN(K$1)-2)),\"\")","v":""},{"$f":"IF(AND($B31=1,$A31<>\"\"),\nIF(MATCH(1,$B32:$B65,0)<  $B31+MATCH(1,$B31:$B48,0)+COLUMN(L$1)-2,\"\",\nINDEX($A31:$A65,$B31+MATCH(1,$B31:$B48,0)+COLUMN(L$1)-2)),\"\")","v":""},{"$f":"IF(AND($B31=1,$A31<>\"\"),\nIF(MATCH(1,$B32:$B65,0)<  $B31+MATCH(1,$B31:$B48,0)+COLUMN(M$1)-2,\"\",\nINDEX($A31:$A65,$B31+MATCH(1,$B31:$B48,0)+COLUMN(M$1)-2)),\"\")","v":""},{"$f":"IF(AND($B31=1,$A31<>\"\"),\nIF(MATCH(1,$B32:$B65,0)<  $B31+MATCH(1,$B31:$B48,0)+COLUMN(N$1)-2,\"\",\nINDEX($A31:$A65,$B31+MATCH(1,$B31:$B48,0)+COLUMN(N$1)-2)),\"\")","v":""},{"$f":"IF(AND($B31=1,$A31<>\"\"),\nIF(MATCH(1,$B32:$B65,0)<  $B31+MATCH(1,$B31:$B48,0)+COLUMN(O$1)-2,\"\",\nINDEX($A31:$A65,$B31+MATCH(1,$B31:$B48,0)+COLUMN(O$1)-2)),\"\")","v":""}]
["тел. 340-450, 77-09-93, ф.73-12-18 e-mail: info@VUNIPIGAZ.RU  ",{"$f":"IF(OR(ISNUMBER(--LEFTB(A32,SEARCH(\".\",A32,1)-1)),COUNTA(A32:$A$9123)=0),1,B31+1)","v":4},{"$f":"IF(AND($B32=1,$A32<>\"\"),\nIF(MATCH(1,$B33:$B65,0)<  $B32+MATCH(1,$B32:$B49,0)+COLUMN(A$1)-2,\"\",\nINDEX($A32:$A65,$B32+MATCH(1,$B32:$B49,0)+COLUMN(A$1)-2)),\"\")","v":""},{"$f":"IF(AND($B32=1,$A32<>\"\"),\nIF(MATCH(1,$B33:$B65,0)<  $B32+MATCH(1,$B32:$B49,0)+COLUMN(B$1)-2,\"\",\nINDEX($A32:$A65,$B32+MATCH(1,$B32:$B49,0)+COLUMN(B$1)-2)),\"\")","v":""},{"$f":"IF(AND($B32=1,$A32<>\"\"),\nIF(MATCH(1,$B33:$B65,0)<  $B32+MATCH(1,$B32:$B49,0)+COLUMN(C$1)-2,\"\",\nINDEX($A32:$A65,$B32+MATCH(1,$B32:$B49,0)+COLUMN(C$1)-2)),\"\")","v":""},{"$f":"IF(AND($B32=1,$A32<>\"\"),\nIF(MATCH(1,$B33:$B65,0)<  $B32+MATCH(1,$B32:$B49,0)+COLUMN(D$1)-2,\"\",\nINDEX($A32:$A65,$B32+MATCH(1,$B32:$B49,0)+COLUMN(D$1)-2)),\"\")","v":""},{"$f":"IF(AND($B32=1,$A32<>\"\"),\nIF(MATCH(1,$B33:$B65,0)<  $B32+MATCH(1,$B32:$B49,0)+COLUMN(E$1)-2,\"\",\nINDEX($A32:$A65,$B32+MATCH(1,$B32:$B49,0)+COLUMN(E$1)-2)),\"\")","v":""},{"$f":"IF(AND($B32=1,$A32<>\"\"),\nIF(MATCH(1,$B33:$B65,0)<  $B32+MATCH(1,$B32:$B49,0)+COLUMN(F$1)-2,\"\",\nINDEX($A32:$A65,$B32+MATCH(1,$B32:$B49,0)+COLUMN(F$1)-2)),\"\")","v":""},{"$f":"IF(AND($B32=1,$A32<>\"\"),\nIF(MATCH(1,$B33:$B65,0)<  $B32+MATCH(1,$B32:$B49,0)+COLUMN(G$1)-2,\"\",\nINDEX($A32:$A65,$B32+MATCH(1,$B32:$B49,0)+COLUMN(G$1)-2)),\"\")","v":""},{"$f":"IF(AND($B32=1,$A32<>\"\"),\nIF(MATCH(1,$B33:$B65,0)<  $B32+MATCH(1,$B32:$B49,0)+COLUMN(H$1)-2,\"\",\nINDEX($A32:$A65,$B32+MATCH(1,$B32:$B49,0)+COLUMN(H$1)-2)),\"\")","v":""},{"$f":"IF(AND($B32=1,$A32<>\"\"),\nIF(MATCH(1,$B33:$B65,0)<  $B32+MATCH(1,$B32:$B49,0)+COLUMN(I$1)-2,\"\",\nINDEX($A32:$A65,$B32+MATCH(1,$B32:$B49,0)+COLUMN(I$1)-2)),\"\")","v":""},{"$f":"IF(AND($B32=1,$A32<>\"\"),\nIF(MATCH(1,$B33:$B65,0)<  $B32+MATCH(1,$B32:$B49,0)+COLUMN(J$1)-2,\"\",\nINDEX($A32:$A65,$B32+MATCH(1,$B32:$B49,0)+COLUMN(J$1)-2)),\"\")","v":""},{"$f":"IF(AND($B32=1,$A32<>\"\"),\nIF(MATCH(1,$B33:$B65,0)<  $B32+MATCH(1,$B32:$B49,0)+COLUMN(K$1)-2,\"\",\nINDEX($A32:$A65,$B32+MATCH(1,$B32:$B49,0)+COLUMN(K$1)-2)),\"\")","v":""},{"$f":"IF(AND($B32=1,$A32<>\"\"),\nIF(MATCH(1,$B33:$B65,0)<  $B32+MATCH(1,$B32:$B49,0)+COLUMN(L$1)-2,\"\",\nINDEX($A32:$A65,$B32+MATCH(1,$B32:$B49,0)+COLUMN(L$1)-2)),\"\")","v":""},{"$f":"IF(AND($B32=1,$A32<>\"\"),\nIF(MATCH(1,$B33:$B65,0)<  $B32+MATCH(1,$B32:$B49,0)+COLUMN(M$1)-2,\"\",\nINDEX($A32:$A65,$B32+MATCH(1,$B32:$B49,0)+COLUMN(M$1)-2)),\"\")","v":""},{"$f":"IF(AND($B32=1,$A32<>\"\"),\nIF(MATCH(1,$B33:$B65,0)<  $B32+MATCH(1,$B32:$B49,0)+COLUMN(N$1)-2,\"\",\nINDEX($A32:$A65,$B32+MATCH(1,$B32:$B49,0)+COLUMN(N$1)-2)),\"\")","v":""},{"$f":"IF(AND($B32=1,$A32<>\"\"),\nIF(MATCH(1,$B33:$B65,0)<  $B32+MATCH(1,$B32:$B49,0)+COLUMN(O$1)-2,\"\",\nINDEX($A32:$A65,$B32+MATCH(1,$B32:$B49,0)+COLUMN(O$1)-2)),\"\")","v":""}]
["7.    ООО \"Фирма «Газпромавтоматика\" ",{"$f":"IF(OR(ISNUMBER(--LEFTB(A33,SEARCH(\".\",A33,1)-1)),COUNTA(A33:$A$9123)=0),1,B32+1)","v":1},{"$f":"IF(AND($B33=1,$A33<>\"\"),\nIF(MATCH(1,$B34:$B65,0)<  $B33+MATCH(1,$B33:$B50,0)+COLUMN(A$1)-2,\"\",\nINDEX($A33:$A65,$B33+MATCH(1,$B33:$B50,0)+COLUMN(A$1)-2)),\"\")","v":"7.    ООО \"Фирма «Газпромавтоматика\" "},{"$f":"IF(AND($B33=1,$A33<>\"\"),\nIF(MATCH(1,$B34:$B65,0)<  $B33+MATCH(1,$B33:$B50,0)+COLUMN(B$1)-2,\"\",\nINDEX($A33:$A65,$B33+MATCH(1,$B33:$B50,0)+COLUMN(B$1)-2)),\"\")","v":"Директор Наумов Владимир Федорович"},{"$f":"IF(AND($B33=1,$A33<>\"\"),\nIF(MATCH(1,$B34:$B65,0)<  $B33+MATCH(1,$B33:$B50,0)+COLUMN(C$1)-2,\"\",\nINDEX($A33:$A65,$B33+MATCH(1,$B33:$B50,0)+COLUMN(C$1)-2)),\"\")","v":"адрес: 460027 г. Оренбург ул. Донгузская, 64 "},{"$f":"IF(AND($B33=1,$A33<>\"\"),\nIF(MATCH(1,$B34:$B65,0)<  $B33+MATCH(1,$B33:$B50,0)+COLUMN(D$1)-2,\"\",\nINDEX($A33:$A65,$B33+MATCH(1,$B33:$B50,0)+COLUMN(D$1)-2)),\"\")","v":"т. 73-37-23; ф.73-40-22; 73-40-36 – отдел кадров. "},{"$f":"IF(AND($B33=1,$A33<>\"\"),\nIF(MATCH(1,$B34:$B65,0)<  $B33+MATCH(1,$B33:$B50,0)+COLUMN(E$1)-2,\"\",\nINDEX($A33:$A65,$B33+MATCH(1,$B33:$B50,0)+COLUMN(E$1)-2)),\"\")","v":"info@ogpa.ru; сайт: www.ogpa.ru "},{"$f":"IF(AND($B33=1,$A33<>\"\"),\nIF(MATCH(1,$B34:$B65,0)<  $B33+MATCH(1,$B33:$B50,0)+COLUMN(F$1)-2,\"\",\nINDEX($A33:$A65,$B33+MATCH(1,$B33:$B50,0)+COLUMN(F$1)-2)),\"\")","v":""},{"$f":"IF(AND($B33=1,$A33<>\"\"),\nIF(MATCH(1,$B34:$B65,0)<  $B33+MATCH(1,$B33:$B50,0)+COLUMN(G$1)-2,\"\",\nINDEX($A33:$A65,$B33+MATCH(1,$B33:$B50,0)+COLUMN(G$1)-2)),\"\")","v":""},{"$f":"IF(AND($B33=1,$A33<>\"\"),\nIF(MATCH(1,$B34:$B65,0)<  $B33+MATCH(1,$B33:$B50,0)+COLUMN(H$1)-2,\"\",\nINDEX($A33:$A65,$B33+MATCH(1,$B33:$B50,0)+COLUMN(H$1)-2)),\"\")","v":""},{"$f":"IF(AND($B33=1,$A33<>\"\"),\nIF(MATCH(1,$B34:$B65,0)<  $B33+MATCH(1,$B33:$B50,0)+COLUMN(I$1)-2,\"\",\nINDEX($A33:$A65,$B33+MATCH(1,$B33:$B50,0)+COLUMN(I$1)-2)),\"\")","v":""},{"$f":"IF(AND($B33=1,$A33<>\"\"),\nIF(MATCH(1,$B34:$B65,0)<  $B33+MATCH(1,$B33:$B50,0)+COLUMN(J$1)-2,\"\",\nINDEX($A33:$A65,$B33+MATCH(1,$B33:$B50,0)+COLUMN(J$1)-2)),\"\")","v":""},{"$f":"IF(AND($B33=1,$A33<>\"\"),\nIF(MATCH(1,$B34:$B65,0)<  $B33+MATCH(1,$B33:$B50,0)+COLUMN(K$1)-2,\"\",\nINDEX($A33:$A65,$B33+MATCH(1,$B33:$B50,0)+COLUMN(K$1)-2)),\"\")","v":""},{"$f":"IF(AND($B33=1,$A33<>\"\"),\nIF(MATCH(1,$B34:$B65,0)<  $B33+MATCH(1,$B33:$B50,0)+COLUMN(L$1)-2,\"\",\nINDEX($A33:$A65,$B33+MATCH(1,$B33:$B50,0)+COLUMN(L$1)-2)),\"\")","v":""},{"$f":"IF(AND($B33=1,$A33<>\"\"),\nIF(MATCH(1,$B34:$B65,0)<  $B33+MATCH(1,$B33:$B50,0)+COLUMN(M$1)-2,\"\",\nINDEX($A33:$A65,$B33+MATCH(1,$B33:$B50,0)+COLUMN(M$1)-2)),\"\")","v":""},{"$f":"IF(AND($B33=1,$A33<>\"\"),\nIF(MATCH(1,$B34:$B65,0)<  $B33+MATCH(1,$B33:$B50,0)+COLUMN(N$1)-2,\"\",\nINDEX($A33:$A65,$B33+MATCH(1,$B33:$B50,0)+COLUMN(N$1)-2)),\"\")","v":""},{"$f":"IF(AND($B33=1,$A33<>\"\"),\nIF(MATCH(1,$B34:$B65,0)<  $B33+MATCH(1,$B33:$B50,0)+COLUMN(O$1)-2,\"\",\nINDEX($A33:$A65,$B33+MATCH(1,$B33:$B50,0)+COLUMN(O$1)-2)),\"\")","v":""}]
["Директор Наумов Владимир Федорович",{"$f":"IF(OR(ISNUMBER(--LEFTB(A34,SEARCH(\".\",A34,1)-1)),COUNTA(A34:$A$9123)=0),1,B33+1)","v":2},{"$f":"IF(AND($B34=1,$A34<>\"\"),\nIF(MATCH(1,$B35:$B65,0)<  $B34+MATCH(1,$B34:$B51,0)+COLUMN(A$1)-2,\"\",\nINDEX($A34:$A65,$B34+MATCH(1,$B34:$B51,0)+COLUMN(A$1)-2)),\"\")","v":""},{"$f":"IF(AND($B34=1,$A34<>\"\"),\nIF(MATCH(1,$B35:$B65,0)<  $B34+MATCH(1,$B34:$B51,0)+COLUMN(B$1)-2,\"\",\nINDEX($A34:$A65,$B34+MATCH(1,$B34:$B51,0)+COLUMN(B$1)-2)),\"\")","v":""},{"$f":"IF(AND($B34=1,$A34<>\"\"),\nIF(MATCH(1,$B35:$B65,0)<  $B34+MATCH(1,$B34:$B51,0)+COLUMN(C$1)-2,\"\",\nINDEX($A34:$A65,$B34+MATCH(1,$B34:$B51,0)+COLUMN(C$1)-2)),\"\")","v":""},{"$f":"IF(AND($B34=1,$A34<>\"\"),\nIF(MATCH(1,$B35:$B65,0)<  $B34+MATCH(1,$B34:$B51,0)+COLUMN(D$1)-2,\"\",\nINDEX($A34:$A65,$B34+MATCH(1,$B34:$B51,0)+COLUMN(D$1)-2)),\"\")","v":""},{"$f":"IF(AND($B34=1,$A34<>\"\"),\nIF(MATCH(1,$B35:$B65,0)<  $B34+MATCH(1,$B34:$B51,0)+COLUMN(E$1)-2,\"\",\nINDEX($A34:$A65,$B34+MATCH(1,$B34:$B51,0)+COLUMN(E$1)-2)),\"\")","v":""},{"$f":"IF(AND($B34=1,$A34<>\"\"),\nIF(MATCH(1,$B35:$B65,0)<  $B34+MATCH(1,$B34:$B51,0)+COLUMN(F$1)-2,\"\",\nINDEX($A34:$A65,$B34+MATCH(1,$B34:$B51,0)+COLUMN(F$1)-2)),\"\")","v":""},{"$f":"IF(AND($B34=1,$A34<>\"\"),\nIF(MATCH(1,$B35:$B65,0)<  $B34+MATCH(1,$B34:$B51,0)+COLUMN(G$1)-2,\"\",\nINDEX($A34:$A65,$B34+MATCH(1,$B34:$B51,0)+COLUMN(G$1)-2)),\"\")","v":""},{"$f":"IF(AND($B34=1,$A34<>\"\"),\nIF(MATCH(1,$B35:$B65,0)<  $B34+MATCH(1,$B34:$B51,0)+COLUMN(H$1)-2,\"\",\nINDEX($A34:$A65,$B34+MATCH(1,$B34:$B51,0)+COLUMN(H$1)-2)),\"\")","v":""},{"$f":"IF(AND($B34=1,$A34<>\"\"),\nIF(MATCH(1,$B35:$B65,0)<  $B34+MATCH(1,$B34:$B51,0)+COLUMN(I$1)-2,\"\",\nINDEX($A34:$A65,$B34+MATCH(1,$B34:$B51,0)+COLUMN(I$1)-2)),\"\")","v":""},{"$f":"IF(AND($B34=1,$A34<>\"\"),\nIF(MATCH(1,$B35:$B65,0)<  $B34+MATCH(1,$B34:$B51,0)+COLUMN(J$1)-2,\"\",\nINDEX($A34:$A65,$B34+MATCH(1,$B34:$B51,0)+COLUMN(J$1)-2)),\"\")","v":""},{"$f":"IF(AND($B34=1,$A34<>\"\"),\nIF(MATCH(1,$B35:$B65,0)<  $B34+MATCH(1,$B34:$B51,0)+COLUMN(K$1)-2,\"\",\nINDEX($A34:$A65,$B34+MATCH(1,$B34:$B51,0)+COLUMN(K$1)-2)),\"\")","v":""},{"$f":"IF(AND($B34=1,$A34<>\"\"),\nIF(MATCH(1,$B35:$B65,0)<  $B34+MATCH(1,$B34:$B51,0)+COLUMN(L$1)-2,\"\",\nINDEX($A34:$A65,$B34+MATCH(1,$B34:$B51,0)+COLUMN(L$1)-2)),\"\")","v":""},{"$f":"IF(AND($B34=1,$A34<>\"\"),\nIF(MATCH(1,$B35:$B65,0)<  $B34+MATCH(1,$B34:$B51,0)+COLUMN(M$1)-2,\"\",\nINDEX($A34:$A65,$B34+MATCH(1,$B34:$B51,0)+COLUMN(M$1)-2)),\"\")","v":""},{"$f":"IF(AND($B34=1,$A34<>\"\"),\nIF(MATCH(1,$B35:$B65,0)<  $B34+MATCH(1,$B34:$B51,0)+COLUMN(N$1)-2,\"\",\nINDEX($A34:$A65,$B34+MATCH(1,$B34:$B51,0)+COLUMN(N$1)-2)),\"\")","v":""},{"$f":"IF(AND($B34=1,$A34<>\"\"),\nIF(MATCH(1,$B35:$B65,0)<  $B34+MATCH(1,$B34:$B51,0)+COLUMN(O$1)-2,\"\",\nINDEX($A34:$A65,$B34+MATCH(1,$B34:$B51,0)+COLUMN(O$1)-2)),\"\")","v":""}]
["адрес: 460027 г. Оренбург ул. Донгузская, 64 ",{"$f":"IF(OR(ISNUMBER(--LEFTB(A35,SEARCH(\".\",A35,1)-1)),COUNTA(A35:$A$9123)=0),1,B34+1)","v":3},{"$f":"IF(AND($B35=1,$A35<>\"\"),\nIF(MATCH(1,$B36:$B65,0)<  $B35+MATCH(1,$B35:$B52,0)+COLUMN(A$1)-2,\"\",\nINDEX($A35:$A65,$B35+MATCH(1,$B35:$B52,0)+COLUMN(A$1)-2)),\"\")","v":""},{"$f":"IF(AND($B35=1,$A35<>\"\"),\nIF(MATCH(1,$B36:$B65,0)<  $B35+MATCH(1,$B35:$B52,0)+COLUMN(B$1)-2,\"\",\nINDEX($A35:$A65,$B35+MATCH(1,$B35:$B52,0)+COLUMN(B$1)-2)),\"\")","v":""},{"$f":"IF(AND($B35=1,$A35<>\"\"),\nIF(MATCH(1,$B36:$B65,0)<  $B35+MATCH(1,$B35:$B52,0)+COLUMN(C$1)-2,\"\",\nINDEX($A35:$A65,$B35+MATCH(1,$B35:$B52,0)+COLUMN(C$1)-2)),\"\")","v":""},{"$f":"IF(AND($B35=1,$A35<>\"\"),\nIF(MATCH(1,$B36:$B65,0)<  $B35+MATCH(1,$B35:$B52,0)+COLUMN(D$1)-2,\"\",\nINDEX($A35:$A65,$B35+MATCH(1,$B35:$B52,0)+COLUMN(D$1)-2)),\"\")","v":""},{"$f":"IF(AND($B35=1,$A35<>\"\"),\nIF(MATCH(1,$B36:$B65,0)<  $B35+MATCH(1,$B35:$B52,0)+COLUMN(E$1)-2,\"\",\nINDEX($A35:$A65,$B35+MATCH(1,$B35:$B52,0)+COLUMN(E$1)-2)),\"\")","v":""},{"$f":"IF(AND($B35=1,$A35<>\"\"),\nIF(MATCH(1,$B36:$B65,0)<  $B35+MATCH(1,$B35:$B52,0)+COLUMN(F$1)-2,\"\",\nINDEX($A35:$A65,$B35+MATCH(1,$B35:$B52,0)+COLUMN(F$1)-2)),\"\")","v":""},{"$f":"IF(AND($B35=1,$A35<>\"\"),\nIF(MATCH(1,$B36:$B65,0)<  $B35+MATCH(1,$B35:$B52,0)+COLUMN(G$1)-2,\"\",\nINDEX($A35:$A65,$B35+MATCH(1,$B35:$B52,0)+COLUMN(G$1)-2)),\"\")","v":""},{"$f":"IF(AND($B35=1,$A35<>\"\"),\nIF(MATCH(1,$B36:$B65,0)<  $B35+MATCH(1,$B35:$B52,0)+COLUMN(H$1)-2,\"\",\nINDEX($A35:$A65,$B35+MATCH(1,$B35:$B52,0)+COLUMN(H$1)-2)),\"\")","v":""},{"$f":"IF(AND($B35=1,$A35<>\"\"),\nIF(MATCH(1,$B36:$B65,0)<  $B35+MATCH(1,$B35:$B52,0)+COLUMN(I$1)-2,\"\",\nINDEX($A35:$A65,$B35+MATCH(1,$B35:$B52,0)+COLUMN(I$1)-2)),\"\")","v":""},{"$f":"IF(AND($B35=1,$A35<>\"\"),\nIF(MATCH(1,$B36:$B65,0)<  $B35+MATCH(1,$B35:$B52,0)+COLUMN(J$1)-2,\"\",\nINDEX($A35:$A65,$B35+MATCH(1,$B35:$B52,0)+COLUMN(J$1)-2)),\"\")","v":""},{"$f":"IF(AND($B35=1,$A35<>\"\"),\nIF(MATCH(1,$B36:$B65,0)<  $B35+MATCH(1,$B35:$B52,0)+COLUMN(K$1)-2,\"\",\nINDEX($A35:$A65,$B35+MATCH(1,$B35:$B52,0)+COLUMN(K$1)-2)),\"\")","v":""},{"$f":"IF(AND($B35=1,$A35<>\"\"),\nIF(MATCH(1,$B36:$B65,0)<  $B35+MATCH(1,$B35:$B52,0)+COLUMN(L$1)-2,\"\",\nINDEX($A35:$A65,$B35+MATCH(1,$B35:$B52,0)+COLUMN(L$1)-2)),\"\")","v":""},{"$f":"IF(AND($B35=1,$A35<>\"\"),\nIF(MATCH(1,$B36:$B65,0)<  $B35+MATCH(1,$B35:$B52,0)+COLUMN(M$1)-2,\"\",\nINDEX($A35:$A65,$B35+MATCH(1,$B35:$B52,0)+COLUMN(M$1)-2)),\"\")","v":""},{"$f":"IF(AND($B35=1,$A35<>\"\"),\nIF(MATCH(1,$B36:$B65,0)<  $B35+MATCH(1,$B35:$B52,0)+COLUMN(N$1)-2,\"\",\nINDEX($A35:$A65,$B35+MATCH(1,$B35:$B52,0)+COLUMN(N$1)-2)),\"\")","v":""},{"$f":"IF(AND($B35=1,$A35<>\"\"),\nIF(MATCH(1,$B36:$B65,0)<  $B35+MATCH(1,$B35:$B52,0)+COLUMN(O$1)-2,\"\",\nINDEX($A35:$A65,$B35+MATCH(1,$B35:$B52,0)+COLUMN(O$1)-2)),\"\")","v":""}]
["т. 73-37-23; ф.73-40-22; 73-40-36 – отдел кадров. ",{"$f":"IF(OR(ISNUMBER(--LEFTB(A36,SEARCH(\".\",A36,1)-1)),COUNTA(A36:$A$9123)=0),1,B35+1)","v":4},{"$f":"IF(AND($B36=1,$A36<>\"\"),\nIF(MATCH(1,$B37:$B65,0)<  $B36+MATCH(1,$B36:$B53,0)+COLUMN(A$1)-2,\"\",\nINDEX($A36:$A65,$B36+MATCH(1,$B36:$B53,0)+COLUMN(A$1)-2)),\"\")","v":""},{"$f":"IF(AND($B36=1,$A36<>\"\"),\nIF(MATCH(1,$B37:$B65,0)<  $B36+MATCH(1,$B36:$B53,0)+COLUMN(B$1)-2,\"\",\nINDEX($A36:$A65,$B36+MATCH(1,$B36:$B53,0)+COLUMN(B$1)-2)),\"\")","v":""},{"$f":"IF(AND($B36=1,$A36<>\"\"),\nIF(MATCH(1,$B37:$B65,0)<  $B36+MATCH(1,$B36:$B53,0)+COLUMN(C$1)-2,\"\",\nINDEX($A36:$A65,$B36+MATCH(1,$B36:$B53,0)+COLUMN(C$1)-2)),\"\")","v":""},{"$f":"IF(AND($B36=1,$A36<>\"\"),\nIF(MATCH(1,$B37:$B65,0)<  $B36+MATCH(1,$B36:$B53,0)+COLUMN(D$1)-2,\"\",\nINDEX($A36:$A65,$B36+MATCH(1,$B36:$B53,0)+COLUMN(D$1)-2)),\"\")","v":""},{"$f":"IF(AND($B36=1,$A36<>\"\"),\nIF(MATCH(1,$B37:$B65,0)<  $B36+MATCH(1,$B36:$B53,0)+COLUMN(E$1)-2,\"\",\nINDEX($A36:$A65,$B36+MATCH(1,$B36:$B53,0)+COLUMN(E$1)-2)),\"\")","v":""},{"$f":"IF(AND($B36=1,$A36<>\"\"),\nIF(MATCH(1,$B37:$B65,0)<  $B36+MATCH(1,$B36:$B53,0)+COLUMN(F$1)-2,\"\",\nINDEX($A36:$A65,$B36+MATCH(1,$B36:$B53,0)+COLUMN(F$1)-2)),\"\")","v":""},{"$f":"IF(AND($B36=1,$A36<>\"\"),\nIF(MATCH(1,$B37:$B65,0)<  $B36+MATCH(1,$B36:$B53,0)+COLUMN(G$1)-2,\"\",\nINDEX($A36:$A65,$B36+MATCH(1,$B36:$B53,0)+COLUMN(G$1)-2)),\"\")","v":""},{"$f":"IF(AND($B36=1,$A36<>\"\"),\nIF(MATCH(1,$B37:$B65,0)<  $B36+MATCH(1,$B36:$B53,0)+COLUMN(H$1)-2,\"\",\nINDEX($A36:$A65,$B36+MATCH(1,$B36:$B53,0)+COLUMN(H$1)-2)),\"\")","v":""},{"$f":"IF(AND($B36=1,$A36<>\"\"),\nIF(MATCH(1,$B37:$B65,0)<  $B36+MATCH(1,$B36:$B53,0)+COLUMN(I$1)-2,\"\",\nINDEX($A36:$A65,$B36+MATCH(1,$B36:$B53,0)+COLUMN(I$1)-2)),\"\")","v":""},{"$f":"IF(AND($B36=1,$A36<>\"\"),\nIF(MATCH(1,$B37:$B65,0)<  $B36+MATCH(1,$B36:$B53,0)+COLUMN(J$1)-2,\"\",\nINDEX($A36:$A65,$B36+MATCH(1,$B36:$B53,0)+COLUMN(J$1)-2)),\"\")","v":""},{"$f":"IF(AND($B36=1,$A36<>\"\"),\nIF(MATCH(1,$B37:$B65,0)<  $B36+MATCH(1,$B36:$B53,0)+COLUMN(K$1)-2,\"\",\nINDEX($A36:$A65,$B36+MATCH(1,$B36:$B53,0)+COLUMN(K$1)-2)),\"\")","v":""},{"$f":"IF(AND($B36=1,$A36<>\"\"),\nIF(MATCH(1,$B37:$B65,0)<  $B36+MATCH(1,$B36:$B53,0)+COLUMN(L$1)-2,\"\",\nINDEX($A36:$A65,$B36+MATCH(1,$B36:$B53,0)+COLUMN(L$1)-2)),\"\")","v":""},{"$f":"IF(AND($B36=1,$A36<>\"\"),\nIF(MATCH(1,$B37:$B65,0)<  $B36+MATCH(1,$B36:$B53,0)+COLUMN(M$1)-2,\"\",\nINDEX($A36:$A65,$B36+MATCH(1,$B36:$B53,0)+COLUMN(M$1)-2)),\"\")","v":""},{"$f":"IF(AND($B36=1,$A36<>\"\"),\nIF(MATCH(1,$B37:$B65,0)<  $B36+MATCH(1,$B36:$B53,0)+COLUMN(N$1)-2,\"\",\nINDEX($A36:$A65,$B36+MATCH(1,$B36:$B53,0)+COLUMN(N$1)-2)),\"\")","v":""},{"$f":"IF(AND($B36=1,$A36<>\"\"),\nIF(MATCH(1,$B37:$B65,0)<  $B36+MATCH(1,$B36:$B53,0)+COLUMN(O$1)-2,\"\",\nINDEX($A36:$A65,$B36+MATCH(1,$B36:$B53,0)+COLUMN(O$1)-2)),\"\")","v":""}]
["info@ogpa.ru; сайт: www.ogpa.ru ",{"$f":"IF(OR(ISNUMBER(--LEFTB(A37,SEARCH(\".\",A37,1)-1)),COUNTA(A37:$A$9123)=0),1,B36+1)","v":5},{"$f":"IF(AND($B37=1,$A37<>\"\"),\nIF(MATCH(1,$B38:$B65,0)<  $B37+MATCH(1,$B37:$B54,0)+COLUMN(A$1)-2,\"\",\nINDEX($A37:$A65,$B37+MATCH(1,$B37:$B54,0)+COLUMN(A$1)-2)),\"\")","v":""},{"$f":"IF(AND($B37=1,$A37<>\"\"),\nIF(MATCH(1,$B38:$B65,0)<  $B37+MATCH(1,$B37:$B54,0)+COLUMN(B$1)-2,\"\",\nINDEX($A37:$A65,$B37+MATCH(1,$B37:$B54,0)+COLUMN(B$1)-2)),\"\")","v":""},{"$f":"IF(AND($B37=1,$A37<>\"\"),\nIF(MATCH(1,$B38:$B65,0)<  $B37+MATCH(1,$B37:$B54,0)+COLUMN(C$1)-2,\"\",\nINDEX($A37:$A65,$B37+MATCH(1,$B37:$B54,0)+COLUMN(C$1)-2)),\"\")","v":""},{"$f":"IF(AND($B37=1,$A37<>\"\"),\nIF(MATCH(1,$B38:$B65,0)<  $B37+MATCH(1,$B37:$B54,0)+COLUMN(D$1)-2,\"\",\nINDEX($A37:$A65,$B37+MATCH(1,$B37:$B54,0)+COLUMN(D$1)-2)),\"\")","v":""},{"$f":"IF(AND($B37=1,$A37<>\"\"),\nIF(MATCH(1,$B38:$B65,0)<  $B37+MATCH(1,$B37:$B54,0)+COLUMN(E$1)-2,\"\",\nINDEX($A37:$A65,$B37+MATCH(1,$B37:$B54,0)+COLUMN(E$1)-2)),\"\")","v":""},{"$f":"IF(AND($B37=1,$A37<>\"\"),\nIF(MATCH(1,$B38:$B65,0)<  $B37+MATCH(1,$B37:$B54,0)+COLUMN(F$1)-2,\"\",\nINDEX($A37:$A65,$B37+MATCH(1,$B37:$B54,0)+COLUMN(F$1)-2)),\"\")","v":""},{"$f":"IF(AND($B37=1,$A37<>\"\"),\nIF(MATCH(1,$B38:$B65,0)<  $B37+MATCH(1,$B37:$B54,0)+COLUMN(G$1)-2,\"\",\nINDEX($A37:$A65,$B37+MATCH(1,$B37:$B54,0)+COLUMN(G$1)-2)),\"\")","v":""},{"$f":"IF(AND($B37=1,$A37<>\"\"),\nIF(MATCH(1,$B38:$B65,0)<  $B37+MATCH(1,$B37:$B54,0)+COLUMN(H$1)-2,\"\",\nINDEX($A37:$A65,$B37+MATCH(1,$B37:$B54,0)+COLUMN(H$1)-2)),\"\")","v":""},{"$f":"IF(AND($B37=1,$A37<>\"\"),\nIF(MATCH(1,$B38:$B65,0)<  $B37+MATCH(1,$B37:$B54,0)+COLUMN(I$1)-2,\"\",\nINDEX($A37:$A65,$B37+MATCH(1,$B37:$B54,0)+COLUMN(I$1)-2)),\"\")","v":""},{"$f":"IF(AND($B37=1,$A37<>\"\"),\nIF(MATCH(1,$B38:$B65,0)<  $B37+MATCH(1,$B37:$B54,0)+COLUMN(J$1)-2,\"\",\nINDEX($A37:$A65,$B37+MATCH(1,$B37:$B54,0)+COLUMN(J$1)-2)),\"\")","v":""},{"$f":"IF(AND($B37=1,$A37<>\"\"),\nIF(MATCH(1,$B38:$B65,0)<  $B37+MATCH(1,$B37:$B54,0)+COLUMN(K$1)-2,\"\",\nINDEX($A37:$A65,$B37+MATCH(1,$B37:$B54,0)+COLUMN(K$1)-2)),\"\")","v":""},{"$f":"IF(AND($B37=1,$A37<>\"\"),\nIF(MATCH(1,$B38:$B65,0)<  $B37+MATCH(1,$B37:$B54,0)+COLUMN(L$1)-2,\"\",\nINDEX($A37:$A65,$B37+MATCH(1,$B37:$B54,0)+COLUMN(L$1)-2)),\"\")","v":""},{"$f":"IF(AND($B37=1,$A37<>\"\"),\nIF(MATCH(1,$B38:$B65,0)<  $B37+MATCH(1,$B37:$B54,0)+COLUMN(M$1)-2,\"\",\nINDEX($A37:$A65,$B37+MATCH(1,$B37:$B54,0)+COLUMN(M$1)-2)),\"\")","v":""},{"$f":"IF(AND($B37=1,$A37<>\"\"),\nIF(MATCH(1,$B38:$B65,0)<  $B37+MATCH(1,$B37:$B54,0)+COLUMN(N$1)-2,\"\",\nINDEX($A37:$A65,$B37+MATCH(1,$B37:$B54,0)+COLUMN(N$1)-2)),\"\")","v":""},{"$f":"IF(AND($B37=1,$A37<>\"\"),\nIF(MATCH(1,$B38:$B65,0)<  $B37+MATCH(1,$B37:$B54,0)+COLUMN(O$1)-2,\"\",\nINDEX($A37:$A65,$B37+MATCH(1,$B37:$B54,0)+COLUMN(O$1)-2)),\"\")","v":""}]
["8.    ООО «Строительная компания «ГПДС» ",{"$f":"IF(OR(ISNUMBER(--LEFTB(A38,SEARCH(\".\",A38,1)-1)),COUNTA(A38:$A$9123)=0),1,B37+1)","v":1},{"$f":"IF(AND($B38=1,$A38<>\"\"),\nIF(MATCH(1,$B39:$B65,0)<  $B38+MATCH(1,$B38:$B55,0)+COLUMN(A$1)-2,\"\",\nINDEX($A38:$A65,$B38+MATCH(1,$B38:$B55,0)+COLUMN(A$1)-2)),\"\")","v":"8.    ООО «Строительная компания «ГПДС» "},{"$f":"IF(AND($B38=1,$A38<>\"\"),\nIF(MATCH(1,$B39:$B65,0)<  $B38+MATCH(1,$B38:$B55,0)+COLUMN(B$1)-2,\"\",\nINDEX($A38:$A65,$B38+MATCH(1,$B38:$B55,0)+COLUMN(B$1)-2)),\"\")","v":"Генеральный директор Скрипаль Николай  Иванович "},{"$f":"IF(AND($B38=1,$A38<>\"\"),\nIF(MATCH(1,$B39:$B65,0)<  $B38+MATCH(1,$B38:$B55,0)+COLUMN(C$1)-2,\"\",\nINDEX($A38:$A65,$B38+MATCH(1,$B38:$B55,0)+COLUMN(C$1)-2)),\"\")","v":"адрес: 460052 г. Оренбург, ул. Липовая, 6 "},{"$f":"IF(AND($B38=1,$A38<>\"\"),\nIF(MATCH(1,$B39:$B65,0)<  $B38+MATCH(1,$B38:$B55,0)+COLUMN(D$1)-2,\"\",\nINDEX($A38:$A65,$B38+MATCH(1,$B38:$B55,0)+COLUMN(D$1)-2)),\"\")","v":"тел. 64-98-86; факс 64-96-97; e-mail: gpds@mail.ru"},{"$f":"IF(AND($B38=1,$A38<>\"\"),\nIF(MATCH(1,$B39:$B65,0)<  $B38+MATCH(1,$B38:$B55,0)+COLUMN(E$1)-2,\"\",\nINDEX($A38:$A65,$B38+MATCH(1,$B38:$B55,0)+COLUMN(E$1)-2)),\"\")","v":""},{"$f":"IF(AND($B38=1,$A38<>\"\"),\nIF(MATCH(1,$B39:$B65,0)<  $B38+MATCH(1,$B38:$B55,0)+COLUMN(F$1)-2,\"\",\nINDEX($A38:$A65,$B38+MATCH(1,$B38:$B55,0)+COLUMN(F$1)-2)),\"\")","v":""},{"$f":"IF(AND($B38=1,$A38<>\"\"),\nIF(MATCH(1,$B39:$B65,0)<  $B38+MATCH(1,$B38:$B55,0)+COLUMN(G$1)-2,\"\",\nINDEX($A38:$A65,$B38+MATCH(1,$B38:$B55,0)+COLUMN(G$1)-2)),\"\")","v":""},{"$f":"IF(AND($B38=1,$A38<>\"\"),\nIF(MATCH(1,$B39:$B65,0)<  $B38+MATCH(1,$B38:$B55,0)+COLUMN(H$1)-2,\"\",\nINDEX($A38:$A65,$B38+MATCH(1,$B38:$B55,0)+COLUMN(H$1)-2)),\"\")","v":""},{"$f":"IF(AND($B38=1,$A38<>\"\"),\nIF(MATCH(1,$B39:$B65,0)<  $B38+MATCH(1,$B38:$B55,0)+COLUMN(I$1)-2,\"\",\nINDEX($A38:$A65,$B38+MATCH(1,$B38:$B55,0)+COLUMN(I$1)-2)),\"\")","v":""},{"$f":"IF(AND($B38=1,$A38<>\"\"),\nIF(MATCH(1,$B39:$B65,0)<  $B38+MATCH(1,$B38:$B55,0)+COLUMN(J$1)-2,\"\",\nINDEX($A38:$A65,$B38+MATCH(1,$B38:$B55,0)+COLUMN(J$1)-2)),\"\")","v":""},{"$f":"IF(AND($B38=1,$A38<>\"\"),\nIF(MATCH(1,$B39:$B65,0)<  $B38+MATCH(1,$B38:$B55,0)+COLUMN(K$1)-2,\"\",\nINDEX($A38:$A65,$B38+MATCH(1,$B38:$B55,0)+COLUMN(K$1)-2)),\"\")","v":""},{"$f":"IF(AND($B38=1,$A38<>\"\"),\nIF(MATCH(1,$B39:$B65,0)<  $B38+MATCH(1,$B38:$B55,0)+COLUMN(L$1)-2,\"\",\nINDEX($A38:$A65,$B38+MATCH(1,$B38:$B55,0)+COLUMN(L$1)-2)),\"\")","v":""},{"$f":"IF(AND($B38=1,$A38<>\"\"),\nIF(MATCH(1,$B39:$B65,0)<  $B38+MATCH(1,$B38:$B55,0)+COLUMN(M$1)-2,\"\",\nINDEX($A38:$A65,$B38+MATCH(1,$B38:$B55,0)+COLUMN(M$1)-2)),\"\")","v":""},{"$f":"IF(AND($B38=1,$A38<>\"\"),\nIF(MATCH(1,$B39:$B65,0)<  $B38+MATCH(1,$B38:$B55,0)+COLUMN(N$1)-2,\"\",\nINDEX($A38:$A65,$B38+MATCH(1,$B38:$B55,0)+COLUMN(N$1)-2)),\"\")","v":""},{"$f":"IF(AND($B38=1,$A38<>\"\"),\nIF(MATCH(1,$B39:$B65,0)<  $B38+MATCH(1,$B38:$B55,0)+COLUMN(O$1)-2,\"\",\nINDEX($A38:$A65,$B38+MATCH(1,$B38:$B55,0)+COLUMN(O$1)-2)),\"\")","v":""}]
["Генеральный директор Скрипаль Николай  Иванович ",{"$f":"IF(OR(ISNUMBER(--LEFTB(A39,SEARCH(\".\",A39,1)-1)),COUNTA(A39:$A$9123)=0),1,B38+1)","v":2},{"$f":"IF(AND($B39=1,$A39<>\"\"),\nIF(MATCH(1,$B40:$B65,0)<  $B39+MATCH(1,$B39:$B56,0)+COLUMN(A$1)-2,\"\",\nINDEX($A39:$A65,$B39+MATCH(1,$B39:$B56,0)+COLUMN(A$1)-2)),\"\")","v":""},{"$f":"IF(AND($B39=1,$A39<>\"\"),\nIF(MATCH(1,$B40:$B65,0)<  $B39+MATCH(1,$B39:$B56,0)+COLUMN(B$1)-2,\"\",\nINDEX($A39:$A65,$B39+MATCH(1,$B39:$B56,0)+COLUMN(B$1)-2)),\"\")","v":""},{"$f":"IF(AND($B39=1,$A39<>\"\"),\nIF(MATCH(1,$B40:$B65,0)<  $B39+MATCH(1,$B39:$B56,0)+COLUMN(C$1)-2,\"\",\nINDEX($A39:$A65,$B39+MATCH(1,$B39:$B56,0)+COLUMN(C$1)-2)),\"\")","v":""},{"$f":"IF(AND($B39=1,$A39<>\"\"),\nIF(MATCH(1,$B40:$B65,0)<  $B39+MATCH(1,$B39:$B56,0)+COLUMN(D$1)-2,\"\",\nINDEX($A39:$A65,$B39+MATCH(1,$B39:$B56,0)+COLUMN(D$1)-2)),\"\")","v":""},{"$f":"IF(AND($B39=1,$A39<>\"\"),\nIF(MATCH(1,$B40:$B65,0)<  $B39+MATCH(1,$B39:$B56,0)+COLUMN(E$1)-2,\"\",\nINDEX($A39:$A65,$B39+MATCH(1,$B39:$B56,0)+COLUMN(E$1)-2)),\"\")","v":""},{"$f":"IF(AND($B39=1,$A39<>\"\"),\nIF(MATCH(1,$B40:$B65,0)<  $B39+MATCH(1,$B39:$B56,0)+COLUMN(F$1)-2,\"\",\nINDEX($A39:$A65,$B39+MATCH(1,$B39:$B56,0)+COLUMN(F$1)-2)),\"\")","v":""},{"$f":"IF(AND($B39=1,$A39<>\"\"),\nIF(MATCH(1,$B40:$B65,0)<  $B39+MATCH(1,$B39:$B56,0)+COLUMN(G$1)-2,\"\",\nINDEX($A39:$A65,$B39+MATCH(1,$B39:$B56,0)+COLUMN(G$1)-2)),\"\")","v":""},{"$f":"IF(AND($B39=1,$A39<>\"\"),\nIF(MATCH(1,$B40:$B65,0)<  $B39+MATCH(1,$B39:$B56,0)+COLUMN(H$1)-2,\"\",\nINDEX($A39:$A65,$B39+MATCH(1,$B39:$B56,0)+COLUMN(H$1)-2)),\"\")","v":""},{"$f":"IF(AND($B39=1,$A39<>\"\"),\nIF(MATCH(1,$B40:$B65,0)<  $B39+MATCH(1,$B39:$B56,0)+COLUMN(I$1)-2,\"\",\nINDEX($A39:$A65,$B39+MATCH(1,$B39:$B56,0)+COLUMN(I$1)-2)),\"\")","v":""},{"$f":"IF(AND($B39=1,$A39<>\"\"),\nIF(MATCH(1,$B40:$B65,0)<  $B39+MATCH(1,$B39:$B56,0)+COLUMN(J$1)-2,\"\",\nINDEX($A39:$A65,$B39+MATCH(1,$B39:$B56,0)+COLUMN(J$1)-2)),\"\")","v":""},{"$f":"IF(AND($B39=1,$A39<>\"\"),\nIF(MATCH(1,$B40:$B65,0)<  $B39+MATCH(1,$B39:$B56,0)+COLUMN(K$1)-2,\"\",\nINDEX($A39:$A65,$B39+MATCH(1,$B39:$B56,0)+COLUMN(K$1)-2)),\"\")","v":""},{"$f":"IF(AND($B39=1,$A39<>\"\"),\nIF(MATCH(1,$B40:$B65,0)<  $B39+MATCH(1,$B39:$B56,0)+COLUMN(L$1)-2,\"\",\nINDEX($A39:$A65,$B39+MATCH(1,$B39:$B56,0)+COLUMN(L$1)-2)),\"\")","v":""},{"$f":"IF(AND($B39=1,$A39<>\"\"),\nIF(MATCH(1,$B40:$B65,0)<  $B39+MATCH(1,$B39:$B56,0)+COLUMN(M$1)-2,\"\",\nINDEX($A39:$A65,$B39+MATCH(1,$B39:$B56,0)+COLUMN(M$1)-2)),\"\")","v":""},{"$f":"IF(AND($B39=1,$A39<>\"\"),\nIF(MATCH(1,$B40:$B65,0)<  $B39+MATCH(1,$B39:$B56,0)+COLUMN(N$1)-2,\"\",\nINDEX($A39:$A65,$B39+MATCH(1,$B39:$B56,0)+COLUMN(N$1)-2)),\"\")","v":""},{"$f":"IF(AND($B39=1,$A39<>\"\"),\nIF(MATCH(1,$B40:$B65,0)<  $B39+MATCH(1,$B39:$B56,0)+COLUMN(O$1)-2,\"\",\nINDEX($A39:$A65,$B39+MATCH(1,$B39:$B56,0)+COLUMN(O$1)-2)),\"\")","v":""}]
["адрес: 460052 г. Оренбург, ул. Липовая, 6 ",{"$f":"IF(OR(ISNUMBER(--LEFTB(A40,SEARCH(\".\",A40,1)-1)),COUNTA(A40:$A$9123)=0),1,B39+1)","v":3},{"$f":"IF(AND($B40=1,$A40<>\"\"),\nIF(MATCH(1,$B41:$B65,0)<  $B40+MATCH(1,$B40:$B57,0)+COLUMN(A$1)-2,\"\",\nINDEX($A40:$A65,$B40+MATCH(1,$B40:$B57,0)+COLUMN(A$1)-2)),\"\")","v":""},{"$f":"IF(AND($B40=1,$A40<>\"\"),\nIF(MATCH(1,$B41:$B65,0)<  $B40+MATCH(1,$B40:$B57,0)+COLUMN(B$1)-2,\"\",\nINDEX($A40:$A65,$B40+MATCH(1,$B40:$B57,0)+COLUMN(B$1)-2)),\"\")","v":""},{"$f":"IF(AND($B40=1,$A40<>\"\"),\nIF(MATCH(1,$B41:$B65,0)<  $B40+MATCH(1,$B40:$B57,0)+COLUMN(C$1)-2,\"\",\nINDEX($A40:$A65,$B40+MATCH(1,$B40:$B57,0)+COLUMN(C$1)-2)),\"\")","v":""},{"$f":"IF(AND($B40=1,$A40<>\"\"),\nIF(MATCH(1,$B41:$B65,0)<  $B40+MATCH(1,$B40:$B57,0)+COLUMN(D$1)-2,\"\",\nINDEX($A40:$A65,$B40+MATCH(1,$B40:$B57,0)+COLUMN(D$1)-2)),\"\")","v":""},{"$f":"IF(AND($B40=1,$A40<>\"\"),\nIF(MATCH(1,$B41:$B65,0)<  $B40+MATCH(1,$B40:$B57,0)+COLUMN(E$1)-2,\"\",\nINDEX($A40:$A65,$B40+MATCH(1,$B40:$B57,0)+COLUMN(E$1)-2)),\"\")","v":""},{"$f":"IF(AND($B40=1,$A40<>\"\"),\nIF(MATCH(1,$B41:$B65,0)<  $B40+MATCH(1,$B40:$B57,0)+COLUMN(F$1)-2,\"\",\nINDEX($A40:$A65,$B40+MATCH(1,$B40:$B57,0)+COLUMN(F$1)-2)),\"\")","v":""},{"$f":"IF(AND($B40=1,$A40<>\"\"),\nIF(MATCH(1,$B41:$B65,0)<  $B40+MATCH(1,$B40:$B57,0)+COLUMN(G$1)-2,\"\",\nINDEX($A40:$A65,$B40+MATCH(1,$B40:$B57,0)+COLUMN(G$1)-2)),\"\")","v":""},{"$f":"IF(AND($B40=1,$A40<>\"\"),\nIF(MATCH(1,$B41:$B65,0)<  $B40+MATCH(1,$B40:$B57,0)+COLUMN(H$1)-2,\"\",\nINDEX($A40:$A65,$B40+MATCH(1,$B40:$B57,0)+COLUMN(H$1)-2)),\"\")","v":""},{"$f":"IF(AND($B40=1,$A40<>\"\"),\nIF(MATCH(1,$B41:$B65,0)<  $B40+MATCH(1,$B40:$B57,0)+COLUMN(I$1)-2,\"\",\nINDEX($A40:$A65,$B40+MATCH(1,$B40:$B57,0)+COLUMN(I$1)-2)),\"\")","v":""},{"$f":"IF(AND($B40=1,$A40<>\"\"),\nIF(MATCH(1,$B41:$B65,0)<  $B40+MATCH(1,$B40:$B57,0)+COLUMN(J$1)-2,\"\",\nINDEX($A40:$A65,$B40+MATCH(1,$B40:$B57,0)+COLUMN(J$1)-2)),\"\")","v":""},{"$f":"IF(AND($B40=1,$A40<>\"\"),\nIF(MATCH(1,$B41:$B65,0)<  $B40+MATCH(1,$B40:$B57,0)+COLUMN(K$1)-2,\"\",\nINDEX($A40:$A65,$B40+MATCH(1,$B40:$B57,0)+COLUMN(K$1)-2)),\"\")","v":""},{"$f":"IF(AND($B40=1,$A40<>\"\"),\nIF(MATCH(1,$B41:$B65,0)<  $B40+MATCH(1,$B40:$B57,0)+COLUMN(L$1)-2,\"\",\nINDEX($A40:$A65,$B40+MATCH(1,$B40:$B57,0)+COLUMN(L$1)-2)),\"\")","v":""},{"$f":"IF(AND($B40=1,$A40<>\"\"),\nIF(MATCH(1,$B41:$B65,0)<  $B40+MATCH(1,$B40:$B57,0)+COLUMN(M$1)-2,\"\",\nINDEX($A40:$A65,$B40+MATCH(1,$B40:$B57,0)+COLUMN(M$1)-2)),\"\")","v":""},{"$f":"IF(AND($B40=1,$A40<>\"\"),\nIF(MATCH(1,$B41:$B65,0)<  $B40+MATCH(1,$B40:$B57,0)+COLUMN(N$1)-2,\"\",\nINDEX($A40:$A65,$B40+MATCH(1,$B40:$B57,0)+COLUMN(N$1)-2)),\"\")","v":""},{"$f":"IF(AND($B40=1,$A40<>\"\"),\nIF(MATCH(1,$B41:$B65,0)<  $B40+MATCH(1,$B40:$B57,0)+COLUMN(O$1)-2,\"\",\nINDEX($A40:$A65,$B40+MATCH(1,$B40:$B57,0)+COLUMN(O$1)-2)),\"\")","v":""}]
["тел. 64-98-86; факс 64-96-97; e-mail: gpds@mail.ru",{"$f":"IF(OR(ISNUMBER(--LEFTB(A41,SEARCH(\".\",A41,1)-1)),COUNTA(A41:$A$9123)=0),1,B40+1)","v":4},{"$f":"IF(AND($B41=1,$A41<>\"\"),\nIF(MATCH(1,$B42:$B65,0)<  $B41+MATCH(1,$B41:$B58,0)+COLUMN(A$1)-2,\"\",\nINDEX($A41:$A65,$B41+MATCH(1,$B41:$B58,0)+COLUMN(A$1)-2)),\"\")","v":""},{"$f":"IF(AND($B41=1,$A41<>\"\"),\nIF(MATCH(1,$B42:$B65,0)<  $B41+MATCH(1,$B41:$B58,0)+COLUMN(B$1)-2,\"\",\nINDEX($A41:$A65,$B41+MATCH(1,$B41:$B58,0)+COLUMN(B$1)-2)),\"\")","v":""},{"$f":"IF(AND($B41=1,$A41<>\"\"),\nIF(MATCH(1,$B42:$B65,0)<  $B41+MATCH(1,$B41:$B58,0)+COLUMN(C$1)-2,\"\",\nINDEX($A41:$A65,$B41+MATCH(1,$B41:$B58,0)+COLUMN(C$1)-2)),\"\")","v":""},{"$f":"IF(AND($B41=1,$A41<>\"\"),\nIF(MATCH(1,$B42:$B65,0)<  $B41+MATCH(1,$B41:$B58,0)+COLUMN(D$1)-2,\"\",\nINDEX($A41:$A65,$B41+MATCH(1,$B41:$B58,0)+COLUMN(D$1)-2)),\"\")","v":""},{"$f":"IF(AND($B41=1,$A41<>\"\"),\nIF(MATCH(1,$B42:$B65,0)<  $B41+MATCH(1,$B41:$B58,0)+COLUMN(E$1)-2,\"\",\nINDEX($A41:$A65,$B41+MATCH(1,$B41:$B58,0)+COLUMN(E$1)-2)),\"\")","v":""},{"$f":"IF(AND($B41=1,$A41<>\"\"),\nIF(MATCH(1,$B42:$B65,0)<  $B41+MATCH(1,$B41:$B58,0)+COLUMN(F$1)-2,\"\",\nINDEX($A41:$A65,$B41+MATCH(1,$B41:$B58,0)+COLUMN(F$1)-2)),\"\")","v":""},{"$f":"IF(AND($B41=1,$A41<>\"\"),\nIF(MATCH(1,$B42:$B65,0)<  $B41+MATCH(1,$B41:$B58,0)+COLUMN(G$1)-2,\"\",\nINDEX($A41:$A65,$B41+MATCH(1,$B41:$B58,0)+COLUMN(G$1)-2)),\"\")","v":""},{"$f":"IF(AND($B41=1,$A41<>\"\"),\nIF(MATCH(1,$B42:$B65,0)<  $B41+MATCH(1,$B41:$B58,0)+COLUMN(H$1)-2,\"\",\nINDEX($A41:$A65,$B41+MATCH(1,$B41:$B58,0)+COLUMN(H$1)-2)),\"\")","v":""},{"$f":"IF(AND($B41=1,$A41<>\"\"),\nIF(MATCH(1,$B42:$B65,0)<  $B41+MATCH(1,$B41:$B58,0)+COLUMN(I$1)-2,\"\",\nINDEX($A41:$A65,$B41+MATCH(1,$B41:$B58,0)+COLUMN(I$1)-2)),\"\")","v":""},{"$f":"IF(AND($B41=1,$A41<>\"\"),\nIF(MATCH(1,$B42:$B65,0)<  $B41+MATCH(1,$B41:$B58,0)+COLUMN(J$1)-2,\"\",\nINDEX($A41:$A65,$B41+MATCH(1,$B41:$B58,0)+COLUMN(J$1)-2)),\"\")","v":""},{"$f":"IF(AND($B41=1,$A41<>\"\"),\nIF(MATCH(1,$B42:$B65,0)<  $B41+MATCH(1,$B41:$B58,0)+COLUMN(K$1)-2,\"\",\nINDEX($A41:$A65,$B41+MATCH(1,$B41:$B58,0)+COLUMN(K$1)-2)),\"\")","v":""},{"$f":"IF(AND($B41=1,$A41<>\"\"),\nIF(MATCH(1,$B42:$B65,0)<  $B41+MATCH(1,$B41:$B58,0)+COLUMN(L$1)-2,\"\",\nINDEX($A41:$A65,$B41+MATCH(1,$B41:$B58,0)+COLUMN(L$1)-2)),\"\")","v":""},{"$f":"IF(AND($B41=1,$A41<>\"\"),\nIF(MATCH(1,$B42:$B65,0)<  $B41+MATCH(1,$B41:$B58,0)+COLUMN(M$1)-2,\"\",\nINDEX($A41:$A65,$B41+MATCH(1,$B41:$B58,0)+COLUMN(M$1)-2)),\"\")","v":""},{"$f":"IF(AND($B41=1,$A41<>\"\"),\nIF(MATCH(1,$B42:$B65,0)<  $B41+MATCH(1,$B41:$B58,0)+COLUMN(N$1)-2,\"\",\nINDEX($A41:$A65,$B41+MATCH(1,$B41:$B58,0)+COLUMN(N$1)-2)),\"\")","v":""},{"$f":"IF(AND($B41=1,$A41<>\"\"),\nIF(MATCH(1,$B42:$B65,0)<  $B41+MATCH(1,$B41:$B58,0)+COLUMN(O$1)-2,\"\",\nINDEX($A41:$A65,$B41+MATCH(1,$B41:$B58,0)+COLUMN(O$1)-2)),\"\")","v":""}]
["9.    ОАО \"Гидропресс\"",{"$f":"IF(OR(ISNUMBER(--LEFTB(A42,SEARCH(\".\",A42,1)-1)),COUNTA(A42:$A$9123)=0),1,B41+1)","v":1},{"$f":"IF(AND($B42=1,$A42<>\"\"),\nIF(MATCH(1,$B43:$B65,0)<  $B42+MATCH(1,$B42:$B59,0)+COLUMN(A$1)-2,\"\",\nINDEX($A42:$A65,$B42+MATCH(1,$B42:$B59,0)+COLUMN(A$1)-2)),\"\")","v":"9.    ОАО \"Гидропресс\""},{"$f":"IF(AND($B42=1,$A42<>\"\"),\nIF(MATCH(1,$B43:$B65,0)<  $B42+MATCH(1,$B42:$B59,0)+COLUMN(B$1)-2,\"\",\nINDEX($A42:$A65,$B42+MATCH(1,$B42:$B59,0)+COLUMN(B$1)-2)),\"\")","v":"Генеральный директор Великий Александр Иванович "},{"$f":"IF(AND($B42=1,$A42<>\"\"),\nIF(MATCH(1,$B43:$B65,0)<  $B42+MATCH(1,$B42:$B59,0)+COLUMN(C$1)-2,\"\",\nINDEX($A42:$A65,$B42+MATCH(1,$B42:$B59,0)+COLUMN(C$1)-2)),\"\")","v":"адрес: 460003  г. Оренбург, пр.Бр. Коростелевых, 52 "},{"$f":"IF(AND($B42=1,$A42<>\"\"),\nIF(MATCH(1,$B43:$B65,0)<  $B42+MATCH(1,$B42:$B59,0)+COLUMN(D$1)-2,\"\",\nINDEX($A42:$A65,$B42+MATCH(1,$B42:$B59,0)+COLUMN(D$1)-2)),\"\")","v":"Тел. 56-85-03; факс 56-91-27,  e-mail: gidropress@gidropress-oren.ru, "},{"$f":"IF(AND($B42=1,$A42<>\"\"),\nIF(MATCH(1,$B43:$B65,0)<  $B42+MATCH(1,$B42:$B59,0)+COLUMN(E$1)-2,\"\",\nINDEX($A42:$A65,$B42+MATCH(1,$B42:$B59,0)+COLUMN(E$1)-2)),\"\")","v":"velikiy@gidropress-oren.ru, сайт: http://www.gidropress-oren.ru/"},{"$f":"IF(AND($B42=1,$A42<>\"\"),\nIF(MATCH(1,$B43:$B65,0)<  $B42+MATCH(1,$B42:$B59,0)+COLUMN(F$1)-2,\"\",\nINDEX($A42:$A65,$B42+MATCH(1,$B42:$B59,0)+COLUMN(F$1)-2)),\"\")","v":""},{"$f":"IF(AND($B42=1,$A42<>\"\"),\nIF(MATCH(1,$B43:$B65,0)<  $B42+MATCH(1,$B42:$B59,0)+COLUMN(G$1)-2,\"\",\nINDEX($A42:$A65,$B42+MATCH(1,$B42:$B59,0)+COLUMN(G$1)-2)),\"\")","v":""},{"$f":"IF(AND($B42=1,$A42<>\"\"),\nIF(MATCH(1,$B43:$B65,0)<  $B42+MATCH(1,$B42:$B59,0)+COLUMN(H$1)-2,\"\",\nINDEX($A42:$A65,$B42+MATCH(1,$B42:$B59,0)+COLUMN(H$1)-2)),\"\")","v":""},{"$f":"IF(AND($B42=1,$A42<>\"\"),\nIF(MATCH(1,$B43:$B65,0)<  $B42+MATCH(1,$B42:$B59,0)+COLUMN(I$1)-2,\"\",\nINDEX($A42:$A65,$B42+MATCH(1,$B42:$B59,0)+COLUMN(I$1)-2)),\"\")","v":""},{"$f":"IF(AND($B42=1,$A42<>\"\"),\nIF(MATCH(1,$B43:$B65,0)<  $B42+MATCH(1,$B42:$B59,0)+COLUMN(J$1)-2,\"\",\nINDEX($A42:$A65,$B42+MATCH(1,$B42:$B59,0)+COLUMN(J$1)-2)),\"\")","v":""},{"$f":"IF(AND($B42=1,$A42<>\"\"),\nIF(MATCH(1,$B43:$B65,0)<  $B42+MATCH(1,$B42:$B59,0)+COLUMN(K$1)-2,\"\",\nINDEX($A42:$A65,$B42+MATCH(1,$B42:$B59,0)+COLUMN(K$1)-2)),\"\")","v":""},{"$f":"IF(AND($B42=1,$A42<>\"\"),\nIF(MATCH(1,$B43:$B65,0)<  $B42+MATCH(1,$B42:$B59,0)+COLUMN(L$1)-2,\"\",\nINDEX($A42:$A65,$B42+MATCH(1,$B42:$B59,0)+COLUMN(L$1)-2)),\"\")","v":""},{"$f":"IF(AND($B42=1,$A42<>\"\"),\nIF(MATCH(1,$B43:$B65,0)<  $B42+MATCH(1,$B42:$B59,0)+COLUMN(M$1)-2,\"\",\nINDEX($A42:$A65,$B42+MATCH(1,$B42:$B59,0)+COLUMN(M$1)-2)),\"\")","v":""},{"$f":"IF(AND($B42=1,$A42<>\"\"),\nIF(MATCH(1,$B43:$B65,0)<  $B42+MATCH(1,$B42:$B59,0)+COLUMN(N$1)-2,\"\",\nINDEX($A42:$A65,$B42+MATCH(1,$B42:$B59,0)+COLUMN(N$1)-2)),\"\")","v":""},{"$f":"IF(AND($B42=1,$A42<>\"\"),\nIF(MATCH(1,$B43:$B65,0)<  $B42+MATCH(1,$B42:$B59,0)+COLUMN(O$1)-2,\"\",\nINDEX($A42:$A65,$B42+MATCH(1,$B42:$B59,0)+COLUMN(O$1)-2)),\"\")","v":""}]
["Генеральный директор Великий Александр Иванович ",{"$f":"IF(OR(ISNUMBER(--LEFTB(A43,SEARCH(\".\",A43,1)-1)),COUNTA(A43:$A$9123)=0),1,B42+1)","v":2},{"$f":"IF(AND($B43=1,$A43<>\"\"),\nIF(MATCH(1,$B44:$B65,0)<  $B43+MATCH(1,$B43:$B60,0)+COLUMN(A$1)-2,\"\",\nINDEX($A43:$A65,$B43+MATCH(1,$B43:$B60,0)+COLUMN(A$1)-2)),\"\")","v":""},{"$f":"IF(AND($B43=1,$A43<>\"\"),\nIF(MATCH(1,$B44:$B65,0)<  $B43+MATCH(1,$B43:$B60,0)+COLUMN(B$1)-2,\"\",\nINDEX($A43:$A65,$B43+MATCH(1,$B43:$B60,0)+COLUMN(B$1)-2)),\"\")","v":""},{"$f":"IF(AND($B43=1,$A43<>\"\"),\nIF(MATCH(1,$B44:$B65,0)<  $B43+MATCH(1,$B43:$B60,0)+COLUMN(C$1)-2,\"\",\nINDEX($A43:$A65,$B43+MATCH(1,$B43:$B60,0)+COLUMN(C$1)-2)),\"\")","v":""},{"$f":"IF(AND($B43=1,$A43<>\"\"),\nIF(MATCH(1,$B44:$B65,0)<  $B43+MATCH(1,$B43:$B60,0)+COLUMN(D$1)-2,\"\",\nINDEX($A43:$A65,$B43+MATCH(1,$B43:$B60,0)+COLUMN(D$1)-2)),\"\")","v":""},{"$f":"IF(AND($B43=1,$A43<>\"\"),\nIF(MATCH(1,$B44:$B65,0)<  $B43+MATCH(1,$B43:$B60,0)+COLUMN(E$1)-2,\"\",\nINDEX($A43:$A65,$B43+MATCH(1,$B43:$B60,0)+COLUMN(E$1)-2)),\"\")","v":""},{"$f":"IF(AND($B43=1,$A43<>\"\"),\nIF(MATCH(1,$B44:$B65,0)<  $B43+MATCH(1,$B43:$B60,0)+COLUMN(F$1)-2,\"\",\nINDEX($A43:$A65,$B43+MATCH(1,$B43:$B60,0)+COLUMN(F$1)-2)),\"\")","v":""},{"$f":"IF(AND($B43=1,$A43<>\"\"),\nIF(MATCH(1,$B44:$B65,0)<  $B43+MATCH(1,$B43:$B60,0)+COLUMN(G$1)-2,\"\",\nINDEX($A43:$A65,$B43+MATCH(1,$B43:$B60,0)+COLUMN(G$1)-2)),\"\")","v":""},{"$f":"IF(AND($B43=1,$A43<>\"\"),\nIF(MATCH(1,$B44:$B65,0)<  $B43+MATCH(1,$B43:$B60,0)+COLUMN(H$1)-2,\"\",\nINDEX($A43:$A65,$B43+MATCH(1,$B43:$B60,0)+COLUMN(H$1)-2)),\"\")","v":""},{"$f":"IF(AND($B43=1,$A43<>\"\"),\nIF(MATCH(1,$B44:$B65,0)<  $B43+MATCH(1,$B43:$B60,0)+COLUMN(I$1)-2,\"\",\nINDEX($A43:$A65,$B43+MATCH(1,$B43:$B60,0)+COLUMN(I$1)-2)),\"\")","v":""},{"$f":"IF(AND($B43=1,$A43<>\"\"),\nIF(MATCH(1,$B44:$B65,0)<  $B43+MATCH(1,$B43:$B60,0)+COLUMN(J$1)-2,\"\",\nINDEX($A43:$A65,$B43+MATCH(1,$B43:$B60,0)+COLUMN(J$1)-2)),\"\")","v":""},{"$f":"IF(AND($B43=1,$A43<>\"\"),\nIF(MATCH(1,$B44:$B65,0)<  $B43+MATCH(1,$B43:$B60,0)+COLUMN(K$1)-2,\"\",\nINDEX($A43:$A65,$B43+MATCH(1,$B43:$B60,0)+COLUMN(K$1)-2)),\"\")","v":""},{"$f":"IF(AND($B43=1,$A43<>\"\"),\nIF(MATCH(1,$B44:$B65,0)<  $B43+MATCH(1,$B43:$B60,0)+COLUMN(L$1)-2,\"\",\nINDEX($A43:$A65,$B43+MATCH(1,$B43:$B60,0)+COLUMN(L$1)-2)),\"\")","v":""},{"$f":"IF(AND($B43=1,$A43<>\"\"),\nIF(MATCH(1,$B44:$B65,0)<  $B43+MATCH(1,$B43:$B60,0)+COLUMN(M$1)-2,\"\",\nINDEX($A43:$A65,$B43+MATCH(1,$B43:$B60,0)+COLUMN(M$1)-2)),\"\")","v":""},{"$f":"IF(AND($B43=1,$A43<>\"\"),\nIF(MATCH(1,$B44:$B65,0)<  $B43+MATCH(1,$B43:$B60,0)+COLUMN(N$1)-2,\"\",\nINDEX($A43:$A65,$B43+MATCH(1,$B43:$B60,0)+COLUMN(N$1)-2)),\"\")","v":""},{"$f":"IF(AND($B43=1,$A43<>\"\"),\nIF(MATCH(1,$B44:$B65,0)<  $B43+MATCH(1,$B43:$B60,0)+COLUMN(O$1)-2,\"\",\nINDEX($A43:$A65,$B43+MATCH(1,$B43:$B60,0)+COLUMN(O$1)-2)),\"\")","v":""}]
["адрес: 460003  г. Оренбург, пр.Бр. Коростелевых, 52 ",{"$f":"IF(OR(ISNUMBER(--LEFTB(A44,SEARCH(\".\",A44,1)-1)),COUNTA(A44:$A$9123)=0),1,B43+1)","v":3},{"$f":"IF(AND($B44=1,$A44<>\"\"),\nIF(MATCH(1,$B45:$B65,0)<  $B44+MATCH(1,$B44:$B61,0)+COLUMN(A$1)-2,\"\",\nINDEX($A44:$A65,$B44+MATCH(1,$B44:$B61,0)+COLUMN(A$1)-2)),\"\")","v":""},{"$f":"IF(AND($B44=1,$A44<>\"\"),\nIF(MATCH(1,$B45:$B65,0)<  $B44+MATCH(1,$B44:$B61,0)+COLUMN(B$1)-2,\"\",\nINDEX($A44:$A65,$B44+MATCH(1,$B44:$B61,0)+COLUMN(B$1)-2)),\"\")","v":""},{"$f":"IF(AND($B44=1,$A44<>\"\"),\nIF(MATCH(1,$B45:$B65,0)<  $B44+MATCH(1,$B44:$B61,0)+COLUMN(C$1)-2,\"\",\nINDEX($A44:$A65,$B44+MATCH(1,$B44:$B61,0)+COLUMN(C$1)-2)),\"\")","v":""},{"$f":"IF(AND($B44=1,$A44<>\"\"),\nIF(MATCH(1,$B45:$B65,0)<  $B44+MATCH(1,$B44:$B61,0)+COLUMN(D$1)-2,\"\",\nINDEX($A44:$A65,$B44+MATCH(1,$B44:$B61,0)+COLUMN(D$1)-2)),\"\")","v":""},{"$f":"IF(AND($B44=1,$A44<>\"\"),\nIF(MATCH(1,$B45:$B65,0)<  $B44+MATCH(1,$B44:$B61,0)+COLUMN(E$1)-2,\"\",\nINDEX($A44:$A65,$B44+MATCH(1,$B44:$B61,0)+COLUMN(E$1)-2)),\"\")","v":""},{"$f":"IF(AND($B44=1,$A44<>\"\"),\nIF(MATCH(1,$B45:$B65,0)<  $B44+MATCH(1,$B44:$B61,0)+COLUMN(F$1)-2,\"\",\nINDEX($A44:$A65,$B44+MATCH(1,$B44:$B61,0)+COLUMN(F$1)-2)),\"\")","v":""},{"$f":"IF(AND($B44=1,$A44<>\"\"),\nIF(MATCH(1,$B45:$B65,0)<  $B44+MATCH(1,$B44:$B61,0)+COLUMN(G$1)-2,\"\",\nINDEX($A44:$A65,$B44+MATCH(1,$B44:$B61,0)+COLUMN(G$1)-2)),\"\")","v":""},{"$f":"IF(AND($B44=1,$A44<>\"\"),\nIF(MATCH(1,$B45:$B65,0)<  $B44+MATCH(1,$B44:$B61,0)+COLUMN(H$1)-2,\"\",\nINDEX($A44:$A65,$B44+MATCH(1,$B44:$B61,0)+COLUMN(H$1)-2)),\"\")","v":""},{"$f":"IF(AND($B44=1,$A44<>\"\"),\nIF(MATCH(1,$B45:$B65,0)<  $B44+MATCH(1,$B44:$B61,0)+COLUMN(I$1)-2,\"\",\nINDEX($A44:$A65,$B44+MATCH(1,$B44:$B61,0)+COLUMN(I$1)-2)),\"\")","v":""},{"$f":"IF(AND($B44=1,$A44<>\"\"),\nIF(MATCH(1,$B45:$B65,0)<  $B44+MATCH(1,$B44:$B61,0)+COLUMN(J$1)-2,\"\",\nINDEX($A44:$A65,$B44+MATCH(1,$B44:$B61,0)+COLUMN(J$1)-2)),\"\")","v":""},{"$f":"IF(AND($B44=1,$A44<>\"\"),\nIF(MATCH(1,$B45:$B65,0)<  $B44+MATCH(1,$B44:$B61,0)+COLUMN(K$1)-2,\"\",\nINDEX($A44:$A65,$B44+MATCH(1,$B44:$B61,0)+COLUMN(K$1)-2)),\"\")","v":""},{"$f":"IF(AND($B44=1,$A44<>\"\"),\nIF(MATCH(1,$B45:$B65,0)<  $B44+MATCH(1,$B44:$B61,0)+COLUMN(L$1)-2,\"\",\nINDEX($A44:$A65,$B44+MATCH(1,$B44:$B61,0)+COLUMN(L$1)-2)),\"\")","v":""},{"$f":"IF(AND($B44=1,$A44<>\"\"),\nIF(MATCH(1,$B45:$B65,0)<  $B44+MATCH(1,$B44:$B61,0)+COLUMN(M$1)-2,\"\",\nINDEX($A44:$A65,$B44+MATCH(1,$B44:$B61,0)+COLUMN(M$1)-2)),\"\")","v":""},{"$f":"IF(AND($B44=1,$A44<>\"\"),\nIF(MATCH(1,$B45:$B65,0)<  $B44+MATCH(1,$B44:$B61,0)+COLUMN(N$1)-2,\"\",\nINDEX($A44:$A65,$B44+MATCH(1,$B44:$B61,0)+COLUMN(N$1)-2)),\"\")","v":""},{"$f":"IF(AND($B44=1,$A44<>\"\"),\nIF(MATCH(1,$B45:$B65,0)<  $B44+MATCH(1,$B44:$B61,0)+COLUMN(O$1)-2,\"\",\nINDEX($A44:$A65,$B44+MATCH(1,$B44:$B61,0)+COLUMN(O$1)-2)),\"\")","v":""}]
["Тел. 56-85-03; факс 56-91-27,  e-mail: gidropress@gidropress-oren.ru, ",{"$f":"IF(OR(ISNUMBER(--LEFTB(A45,SEARCH(\".\",A45,1)-1)),COUNTA(A45:$A$9123)=0),1,B44+1)","v":4},{"$f":"IF(AND($B45=1,$A45<>\"\"),\nIF(MATCH(1,$B46:$B65,0)<  $B45+MATCH(1,$B45:$B62,0)+COLUMN(A$1)-2,\"\",\nINDEX($A45:$A65,$B45+MATCH(1,$B45:$B62,0)+COLUMN(A$1)-2)),\"\")","v":""},{"$f":"IF(AND($B45=1,$A45<>\"\"),\nIF(MATCH(1,$B46:$B65,0)<  $B45+MATCH(1,$B45:$B62,0)+COLUMN(B$1)-2,\"\",\nINDEX($A45:$A65,$B45+MATCH(1,$B45:$B62,0)+COLUMN(B$1)-2)),\"\")","v":""},{"$f":"IF(AND($B45=1,$A45<>\"\"),\nIF(MATCH(1,$B46:$B65,0)<  $B45+MATCH(1,$B45:$B62,0)+COLUMN(C$1)-2,\"\",\nINDEX($A45:$A65,$B45+MATCH(1,$B45:$B62,0)+COLUMN(C$1)-2)),\"\")","v":""},{"$f":"IF(AND($B45=1,$A45<>\"\"),\nIF(MATCH(1,$B46:$B65,0)<  $B45+MATCH(1,$B45:$B62,0)+COLUMN(D$1)-2,\"\",\nINDEX($A45:$A65,$B45+MATCH(1,$B45:$B62,0)+COLUMN(D$1)-2)),\"\")","v":""},{"$f":"IF(AND($B45=1,$A45<>\"\"),\nIF(MATCH(1,$B46:$B65,0)<  $B45+MATCH(1,$B45:$B62,0)+COLUMN(E$1)-2,\"\",\nINDEX($A45:$A65,$B45+MATCH(1,$B45:$B62,0)+COLUMN(E$1)-2)),\"\")","v":""},{"$f":"IF(AND($B45=1,$A45<>\"\"),\nIF(MATCH(1,$B46:$B65,0)<  $B45+MATCH(1,$B45:$B62,0)+COLUMN(F$1)-2,\"\",\nINDEX($A45:$A65,$B45+MATCH(1,$B45:$B62,0)+COLUMN(F$1)-2)),\"\")","v":""},{"$f":"IF(AND($B45=1,$A45<>\"\"),\nIF(MATCH(1,$B46:$B65,0)<  $B45+MATCH(1,$B45:$B62,0)+COLUMN(G$1)-2,\"\",\nINDEX($A45:$A65,$B45+MATCH(1,$B45:$B62,0)+COLUMN(G$1)-2)),\"\")","v":""},{"$f":"IF(AND($B45=1,$A45<>\"\"),\nIF(MATCH(1,$B46:$B65,0)<  $B45+MATCH(1,$B45:$B62,0)+COLUMN(H$1)-2,\"\",\nINDEX($A45:$A65,$B45+MATCH(1,$B45:$B62,0)+COLUMN(H$1)-2)),\"\")","v":""},{"$f":"IF(AND($B45=1,$A45<>\"\"),\nIF(MATCH(1,$B46:$B65,0)<  $B45+MATCH(1,$B45:$B62,0)+COLUMN(I$1)-2,\"\",\nINDEX($A45:$A65,$B45+MATCH(1,$B45:$B62,0)+COLUMN(I$1)-2)),\"\")","v":""},{"$f":"IF(AND($B45=1,$A45<>\"\"),\nIF(MATCH(1,$B46:$B65,0)<  $B45+MATCH(1,$B45:$B62,0)+COLUMN(J$1)-2,\"\",\nINDEX($A45:$A65,$B45+MATCH(1,$B45:$B62,0)+COLUMN(J$1)-2)),\"\")","v":""},{"$f":"IF(AND($B45=1,$A45<>\"\"),\nIF(MATCH(1,$B46:$B65,0)<  $B45+MATCH(1,$B45:$B62,0)+COLUMN(K$1)-2,\"\",\nINDEX($A45:$A65,$B45+MATCH(1,$B45:$B62,0)+COLUMN(K$1)-2)),\"\")","v":""},{"$f":"IF(AND($B45=1,$A45<>\"\"),\nIF(MATCH(1,$B46:$B65,0)<  $B45+MATCH(1,$B45:$B62,0)+COLUMN(L$1)-2,\"\",\nINDEX($A45:$A65,$B45+MATCH(1,$B45:$B62,0)+COLUMN(L$1)-2)),\"\")","v":""},{"$f":"IF(AND($B45=1,$A45<>\"\"),\nIF(MATCH(1,$B46:$B65,0)<  $B45+MATCH(1,$B45:$B62,0)+COLUMN(M$1)-2,\"\",\nINDEX($A45:$A65,$B45+MATCH(1,$B45:$B62,0)+COLUMN(M$1)-2)),\"\")","v":""},{"$f":"IF(AND($B45=1,$A45<>\"\"),\nIF(MATCH(1,$B46:$B65,0)<  $B45+MATCH(1,$B45:$B62,0)+COLUMN(N$1)-2,\"\",\nINDEX($A45:$A65,$B45+MATCH(1,$B45:$B62,0)+COLUMN(N$1)-2)),\"\")","v":""},{"$f":"IF(AND($B45=1,$A45<>\"\"),\nIF(MATCH(1,$B46:$B65,0)<  $B45+MATCH(1,$B45:$B62,0)+COLUMN(O$1)-2,\"\",\nINDEX($A45:$A65,$B45+MATCH(1,$B45:$B62,0)+COLUMN(O$1)-2)),\"\")","v":""}]
["velikiy@gidropress-oren.ru, сайт: http://www.gidropress-oren.ru/",{"$f":"IF(OR(ISNUMBER(--LEFTB(A46,SEARCH(\".\",A46,1)-1)),COUNTA(A46:$A$9123)=0),1,B45+1)","v":5},{"$f":"IF(AND($B46=1,$A46<>\"\"),\nIF(MATCH(1,$B47:$B65,0)<  $B46+MATCH(1,$B46:$B63,0)+COLUMN(A$1)-2,\"\",\nINDEX($A46:$A65,$B46+MATCH(1,$B46:$B63,0)+COLUMN(A$1)-2)),\"\")","v":""},{"$f":"IF(AND($B46=1,$A46<>\"\"),\nIF(MATCH(1,$B47:$B65,0)<  $B46+MATCH(1,$B46:$B63,0)+COLUMN(B$1)-2,\"\",\nINDEX($A46:$A65,$B46+MATCH(1,$B46:$B63,0)+COLUMN(B$1)-2)),\"\")","v":""},{"$f":"IF(AND($B46=1,$A46<>\"\"),\nIF(MATCH(1,$B47:$B65,0)<  $B46+MATCH(1,$B46:$B63,0)+COLUMN(C$1)-2,\"\",\nINDEX($A46:$A65,$B46+MATCH(1,$B46:$B63,0)+COLUMN(C$1)-2)),\"\")","v":""},{"$f":"IF(AND($B46=1,$A46<>\"\"),\nIF(MATCH(1,$B47:$B65,0)<  $B46+MATCH(1,$B46:$B63,0)+COLUMN(D$1)-2,\"\",\nINDEX($A46:$A65,$B46+MATCH(1,$B46:$B63,0)+COLUMN(D$1)-2)),\"\")","v":""},{"$f":"IF(AND($B46=1,$A46<>\"\"),\nIF(MATCH(1,$B47:$B65,0)<  $B46+MATCH(1,$B46:$B63,0)+COLUMN(E$1)-2,\"\",\nINDEX($A46:$A65,$B46+MATCH(1,$B46:$B63,0)+COLUMN(E$1)-2)),\"\")","v":""},{"$f":"IF(AND($B46=1,$A46<>\"\"),\nIF(MATCH(1,$B47:$B65,0)<  $B46+MATCH(1,$B46:$B63,0)+COLUMN(F$1)-2,\"\",\nINDEX($A46:$A65,$B46+MATCH(1,$B46:$B63,0)+COLUMN(F$1)-2)),\"\")","v":""},{"$f":"IF(AND($B46=1,$A46<>\"\"),\nIF(MATCH(1,$B47:$B65,0)<  $B46+MATCH(1,$B46:$B63,0)+COLUMN(G$1)-2,\"\",\nINDEX($A46:$A65,$B46+MATCH(1,$B46:$B63,0)+COLUMN(G$1)-2)),\"\")","v":""},{"$f":"IF(AND($B46=1,$A46<>\"\"),\nIF(MATCH(1,$B47:$B65,0)<  $B46+MATCH(1,$B46:$B63,0)+COLUMN(H$1)-2,\"\",\nINDEX($A46:$A65,$B46+MATCH(1,$B46:$B63,0)+COLUMN(H$1)-2)),\"\")","v":""},{"$f":"IF(AND($B46=1,$A46<>\"\"),\nIF(MATCH(1,$B47:$B65,0)<  $B46+MATCH(1,$B46:$B63,0)+COLUMN(I$1)-2,\"\",\nINDEX($A46:$A65,$B46+MATCH(1,$B46:$B63,0)+COLUMN(I$1)-2)),\"\")","v":""},{"$f":"IF(AND($B46=1,$A46<>\"\"),\nIF(MATCH(1,$B47:$B65,0)<  $B46+MATCH(1,$B46:$B63,0)+COLUMN(J$1)-2,\"\",\nINDEX($A46:$A65,$B46+MATCH(1,$B46:$B63,0)+COLUMN(J$1)-2)),\"\")","v":""},{"$f":"IF(AND($B46=1,$A46<>\"\"),\nIF(MATCH(1,$B47:$B65,0)<  $B46+MATCH(1,$B46:$B63,0)+COLUMN(K$1)-2,\"\",\nINDEX($A46:$A65,$B46+MATCH(1,$B46:$B63,0)+COLUMN(K$1)-2)),\"\")","v":""},{"$f":"IF(AND($B46=1,$A46<>\"\"),\nIF(MATCH(1,$B47:$B65,0)<  $B46+MATCH(1,$B46:$B63,0)+COLUMN(L$1)-2,\"\",\nINDEX($A46:$A65,$B46+MATCH(1,$B46:$B63,0)+COLUMN(L$1)-2)),\"\")","v":""},{"$f":"IF(AND($B46=1,$A46<>\"\"),\nIF(MATCH(1,$B47:$B65,0)<  $B46+MATCH(1,$B46:$B63,0)+COLUMN(M$1)-2,\"\",\nINDEX($A46:$A65,$B46+MATCH(1,$B46:$B63,0)+COLUMN(M$1)-2)),\"\")","v":""},{"$f":"IF(AND($B46=1,$A46<>\"\"),\nIF(MATCH(1,$B47:$B65,0)<  $B46+MATCH(1,$B46:$B63,0)+COLUMN(N$1)-2,\"\",\nINDEX($A46:$A65,$B46+MATCH(1,$B46:$B63,0)+COLUMN(N$1)-2)),\"\")","v":""},{"$f":"IF(AND($B46=1,$A46<>\"\"),\nIF(MATCH(1,$B47:$B65,0)<  $B46+MATCH(1,$B46:$B63,0)+COLUMN(O$1)-2,\"\",\nINDEX($A46:$A65,$B46+MATCH(1,$B46:$B63,0)+COLUMN(O$1)-2)),\"\")","v":""}]
["11. ООО «Национальная водная компания»",{"$f":"IF(OR(ISNUMBER(--LEFTB(A47,SEARCH(\".\",A47,1)-1)),COUNTA(A47:$A$9123)=0),1,B46+1)","v":1},{"$f":"IF(AND($B47=1,$A47<>\"\"),\nIF(MATCH(1,$B48:$B65,0)<  $B47+MATCH(1,$B47:$B64,0)+COLUMN(A$1)-2,\"\",\nINDEX($A47:$A65,$B47+MATCH(1,$B47:$B64,0)+COLUMN(A$1)-2)),\"\")","v":"11. ООО «Национальная водная компания»"},{"$f":"IF(AND($B47=1,$A47<>\"\"),\nIF(MATCH(1,$B48:$B65,0)<  $B47+MATCH(1,$B47:$B64,0)+COLUMN(B$1)-2,\"\",\nINDEX($A47:$A65,$B47+MATCH(1,$B47:$B64,0)+COLUMN(B$1)-2)),\"\")","v":"Председатель совета директоров, генеральный директор "},{"$f":"IF(AND($B47=1,$A47<>\"\"),\nIF(MATCH(1,$B48:$B65,0)<  $B47+MATCH(1,$B47:$B64,0)+COLUMN(C$1)-2,\"\",\nINDEX($A47:$A65,$B47+MATCH(1,$B47:$B64,0)+COLUMN(C$1)-2)),\"\")","v":"Берлин Эдуард Михайлович "},{"$f":"IF(AND($B47=1,$A47<>\"\"),\nIF(MATCH(1,$B48:$B65,0)<  $B47+MATCH(1,$B47:$B64,0)+COLUMN(D$1)-2,\"\",\nINDEX($A47:$A65,$B47+MATCH(1,$B47:$B64,0)+COLUMN(D$1)-2)),\"\")","v":"Первый заместитель Чикомасова Марина Александровна"},{"$f":"IF(AND($B47=1,$A47<>\"\"),\nIF(MATCH(1,$B48:$B65,0)<  $B47+MATCH(1,$B47:$B64,0)+COLUMN(E$1)-2,\"\",\nINDEX($A47:$A65,$B47+MATCH(1,$B47:$B64,0)+COLUMN(E$1)-2)),\"\")","v":"адрес: 460055 г. Оренбург, ул.Нахимова, 35 "},{"$f":"IF(AND($B47=1,$A47<>\"\"),\nIF(MATCH(1,$B48:$B65,0)<  $B47+MATCH(1,$B47:$B64,0)+COLUMN(F$1)-2,\"\",\nINDEX($A47:$A65,$B47+MATCH(1,$B47:$B64,0)+COLUMN(F$1)-2)),\"\")","v":"Тел. 76-23-81; 76-53-88, 76-45-38"},{"$f":"IF(AND($B47=1,$A47<>\"\"),\nIF(MATCH(1,$B48:$B65,0)<  $B47+MATCH(1,$B47:$B64,0)+COLUMN(G$1)-2,\"\",\nINDEX($A47:$A65,$B47+MATCH(1,$B47:$B64,0)+COLUMN(G$1)-2)),\"\")","v":" e-mail: info@aqua-life.ru; www.aqua-life.ru"},{"$f":"IF(AND($B47=1,$A47<>\"\"),\nIF(MATCH(1,$B48:$B65,0)<  $B47+MATCH(1,$B47:$B64,0)+COLUMN(H$1)-2,\"\",\nINDEX($A47:$A65,$B47+MATCH(1,$B47:$B64,0)+COLUMN(H$1)-2)),\"\")","v":""},{"$f":"IF(AND($B47=1,$A47<>\"\"),\nIF(MATCH(1,$B48:$B65,0)<  $B47+MATCH(1,$B47:$B64,0)+COLUMN(I$1)-2,\"\",\nINDEX($A47:$A65,$B47+MATCH(1,$B47:$B64,0)+COLUMN(I$1)-2)),\"\")","v":""},{"$f":"IF(AND($B47=1,$A47<>\"\"),\nIF(MATCH(1,$B48:$B65,0)<  $B47+MATCH(1,$B47:$B64,0)+COLUMN(J$1)-2,\"\",\nINDEX($A47:$A65,$B47+MATCH(1,$B47:$B64,0)+COLUMN(J$1)-2)),\"\")","v":""},{"$f":"IF(AND($B47=1,$A47<>\"\"),\nIF(MATCH(1,$B48:$B65,0)<  $B47+MATCH(1,$B47:$B64,0)+COLUMN(K$1)-2,\"\",\nINDEX($A47:$A65,$B47+MATCH(1,$B47:$B64,0)+COLUMN(K$1)-2)),\"\")","v":""},{"$f":"IF(AND($B47=1,$A47<>\"\"),\nIF(MATCH(1,$B48:$B65,0)<  $B47+MATCH(1,$B47:$B64,0)+COLUMN(L$1)-2,\"\",\nINDEX($A47:$A65,$B47+MATCH(1,$B47:$B64,0)+COLUMN(L$1)-2)),\"\")","v":""},{"$f":"IF(AND($B47=1,$A47<>\"\"),\nIF(MATCH(1,$B48:$B65,0)<  $B47+MATCH(1,$B47:$B64,0)+COLUMN(M$1)-2,\"\",\nINDEX($A47:$A65,$B47+MATCH(1,$B47:$B64,0)+COLUMN(M$1)-2)),\"\")","v":""},{"$f":"IF(AND($B47=1,$A47<>\"\"),\nIF(MATCH(1,$B48:$B65,0)<  $B47+MATCH(1,$B47:$B64,0)+COLUMN(N$1)-2,\"\",\nINDEX($A47:$A65,$B47+MATCH(1,$B47:$B64,0)+COLUMN(N$1)-2)),\"\")","v":""},{"$f":"IF(AND($B47=1,$A47<>\"\"),\nIF(MATCH(1,$B48:$B65,0)<  $B47+MATCH(1,$B47:$B64,0)+COLUMN(O$1)-2,\"\",\nINDEX($A47:$A65,$B47+MATCH(1,$B47:$B64,0)+COLUMN(O$1)-2)),\"\")","v":""}]
["Председатель совета директоров, генеральный директор ",{"$f":"IF(OR(ISNUMBER(--LEFTB(A48,SEARCH(\".\",A48,1)-1)),COUNTA(A48:$A$9123)=0),1,B47+1)","v":2},{"$f":"IF(AND($B48=1,$A48<>\"\"),\nIF(MATCH(1,$B49:$B65,0)<  $B48+MATCH(1,$B48:$B65,0)+COLUMN(A$1)-2,\"\",\nINDEX($A48:$A65,$B48+MATCH(1,$B48:$B65,0)+COLUMN(A$1)-2)),\"\")","v":""},{"$f":"IF(AND($B48=1,$A48<>\"\"),\nIF(MATCH(1,$B49:$B65,0)<  $B48+MATCH(1,$B48:$B65,0)+COLUMN(B$1)-2,\"\",\nINDEX($A48:$A65,$B48+MATCH(1,$B48:$B65,0)+COLUMN(B$1)-2)),\"\")","v":""},{"$f":"IF(AND($B48=1,$A48<>\"\"),\nIF(MATCH(1,$B49:$B65,0)<  $B48+MATCH(1,$B48:$B65,0)+COLUMN(C$1)-2,\"\",\nINDEX($A48:$A65,$B48+MATCH(1,$B48:$B65,0)+COLUMN(C$1)-2)),\"\")","v":""},{"$f":"IF(AND($B48=1,$A48<>\"\"),\nIF(MATCH(1,$B49:$B65,0)<  $B48+MATCH(1,$B48:$B65,0)+COLUMN(D$1)-2,\"\",\nINDEX($A48:$A65,$B48+MATCH(1,$B48:$B65,0)+COLUMN(D$1)-2)),\"\")","v":""},{"$f":"IF(AND($B48=1,$A48<>\"\"),\nIF(MATCH(1,$B49:$B65,0)<  $B48+MATCH(1,$B48:$B65,0)+COLUMN(E$1)-2,\"\",\nINDEX($A48:$A65,$B48+MATCH(1,$B48:$B65,0)+COLUMN(E$1)-2)),\"\")","v":""},{"$f":"IF(AND($B48=1,$A48<>\"\"),\nIF(MATCH(1,$B49:$B65,0)<  $B48+MATCH(1,$B48:$B65,0)+COLUMN(F$1)-2,\"\",\nINDEX($A48:$A65,$B48+MATCH(1,$B48:$B65,0)+COLUMN(F$1)-2)),\"\")","v":""},{"$f":"IF(AND($B48=1,$A48<>\"\"),\nIF(MATCH(1,$B49:$B65,0)<  $B48+MATCH(1,$B48:$B65,0)+COLUMN(G$1)-2,\"\",\nINDEX($A48:$A65,$B48+MATCH(1,$B48:$B65,0)+COLUMN(G$1)-2)),\"\")","v":""},{"$f":"IF(AND($B48=1,$A48<>\"\"),\nIF(MATCH(1,$B49:$B65,0)<  $B48+MATCH(1,$B48:$B65,0)+COLUMN(H$1)-2,\"\",\nINDEX($A48:$A65,$B48+MATCH(1,$B48:$B65,0)+COLUMN(H$1)-2)),\"\")","v":""},{"$f":"IF(AND($B48=1,$A48<>\"\"),\nIF(MATCH(1,$B49:$B65,0)<  $B48+MATCH(1,$B48:$B65,0)+COLUMN(I$1)-2,\"\",\nINDEX($A48:$A65,$B48+MATCH(1,$B48:$B65,0)+COLUMN(I$1)-2)),\"\")","v":""},{"$f":"IF(AND($B48=1,$A48<>\"\"),\nIF(MATCH(1,$B49:$B65,0)<  $B48+MATCH(1,$B48:$B65,0)+COLUMN(J$1)-2,\"\",\nINDEX($A48:$A65,$B48+MATCH(1,$B48:$B65,0)+COLUMN(J$1)-2)),\"\")","v":""},{"$f":"IF(AND($B48=1,$A48<>\"\"),\nIF(MATCH(1,$B49:$B65,0)<  $B48+MATCH(1,$B48:$B65,0)+COLUMN(K$1)-2,\"\",\nINDEX($A48:$A65,$B48+MATCH(1,$B48:$B65,0)+COLUMN(K$1)-2)),\"\")","v":""},{"$f":"IF(AND($B48=1,$A48<>\"\"),\nIF(MATCH(1,$B49:$B65,0)<  $B48+MATCH(1,$B48:$B65,0)+COLUMN(L$1)-2,\"\",\nINDEX($A48:$A65,$B48+MATCH(1,$B48:$B65,0)+COLUMN(L$1)-2)),\"\")","v":""},{"$f":"IF(AND($B48=1,$A48<>\"\"),\nIF(MATCH(1,$B49:$B65,0)<  $B48+MATCH(1,$B48:$B65,0)+COLUMN(M$1)-2,\"\",\nINDEX($A48:$A65,$B48+MATCH(1,$B48:$B65,0)+COLUMN(M$1)-2)),\"\")","v":""},{"$f":"IF(AND($B48=1,$A48<>\"\"),\nIF(MATCH(1,$B49:$B65,0)<  $B48+MATCH(1,$B48:$B65,0)+COLUMN(N$1)-2,\"\",\nINDEX($A48:$A65,$B48+MATCH(1,$B48:$B65,0)+COLUMN(N$1)-2)),\"\")","v":""},{"$f":"IF(AND($B48=1,$A48<>\"\"),\nIF(MATCH(1,$B49:$B65,0)<  $B48+MATCH(1,$B48:$B65,0)+COLUMN(O$1)-2,\"\",\nINDEX($A48:$A65,$B48+MATCH(1,$B48:$B65,0)+COLUMN(O$1)-2)),\"\")","v":""}]
["Берлин Эдуард Михайлович ",{"$f":"IF(OR(ISNUMBER(--LEFTB(A49,SEARCH(\".\",A49,1)-1)),COUNTA(A49:$A$9123)=0),1,B48+1)","v":3},{"$f":"IF(AND($B49=1,$A49<>\"\"),\nIF(MATCH(1,$B50:$B65,0)<  $B49+MATCH(1,$B49:$B65,0)+COLUMN(A$1)-2,\"\",\nINDEX($A49:$A65,$B49+MATCH(1,$B49:$B65,0)+COLUMN(A$1)-2)),\"\")","v":""},{"$f":"IF(AND($B49=1,$A49<>\"\"),\nIF(MATCH(1,$B50:$B65,0)<  $B49+MATCH(1,$B49:$B65,0)+COLUMN(B$1)-2,\"\",\nINDEX($A49:$A65,$B49+MATCH(1,$B49:$B65,0)+COLUMN(B$1)-2)),\"\")","v":""},{"$f":"IF(AND($B49=1,$A49<>\"\"),\nIF(MATCH(1,$B50:$B65,0)<  $B49+MATCH(1,$B49:$B65,0)+COLUMN(C$1)-2,\"\",\nINDEX($A49:$A65,$B49+MATCH(1,$B49:$B65,0)+COLUMN(C$1)-2)),\"\")","v":""},{"$f":"IF(AND($B49=1,$A49<>\"\"),\nIF(MATCH(1,$B50:$B65,0)<  $B49+MATCH(1,$B49:$B65,0)+COLUMN(D$1)-2,\"\",\nINDEX($A49:$A65,$B49+MATCH(1,$B49:$B65,0)+COLUMN(D$1)-2)),\"\")","v":""},{"$f":"IF(AND($B49=1,$A49<>\"\"),\nIF(MATCH(1,$B50:$B65,0)<  $B49+MATCH(1,$B49:$B65,0)+COLUMN(E$1)-2,\"\",\nINDEX($A49:$A65,$B49+MATCH(1,$B49:$B65,0)+COLUMN(E$1)-2)),\"\")","v":""},{"$f":"IF(AND($B49=1,$A49<>\"\"),\nIF(MATCH(1,$B50:$B65,0)<  $B49+MATCH(1,$B49:$B65,0)+COLUMN(F$1)-2,\"\",\nINDEX($A49:$A65,$B49+MATCH(1,$B49:$B65,0)+COLUMN(F$1)-2)),\"\")","v":""},{"$f":"IF(AND($B49=1,$A49<>\"\"),\nIF(MATCH(1,$B50:$B65,0)<  $B49+MATCH(1,$B49:$B65,0)+COLUMN(G$1)-2,\"\",\nINDEX($A49:$A65,$B49+MATCH(1,$B49:$B65,0)+COLUMN(G$1)-2)),\"\")","v":""},{"$f":"IF(AND($B49=1,$A49<>\"\"),\nIF(MATCH(1,$B50:$B65,0)<  $B49+MATCH(1,$B49:$B65,0)+COLUMN(H$1)-2,\"\",\nINDEX($A49:$A65,$B49+MATCH(1,$B49:$B65,0)+COLUMN(H$1)-2)),\"\")","v":""},{"$f":"IF(AND($B49=1,$A49<>\"\"),\nIF(MATCH(1,$B50:$B65,0)<  $B49+MATCH(1,$B49:$B65,0)+COLUMN(I$1)-2,\"\",\nINDEX($A49:$A65,$B49+MATCH(1,$B49:$B65,0)+COLUMN(I$1)-2)),\"\")","v":""},{"$f":"IF(AND($B49=1,$A49<>\"\"),\nIF(MATCH(1,$B50:$B65,0)<  $B49+MATCH(1,$B49:$B65,0)+COLUMN(J$1)-2,\"\",\nINDEX($A49:$A65,$B49+MATCH(1,$B49:$B65,0)+COLUMN(J$1)-2)),\"\")","v":""},{"$f":"IF(AND($B49=1,$A49<>\"\"),\nIF(MATCH(1,$B50:$B65,0)<  $B49+MATCH(1,$B49:$B65,0)+COLUMN(K$1)-2,\"\",\nINDEX($A49:$A65,$B49+MATCH(1,$B49:$B65,0)+COLUMN(K$1)-2)),\"\")","v":""},{"$f":"IF(AND($B49=1,$A49<>\"\"),\nIF(MATCH(1,$B50:$B65,0)<  $B49+MATCH(1,$B49:$B65,0)+COLUMN(L$1)-2,\"\",\nINDEX($A49:$A65,$B49+MATCH(1,$B49:$B65,0)+COLUMN(L$1)-2)),\"\")","v":""},{"$f":"IF(AND($B49=1,$A49<>\"\"),\nIF(MATCH(1,$B50:$B65,0)<  $B49+MATCH(1,$B49:$B65,0)+COLUMN(M$1)-2,\"\",\nINDEX($A49:$A65,$B49+MATCH(1,$B49:$B65,0)+COLUMN(M$1)-2)),\"\")","v":""},{"$f":"IF(AND($B49=1,$A49<>\"\"),\nIF(MATCH(1,$B50:$B65,0)<  $B49+MATCH(1,$B49:$B65,0)+COLUMN(N$1)-2,\"\",\nINDEX($A49:$A65,$B49+MATCH(1,$B49:$B65,0)+COLUMN(N$1)-2)),\"\")","v":""},{"$f":"IF(AND($B49=1,$A49<>\"\"),\nIF(MATCH(1,$B50:$B65,0)<  $B49+MATCH(1,$B49:$B65,0)+COLUMN(O$1)-2,\"\",\nINDEX($A49:$A65,$B49+MATCH(1,$B49:$B65,0)+COLUMN(O$1)-2)),\"\")","v":""}]
["Первый заместитель Чикомасова Марина Александровна",{"$f":"IF(OR(ISNUMBER(--LEFTB(A50,SEARCH(\".\",A50,1)-1)),COUNTA(A50:$A$9123)=0),1,B49+1)","v":4},{"$f":"IF(AND($B50=1,$A50<>\"\"),\nIF(MATCH(1,$B51:$B65,0)<  $B50+MATCH(1,$B50:$B65,0)+COLUMN(A$1)-2,\"\",\nINDEX($A50:$A65,$B50+MATCH(1,$B50:$B65,0)+COLUMN(A$1)-2)),\"\")","v":""},{"$f":"IF(AND($B50=1,$A50<>\"\"),\nIF(MATCH(1,$B51:$B65,0)<  $B50+MATCH(1,$B50:$B65,0)+COLUMN(B$1)-2,\"\",\nINDEX($A50:$A65,$B50+MATCH(1,$B50:$B65,0)+COLUMN(B$1)-2)),\"\")","v":""},{"$f":"IF(AND($B50=1,$A50<>\"\"),\nIF(MATCH(1,$B51:$B65,0)<  $B50+MATCH(1,$B50:$B65,0)+COLUMN(C$1)-2,\"\",\nINDEX($A50:$A65,$B50+MATCH(1,$B50:$B65,0)+COLUMN(C$1)-2)),\"\")","v":""},{"$f":"IF(AND($B50=1,$A50<>\"\"),\nIF(MATCH(1,$B51:$B65,0)<  $B50+MATCH(1,$B50:$B65,0)+COLUMN(D$1)-2,\"\",\nINDEX($A50:$A65,$B50+MATCH(1,$B50:$B65,0)+COLUMN(D$1)-2)),\"\")","v":""},{"$f":"IF(AND($B50=1,$A50<>\"\"),\nIF(MATCH(1,$B51:$B65,0)<  $B50+MATCH(1,$B50:$B65,0)+COLUMN(E$1)-2,\"\",\nINDEX($A50:$A65,$B50+MATCH(1,$B50:$B65,0)+COLUMN(E$1)-2)),\"\")","v":""},{"$f":"IF(AND($B50=1,$A50<>\"\"),\nIF(MATCH(1,$B51:$B65,0)<  $B50+MATCH(1,$B50:$B65,0)+COLUMN(F$1)-2,\"\",\nINDEX($A50:$A65,$B50+MATCH(1,$B50:$B65,0)+COLUMN(F$1)-2)),\"\")","v":""},{"$f":"IF(AND($B50=1,$A50<>\"\"),\nIF(MATCH(1,$B51:$B65,0)<  $B50+MATCH(1,$B50:$B65,0)+COLUMN(G$1)-2,\"\",\nINDEX($A50:$A65,$B50+MATCH(1,$B50:$B65,0)+COLUMN(G$1)-2)),\"\")","v":""},{"$f":"IF(AND($B50=1,$A50<>\"\"),\nIF(MATCH(1,$B51:$B65,0)<  $B50+MATCH(1,$B50:$B65,0)+COLUMN(H$1)-2,\"\",\nINDEX($A50:$A65,$B50+MATCH(1,$B50:$B65,0)+COLUMN(H$1)-2)),\"\")","v":""},{"$f":"IF(AND($B50=1,$A50<>\"\"),\nIF(MATCH(1,$B51:$B65,0)<  $B50+MATCH(1,$B50:$B65,0)+COLUMN(I$1)-2,\"\",\nINDEX($A50:$A65,$B50+MATCH(1,$B50:$B65,0)+COLUMN(I$1)-2)),\"\")","v":""},{"$f":"IF(AND($B50=1,$A50<>\"\"),\nIF(MATCH(1,$B51:$B65,0)<  $B50+MATCH(1,$B50:$B65,0)+COLUMN(J$1)-2,\"\",\nINDEX($A50:$A65,$B50+MATCH(1,$B50:$B65,0)+COLUMN(J$1)-2)),\"\")","v":""},{"$f":"IF(AND($B50=1,$A50<>\"\"),\nIF(MATCH(1,$B51:$B65,0)<  $B50+MATCH(1,$B50:$B65,0)+COLUMN(K$1)-2,\"\",\nINDEX($A50:$A65,$B50+MATCH(1,$B50:$B65,0)+COLUMN(K$1)-2)),\"\")","v":""},{"$f":"IF(AND($B50=1,$A50<>\"\"),\nIF(MATCH(1,$B51:$B65,0)<  $B50+MATCH(1,$B50:$B65,0)+COLUMN(L$1)-2,\"\",\nINDEX($A50:$A65,$B50+MATCH(1,$B50:$B65,0)+COLUMN(L$1)-2)),\"\")","v":""},{"$f":"IF(AND($B50=1,$A50<>\"\"),\nIF(MATCH(1,$B51:$B65,0)<  $B50+MATCH(1,$B50:$B65,0)+COLUMN(M$1)-2,\"\",\nINDEX($A50:$A65,$B50+MATCH(1,$B50:$B65,0)+COLUMN(M$1)-2)),\"\")","v":""},{"$f":"IF(AND($B50=1,$A50<>\"\"),\nIF(MATCH(1,$B51:$B65,0)<  $B50+MATCH(1,$B50:$B65,0)+COLUMN(N$1)-2,\"\",\nINDEX($A50:$A65,$B50+MATCH(1,$B50:$B65,0)+COLUMN(N$1)-2)),\"\")","v":""},{"$f":"IF(AND($B50=1,$A50<>\"\"),\nIF(MATCH(1,$B51:$B65,0)<  $B50+MATCH(1,$B50:$B65,0)+COLUMN(O$1)-2,\"\",\nINDEX($A50:$A65,$B50+MATCH(1,$B50:$B65,0)+COLUMN(O$1)-2)),\"\")","v":""}]
["адрес: 460055 г. Оренбург, ул.Нахимова, 35 ",{"$f":"IF(OR(ISNUMBER(--LEFTB(A51,SEARCH(\".\",A51,1)-1)),COUNTA(A51:$A$9123)=0),1,B50+1)","v":5},{"$f":"IF(AND($B51=1,$A51<>\"\"),\nIF(MATCH(1,$B52:$B65,0)<  $B51+MATCH(1,$B51:$B65,0)+COLUMN(A$1)-2,\"\",\nINDEX($A51:$A65,$B51+MATCH(1,$B51:$B65,0)+COLUMN(A$1)-2)),\"\")","v":""},{"$f":"IF(AND($B51=1,$A51<>\"\"),\nIF(MATCH(1,$B52:$B65,0)<  $B51+MATCH(1,$B51:$B65,0)+COLUMN(B$1)-2,\"\",\nINDEX($A51:$A65,$B51+MATCH(1,$B51:$B65,0)+COLUMN(B$1)-2)),\"\")","v":""},{"$f":"IF(AND($B51=1,$A51<>\"\"),\nIF(MATCH(1,$B52:$B65,0)<  $B51+MATCH(1,$B51:$B65,0)+COLUMN(C$1)-2,\"\",\nINDEX($A51:$A65,$B51+MATCH(1,$B51:$B65,0)+COLUMN(C$1)-2)),\"\")","v":""},{"$f":"IF(AND($B51=1,$A51<>\"\"),\nIF(MATCH(1,$B52:$B65,0)<  $B51+MATCH(1,$B51:$B65,0)+COLUMN(D$1)-2,\"\",\nINDEX($A51:$A65,$B51+MATCH(1,$B51:$B65,0)+COLUMN(D$1)-2)),\"\")","v":""},{"$f":"IF(AND($B51=1,$A51<>\"\"),\nIF(MATCH(1,$B52:$B65,0)<  $B51+MATCH(1,$B51:$B65,0)+COLUMN(E$1)-2,\"\",\nINDEX($A51:$A65,$B51+MATCH(1,$B51:$B65,0)+COLUMN(E$1)-2)),\"\")","v":""},{"$f":"IF(AND($B51=1,$A51<>\"\"),\nIF(MATCH(1,$B52:$B65,0)<  $B51+MATCH(1,$B51:$B65,0)+COLUMN(F$1)-2,\"\",\nINDEX($A51:$A65,$B51+MATCH(1,$B51:$B65,0)+COLUMN(F$1)-2)),\"\")","v":""},{"$f":"IF(AND($B51=1,$A51<>\"\"),\nIF(MATCH(1,$B52:$B65,0)<  $B51+MATCH(1,$B51:$B65,0)+COLUMN(G$1)-2,\"\",\nINDEX($A51:$A65,$B51+MATCH(1,$B51:$B65,0)+COLUMN(G$1)-2)),\"\")","v":""},{"$f":"IF(AND($B51=1,$A51<>\"\"),\nIF(MATCH(1,$B52:$B65,0)<  $B51+MATCH(1,$B51:$B65,0)+COLUMN(H$1)-2,\"\",\nINDEX($A51:$A65,$B51+MATCH(1,$B51:$B65,0)+COLUMN(H$1)-2)),\"\")","v":""},{"$f":"IF(AND($B51=1,$A51<>\"\"),\nIF(MATCH(1,$B52:$B65,0)<  $B51+MATCH(1,$B51:$B65,0)+COLUMN(I$1)-2,\"\",\nINDEX($A51:$A65,$B51+MATCH(1,$B51:$B65,0)+COLUMN(I$1)-2)),\"\")","v":""},{"$f":"IF(AND($B51=1,$A51<>\"\"),\nIF(MATCH(1,$B52:$B65,0)<  $B51+MATCH(1,$B51:$B65,0)+COLUMN(J$1)-2,\"\",\nINDEX($A51:$A65,$B51+MATCH(1,$B51:$B65,0)+COLUMN(J$1)-2)),\"\")","v":""},{"$f":"IF(AND($B51=1,$A51<>\"\"),\nIF(MATCH(1,$B52:$B65,0)<  $B51+MATCH(1,$B51:$B65,0)+COLUMN(K$1)-2,\"\",\nINDEX($A51:$A65,$B51+MATCH(1,$B51:$B65,0)+COLUMN(K$1)-2)),\"\")","v":""},{"$f":"IF(AND($B51=1,$A51<>\"\"),\nIF(MATCH(1,$B52:$B65,0)<  $B51+MATCH(1,$B51:$B65,0)+COLUMN(L$1)-2,\"\",\nINDEX($A51:$A65,$B51+MATCH(1,$B51:$B65,0)+COLUMN(L$1)-2)),\"\")","v":""},{"$f":"IF(AND($B51=1,$A51<>\"\"),\nIF(MATCH(1,$B52:$B65,0)<  $B51+MATCH(1,$B51:$B65,0)+COLUMN(M$1)-2,\"\",\nINDEX($A51:$A65,$B51+MATCH(1,$B51:$B65,0)+COLUMN(M$1)-2)),\"\")","v":""},{"$f":"IF(AND($B51=1,$A51<>\"\"),\nIF(MATCH(1,$B52:$B65,0)<  $B51+MATCH(1,$B51:$B65,0)+COLUMN(N$1)-2,\"\",\nINDEX($A51:$A65,$B51+MATCH(1,$B51:$B65,0)+COLUMN(N$1)-2)),\"\")","v":""},{"$f":"IF(AND($B51=1,$A51<>\"\"),\nIF(MATCH(1,$B52:$B65,0)<  $B51+MATCH(1,$B51:$B65,0)+COLUMN(O$1)-2,\"\",\nINDEX($A51:$A65,$B51+MATCH(1,$B51:$B65,0)+COLUMN(O$1)-2)),\"\")","v":""}]
["Тел. 76-23-81; 76-53-88, 76-45-38",{"$f":"IF(OR(ISNUMBER(--LEFTB(A52,SEARCH(\".\",A52,1)-1)),COUNTA(A52:$A$9123)=0),1,B51+1)","v":6},{"$f":"IF(AND($B52=1,$A52<>\"\"),\nIF(MATCH(1,$B53:$B65,0)<  $B52+MATCH(1,$B52:$B65,0)+COLUMN(A$1)-2,\"\",\nINDEX($A52:$A65,$B52+MATCH(1,$B52:$B65,0)+COLUMN(A$1)-2)),\"\")","v":""},{"$f":"IF(AND($B52=1,$A52<>\"\"),\nIF(MATCH(1,$B53:$B65,0)<  $B52+MATCH(1,$B52:$B65,0)+COLUMN(B$1)-2,\"\",\nINDEX($A52:$A65,$B52+MATCH(1,$B52:$B65,0)+COLUMN(B$1)-2)),\"\")","v":""},{"$f":"IF(AND($B52=1,$A52<>\"\"),\nIF(MATCH(1,$B53:$B65,0)<  $B52+MATCH(1,$B52:$B65,0)+COLUMN(C$1)-2,\"\",\nINDEX($A52:$A65,$B52+MATCH(1,$B52:$B65,0)+COLUMN(C$1)-2)),\"\")","v":""},{"$f":"IF(AND($B52=1,$A52<>\"\"),\nIF(MATCH(1,$B53:$B65,0)<  $B52+MATCH(1,$B52:$B65,0)+COLUMN(D$1)-2,\"\",\nINDEX($A52:$A65,$B52+MATCH(1,$B52:$B65,0)+COLUMN(D$1)-2)),\"\")","v":""},{"$f":"IF(AND($B52=1,$A52<>\"\"),\nIF(MATCH(1,$B53:$B65,0)<  $B52+MATCH(1,$B52:$B65,0)+COLUMN(E$1)-2,\"\",\nINDEX($A52:$A65,$B52+MATCH(1,$B52:$B65,0)+COLUMN(E$1)-2)),\"\")","v":""},{"$f":"IF(AND($B52=1,$A52<>\"\"),\nIF(MATCH(1,$B53:$B65,0)<  $B52+MATCH(1,$B52:$B65,0)+COLUMN(F$1)-2,\"\",\nINDEX($A52:$A65,$B52+MATCH(1,$B52:$B65,0)+COLUMN(F$1)-2)),\"\")","v":""},{"$f":"IF(AND($B52=1,$A52<>\"\"),\nIF(MATCH(1,$B53:$B65,0)<  $B52+MATCH(1,$B52:$B65,0)+COLUMN(G$1)-2,\"\",\nINDEX($A52:$A65,$B52+MATCH(1,$B52:$B65,0)+COLUMN(G$1)-2)),\"\")","v":""},{"$f":"IF(AND($B52=1,$A52<>\"\"),\nIF(MATCH(1,$B53:$B65,0)<  $B52+MATCH(1,$B52:$B65,0)+COLUMN(H$1)-2,\"\",\nINDEX($A52:$A65,$B52+MATCH(1,$B52:$B65,0)+COLUMN(H$1)-2)),\"\")","v":""},{"$f":"IF(AND($B52=1,$A52<>\"\"),\nIF(MATCH(1,$B53:$B65,0)<  $B52+MATCH(1,$B52:$B65,0)+COLUMN(I$1)-2,\"\",\nINDEX($A52:$A65,$B52+MATCH(1,$B52:$B65,0)+COLUMN(I$1)-2)),\"\")","v":""},{"$f":"IF(AND($B52=1,$A52<>\"\"),\nIF(MATCH(1,$B53:$B65,0)<  $B52+MATCH(1,$B52:$B65,0)+COLUMN(J$1)-2,\"\",\nINDEX($A52:$A65,$B52+MATCH(1,$B52:$B65,0)+COLUMN(J$1)-2)),\"\")","v":""},{"$f":"IF(AND($B52=1,$A52<>\"\"),\nIF(MATCH(1,$B53:$B65,0)<  $B52+MATCH(1,$B52:$B65,0)+COLUMN(K$1)-2,\"\",\nINDEX($A52:$A65,$B52+MATCH(1,$B52:$B65,0)+COLUMN(K$1)-2)),\"\")","v":""},{"$f":"IF(AND($B52=1,$A52<>\"\"),\nIF(MATCH(1,$B53:$B65,0)<  $B52+MATCH(1,$B52:$B65,0)+COLUMN(L$1)-2,\"\",\nINDEX($A52:$A65,$B52+MATCH(1,$B52:$B65,0)+COLUMN(L$1)-2)),\"\")","v":""},{"$f":"IF(AND($B52=1,$A52<>\"\"),\nIF(MATCH(1,$B53:$B65,0)<  $B52+MATCH(1,$B52:$B65,0)+COLUMN(M$1)-2,\"\",\nINDEX($A52:$A65,$B52+MATCH(1,$B52:$B65,0)+COLUMN(M$1)-2)),\"\")","v":""},{"$f":"IF(AND($B52=1,$A52<>\"\"),\nIF(MATCH(1,$B53:$B65,0)<  $B52+MATCH(1,$B52:$B65,0)+COLUMN(N$1)-2,\"\",\nINDEX($A52:$A65,$B52+MATCH(1,$B52:$B65,0)+COLUMN(N$1)-2)),\"\")","v":""},{"$f":"IF(AND($B52=1,$A52<>\"\"),\nIF(MATCH(1,$B53:$B65,0)<  $B52+MATCH(1,$B52:$B65,0)+COLUMN(O$1)-2,\"\",\nINDEX($A52:$A65,$B52+MATCH(1,$B52:$B65,0)+COLUMN(O$1)-2)),\"\")","v":""}]
[" e-mail: info@aqua-life.ru; www.aqua-life.ru",{"$f":"IF(OR(ISNUMBER(--LEFTB(A53,SEARCH(\".\",A53,1)-1)),COUNTA(A53:$A$9123)=0),1,B52+1)","v":7},{"$f":"IF(AND($B53=1,$A53<>\"\"),\nIF(MATCH(1,$B54:$B65,0)<  $B53+MATCH(1,$B53:$B65,0)+COLUMN(A$1)-2,\"\",\nINDEX($A53:$A65,$B53+MATCH(1,$B53:$B65,0)+COLUMN(A$1)-2)),\"\")","v":""},{"$f":"IF(AND($B53=1,$A53<>\"\"),\nIF(MATCH(1,$B54:$B65,0)<  $B53+MATCH(1,$B53:$B65,0)+COLUMN(B$1)-2,\"\",\nINDEX($A53:$A65,$B53+MATCH(1,$B53:$B65,0)+COLUMN(B$1)-2)),\"\")","v":""},{"$f":"IF(AND($B53=1,$A53<>\"\"),\nIF(MATCH(1,$B54:$B65,0)<  $B53+MATCH(1,$B53:$B65,0)+COLUMN(C$1)-2,\"\",\nINDEX($A53:$A65,$B53+MATCH(1,$B53:$B65,0)+COLUMN(C$1)-2)),\"\")","v":""},{"$f":"IF(AND($B53=1,$A53<>\"\"),\nIF(MATCH(1,$B54:$B65,0)<  $B53+MATCH(1,$B53:$B65,0)+COLUMN(D$1)-2,\"\",\nINDEX($A53:$A65,$B53+MATCH(1,$B53:$B65,0)+COLUMN(D$1)-2)),\"\")","v":""},{"$f":"IF(AND($B53=1,$A53<>\"\"),\nIF(MATCH(1,$B54:$B65,0)<  $B53+MATCH(1,$B53:$B65,0)+COLUMN(E$1)-2,\"\",\nINDEX($A53:$A65,$B53+MATCH(1,$B53:$B65,0)+COLUMN(E$1)-2)),\"\")","v":""},{"$f":"IF(AND($B53=1,$A53<>\"\"),\nIF(MATCH(1,$B54:$B65,0)<  $B53+MATCH(1,$B53:$B65,0)+COLUMN(F$1)-2,\"\",\nINDEX($A53:$A65,$B53+MATCH(1,$B53:$B65,0)+COLUMN(F$1)-2)),\"\")","v":""},{"$f":"IF(AND($B53=1,$A53<>\"\"),\nIF(MATCH(1,$B54:$B65,0)<  $B53+MATCH(1,$B53:$B65,0)+COLUMN(G$1)-2,\"\",\nINDEX($A53:$A65,$B53+MATCH(1,$B53:$B65,0)+COLUMN(G$1)-2)),\"\")","v":""},{"$f":"IF(AND($B53=1,$A53<>\"\"),\nIF(MATCH(1,$B54:$B65,0)<  $B53+MATCH(1,$B53:$B65,0)+COLUMN(H$1)-2,\"\",\nINDEX($A53:$A65,$B53+MATCH(1,$B53:$B65,0)+COLUMN(H$1)-2)),\"\")","v":""},{"$f":"IF(AND($B53=1,$A53<>\"\"),\nIF(MATCH(1,$B54:$B65,0)<  $B53+MATCH(1,$B53:$B65,0)+COLUMN(I$1)-2,\"\",\nINDEX($A53:$A65,$B53+MATCH(1,$B53:$B65,0)+COLUMN(I$1)-2)),\"\")","v":""},{"$f":"IF(AND($B53=1,$A53<>\"\"),\nIF(MATCH(1,$B54:$B65,0)<  $B53+MATCH(1,$B53:$B65,0)+COLUMN(J$1)-2,\"\",\nINDEX($A53:$A65,$B53+MATCH(1,$B53:$B65,0)+COLUMN(J$1)-2)),\"\")","v":""},{"$f":"IF(AND($B53=1,$A53<>\"\"),\nIF(MATCH(1,$B54:$B65,0)<  $B53+MATCH(1,$B53:$B65,0)+COLUMN(K$1)-2,\"\",\nINDEX($A53:$A65,$B53+MATCH(1,$B53:$B65,0)+COLUMN(K$1)-2)),\"\")","v":""},{"$f":"IF(AND($B53=1,$A53<>\"\"),\nIF(MATCH(1,$B54:$B65,0)<  $B53+MATCH(1,$B53:$B65,0)+COLUMN(L$1)-2,\"\",\nINDEX($A53:$A65,$B53+MATCH(1,$B53:$B65,0)+COLUMN(L$1)-2)),\"\")","v":""},{"$f":"IF(AND($B53=1,$A53<>\"\"),\nIF(MATCH(1,$B54:$B65,0)<  $B53+MATCH(1,$B53:$B65,0)+COLUMN(M$1)-2,\"\",\nINDEX($A53:$A65,$B53+MATCH(1,$B53:$B65,0)+COLUMN(M$1)-2)),\"\")","v":""},{"$f":"IF(AND($B53=1,$A53<>\"\"),\nIF(MATCH(1,$B54:$B65,0)<  $B53+MATCH(1,$B53:$B65,0)+COLUMN(N$1)-2,\"\",\nINDEX($A53:$A65,$B53+MATCH(1,$B53:$B65,0)+COLUMN(N$1)-2)),\"\")","v":""},{"$f":"IF(AND($B53=1,$A53<>\"\"),\nIF(MATCH(1,$B54:$B65,0)<  $B53+MATCH(1,$B53:$B65,0)+COLUMN(O$1)-2,\"\",\nINDEX($A53:$A65,$B53+MATCH(1,$B53:$B65,0)+COLUMN(O$1)-2)),\"\")","v":""}]
["12.    ОАО \"Завод  гидропрессов \"Металлист\" ",{"$f":"IF(OR(ISNUMBER(--LEFTB(A54,SEARCH(\".\",A54,1)-1)),COUNTA(A54:$A$9123)=0),1,B53+1)","v":1},{"$f":"IF(AND($B54=1,$A54<>\"\"),\nIF(MATCH(1,$B55:$B65,0)<  $B54+MATCH(1,$B54:$B65,0)+COLUMN(A$1)-2,\"\",\nINDEX($A54:$A65,$B54+MATCH(1,$B54:$B65,0)+COLUMN(A$1)-2)),\"\")","v":"12.    ОАО \"Завод  гидропрессов \"Металлист\" "},{"$f":"IF(AND($B54=1,$A54<>\"\"),\nIF(MATCH(1,$B55:$B65,0)<  $B54+MATCH(1,$B54:$B65,0)+COLUMN(B$1)-2,\"\",\nINDEX($A54:$A65,$B54+MATCH(1,$B54:$B65,0)+COLUMN(B$1)-2)),\"\")","v":"Генеральный директор Шейнина Лариса Михайловна  "},{"$f":"IF(AND($B54=1,$A54<>\"\"),\nIF(MATCH(1,$B55:$B65,0)<  $B54+MATCH(1,$B54:$B65,0)+COLUMN(C$1)-2,\"\",\nINDEX($A54:$A65,$B54+MATCH(1,$B54:$B65,0)+COLUMN(C$1)-2)),\"\")","v":"адрес: 460000 г. Оренбург, ул.Яицкая, 15 "},{"$f":"IF(AND($B54=1,$A54<>\"\"),\nIF(MATCH(1,$B55:$B65,0)<  $B54+MATCH(1,$B54:$B65,0)+COLUMN(D$1)-2,\"\",\nINDEX($A54:$A65,$B54+MATCH(1,$B54:$B65,0)+COLUMN(D$1)-2)),\"\")","v":"Тел.\\факс 77-43-73; 77-01-99, 77-25-86 "},{"$f":"IF(AND($B54=1,$A54<>\"\"),\nIF(MATCH(1,$B55:$B65,0)<  $B54+MATCH(1,$B54:$B65,0)+COLUMN(E$1)-2,\"\",\nINDEX($A54:$A65,$B54+MATCH(1,$B54:$B65,0)+COLUMN(E$1)-2)),\"\")","v":"e-mail: metallist@esoo.ru ; www.gidropress-metalist.ru"},{"$f":"IF(AND($B54=1,$A54<>\"\"),\nIF(MATCH(1,$B55:$B65,0)<  $B54+MATCH(1,$B54:$B65,0)+COLUMN(F$1)-2,\"\",\nINDEX($A54:$A65,$B54+MATCH(1,$B54:$B65,0)+COLUMN(F$1)-2)),\"\")","v":""},{"$f":"IF(AND($B54=1,$A54<>\"\"),\nIF(MATCH(1,$B55:$B65,0)<  $B54+MATCH(1,$B54:$B65,0)+COLUMN(G$1)-2,\"\",\nINDEX($A54:$A65,$B54+MATCH(1,$B54:$B65,0)+COLUMN(G$1)-2)),\"\")","v":""},{"$f":"IF(AND($B54=1,$A54<>\"\"),\nIF(MATCH(1,$B55:$B65,0)<  $B54+MATCH(1,$B54:$B65,0)+COLUMN(H$1)-2,\"\",\nINDEX($A54:$A65,$B54+MATCH(1,$B54:$B65,0)+COLUMN(H$1)-2)),\"\")","v":""},{"$f":"IF(AND($B54=1,$A54<>\"\"),\nIF(MATCH(1,$B55:$B65,0)<  $B54+MATCH(1,$B54:$B65,0)+COLUMN(I$1)-2,\"\",\nINDEX($A54:$A65,$B54+MATCH(1,$B54:$B65,0)+COLUMN(I$1)-2)),\"\")","v":""},{"$f":"IF(AND($B54=1,$A54<>\"\"),\nIF(MATCH(1,$B55:$B65,0)<  $B54+MATCH(1,$B54:$B65,0)+COLUMN(J$1)-2,\"\",\nINDEX($A54:$A65,$B54+MATCH(1,$B54:$B65,0)+COLUMN(J$1)-2)),\"\")","v":""},{"$f":"IF(AND($B54=1,$A54<>\"\"),\nIF(MATCH(1,$B55:$B65,0)<  $B54+MATCH(1,$B54:$B65,0)+COLUMN(K$1)-2,\"\",\nINDEX($A54:$A65,$B54+MATCH(1,$B54:$B65,0)+COLUMN(K$1)-2)),\"\")","v":""},{"$f":"IF(AND($B54=1,$A54<>\"\"),\nIF(MATCH(1,$B55:$B65,0)<  $B54+MATCH(1,$B54:$B65,0)+COLUMN(L$1)-2,\"\",\nINDEX($A54:$A65,$B54+MATCH(1,$B54:$B65,0)+COLUMN(L$1)-2)),\"\")","v":""},{"$f":"IF(AND($B54=1,$A54<>\"\"),\nIF(MATCH(1,$B55:$B65,0)<  $B54+MATCH(1,$B54:$B65,0)+COLUMN(M$1)-2,\"\",\nINDEX($A54:$A65,$B54+MATCH(1,$B54:$B65,0)+COLUMN(M$1)-2)),\"\")","v":""},{"$f":"IF(AND($B54=1,$A54<>\"\"),\nIF(MATCH(1,$B55:$B65,0)<  $B54+MATCH(1,$B54:$B65,0)+COLUMN(N$1)-2,\"\",\nINDEX($A54:$A65,$B54+MATCH(1,$B54:$B65,0)+COLUMN(N$1)-2)),\"\")","v":""},{"$f":"IF(AND($B54=1,$A54<>\"\"),\nIF(MATCH(1,$B55:$B65,0)<  $B54+MATCH(1,$B54:$B65,0)+COLUMN(O$1)-2,\"\",\nINDEX($A54:$A65,$B54+MATCH(1,$B54:$B65,0)+COLUMN(O$1)-2)),\"\")","v":""}]
["Генеральный директор Шейнина Лариса Михайловна  ",{"$f":"IF(OR(ISNUMBER(--LEFTB(A55,SEARCH(\".\",A55,1)-1)),COUNTA(A55:$A$9123)=0),1,B54+1)","v":2},{"$f":"IF(AND($B55=1,$A55<>\"\"),\nIF(MATCH(1,$B56:$B65,0)<  $B55+MATCH(1,$B55:$B65,0)+COLUMN(A$1)-2,\"\",\nINDEX($A55:$A65,$B55+MATCH(1,$B55:$B65,0)+COLUMN(A$1)-2)),\"\")","v":""},{"$f":"IF(AND($B55=1,$A55<>\"\"),\nIF(MATCH(1,$B56:$B65,0)<  $B55+MATCH(1,$B55:$B65,0)+COLUMN(B$1)-2,\"\",\nINDEX($A55:$A65,$B55+MATCH(1,$B55:$B65,0)+COLUMN(B$1)-2)),\"\")","v":""},{"$f":"IF(AND($B55=1,$A55<>\"\"),\nIF(MATCH(1,$B56:$B65,0)<  $B55+MATCH(1,$B55:$B65,0)+COLUMN(C$1)-2,\"\",\nINDEX($A55:$A65,$B55+MATCH(1,$B55:$B65,0)+COLUMN(C$1)-2)),\"\")","v":""},{"$f":"IF(AND($B55=1,$A55<>\"\"),\nIF(MATCH(1,$B56:$B65,0)<  $B55+MATCH(1,$B55:$B65,0)+COLUMN(D$1)-2,\"\",\nINDEX($A55:$A65,$B55+MATCH(1,$B55:$B65,0)+COLUMN(D$1)-2)),\"\")","v":""},{"$f":"IF(AND($B55=1,$A55<>\"\"),\nIF(MATCH(1,$B56:$B65,0)<  $B55+MATCH(1,$B55:$B65,0)+COLUMN(E$1)-2,\"\",\nINDEX($A55:$A65,$B55+MATCH(1,$B55:$B65,0)+COLUMN(E$1)-2)),\"\")","v":""},{"$f":"IF(AND($B55=1,$A55<>\"\"),\nIF(MATCH(1,$B56:$B65,0)<  $B55+MATCH(1,$B55:$B65,0)+COLUMN(F$1)-2,\"\",\nINDEX($A55:$A65,$B55+MATCH(1,$B55:$B65,0)+COLUMN(F$1)-2)),\"\")","v":""},{"$f":"IF(AND($B55=1,$A55<>\"\"),\nIF(MATCH(1,$B56:$B65,0)<  $B55+MATCH(1,$B55:$B65,0)+COLUMN(G$1)-2,\"\",\nINDEX($A55:$A65,$B55+MATCH(1,$B55:$B65,0)+COLUMN(G$1)-2)),\"\")","v":""},{"$f":"IF(AND($B55=1,$A55<>\"\"),\nIF(MATCH(1,$B56:$B65,0)<  $B55+MATCH(1,$B55:$B65,0)+COLUMN(H$1)-2,\"\",\nINDEX($A55:$A65,$B55+MATCH(1,$B55:$B65,0)+COLUMN(H$1)-2)),\"\")","v":""},{"$f":"IF(AND($B55=1,$A55<>\"\"),\nIF(MATCH(1,$B56:$B65,0)<  $B55+MATCH(1,$B55:$B65,0)+COLUMN(I$1)-2,\"\",\nINDEX($A55:$A65,$B55+MATCH(1,$B55:$B65,0)+COLUMN(I$1)-2)),\"\")","v":""},{"$f":"IF(AND($B55=1,$A55<>\"\"),\nIF(MATCH(1,$B56:$B65,0)<  $B55+MATCH(1,$B55:$B65,0)+COLUMN(J$1)-2,\"\",\nINDEX($A55:$A65,$B55+MATCH(1,$B55:$B65,0)+COLUMN(J$1)-2)),\"\")","v":""},{"$f":"IF(AND($B55=1,$A55<>\"\"),\nIF(MATCH(1,$B56:$B65,0)<  $B55+MATCH(1,$B55:$B65,0)+COLUMN(K$1)-2,\"\",\nINDEX($A55:$A65,$B55+MATCH(1,$B55:$B65,0)+COLUMN(K$1)-2)),\"\")","v":""},{"$f":"IF(AND($B55=1,$A55<>\"\"),\nIF(MATCH(1,$B56:$B65,0)<  $B55+MATCH(1,$B55:$B65,0)+COLUMN(L$1)-2,\"\",\nINDEX($A55:$A65,$B55+MATCH(1,$B55:$B65,0)+COLUMN(L$1)-2)),\"\")","v":""},{"$f":"IF(AND($B55=1,$A55<>\"\"),\nIF(MATCH(1,$B56:$B65,0)<  $B55+MATCH(1,$B55:$B65,0)+COLUMN(M$1)-2,\"\",\nINDEX($A55:$A65,$B55+MATCH(1,$B55:$B65,0)+COLUMN(M$1)-2)),\"\")","v":""},{"$f":"IF(AND($B55=1,$A55<>\"\"),\nIF(MATCH(1,$B56:$B65,0)<  $B55+MATCH(1,$B55:$B65,0)+COLUMN(N$1)-2,\"\",\nINDEX($A55:$A65,$B55+MATCH(1,$B55:$B65,0)+COLUMN(N$1)-2)),\"\")","v":""},{"$f":"IF(AND($B55=1,$A55<>\"\"),\nIF(MATCH(1,$B56:$B65,0)<  $B55+MATCH(1,$B55:$B65,0)+COLUMN(O$1)-2,\"\",\nINDEX($A55:$A65,$B55+MATCH(1,$B55:$B65,0)+COLUMN(O$1)-2)),\"\")","v":""}]
["адрес: 460000 г. Оренбург, ул.Яицкая, 15 ",{"$f":"IF(OR(ISNUMBER(--LEFTB(A56,SEARCH(\".\",A56,1)-1)),COUNTA(A56:$A$9123)=0),1,B55+1)","v":3},{"$f":"IF(AND($B56=1,$A56<>\"\"),\nIF(MATCH(1,$B57:$B65,0)<  $B56+MATCH(1,$B56:$B65,0)+COLUMN(A$1)-2,\"\",\nINDEX($A56:$A65,$B56+MATCH(1,$B56:$B65,0)+COLUMN(A$1)-2)),\"\")","v":""},{"$f":"IF(AND($B56=1,$A56<>\"\"),\nIF(MATCH(1,$B57:$B65,0)<  $B56+MATCH(1,$B56:$B65,0)+COLUMN(B$1)-2,\"\",\nINDEX($A56:$A65,$B56+MATCH(1,$B56:$B65,0)+COLUMN(B$1)-2)),\"\")","v":""},{"$f":"IF(AND($B56=1,$A56<>\"\"),\nIF(MATCH(1,$B57:$B65,0)<  $B56+MATCH(1,$B56:$B65,0)+COLUMN(C$1)-2,\"\",\nINDEX($A56:$A65,$B56+MATCH(1,$B56:$B65,0)+COLUMN(C$1)-2)),\"\")","v":""},{"$f":"IF(AND($B56=1,$A56<>\"\"),\nIF(MATCH(1,$B57:$B65,0)<  $B56+MATCH(1,$B56:$B65,0)+COLUMN(D$1)-2,\"\",\nINDEX($A56:$A65,$B56+MATCH(1,$B56:$B65,0)+COLUMN(D$1)-2)),\"\")","v":""},{"$f":"IF(AND($B56=1,$A56<>\"\"),\nIF(MATCH(1,$B57:$B65,0)<  $B56+MATCH(1,$B56:$B65,0)+COLUMN(E$1)-2,\"\",\nINDEX($A56:$A65,$B56+MATCH(1,$B56:$B65,0)+COLUMN(E$1)-2)),\"\")","v":""},{"$f":"IF(AND($B56=1,$A56<>\"\"),\nIF(MATCH(1,$B57:$B65,0)<  $B56+MATCH(1,$B56:$B65,0)+COLUMN(F$1)-2,\"\",\nINDEX($A56:$A65,$B56+MATCH(1,$B56:$B65,0)+COLUMN(F$1)-2)),\"\")","v":""},{"$f":"IF(AND($B56=1,$A56<>\"\"),\nIF(MATCH(1,$B57:$B65,0)<  $B56+MATCH(1,$B56:$B65,0)+COLUMN(G$1)-2,\"\",\nINDEX($A56:$A65,$B56+MATCH(1,$B56:$B65,0)+COLUMN(G$1)-2)),\"\")","v":""},{"$f":"IF(AND($B56=1,$A56<>\"\"),\nIF(MATCH(1,$B57:$B65,0)<  $B56+MATCH(1,$B56:$B65,0)+COLUMN(H$1)-2,\"\",\nINDEX($A56:$A65,$B56+MATCH(1,$B56:$B65,0)+COLUMN(H$1)-2)),\"\")","v":""},{"$f":"IF(AND($B56=1,$A56<>\"\"),\nIF(MATCH(1,$B57:$B65,0)<  $B56+MATCH(1,$B56:$B65,0)+COLUMN(I$1)-2,\"\",\nINDEX($A56:$A65,$B56+MATCH(1,$B56:$B65,0)+COLUMN(I$1)-2)),\"\")","v":""},{"$f":"IF(AND($B56=1,$A56<>\"\"),\nIF(MATCH(1,$B57:$B65,0)<  $B56+MATCH(1,$B56:$B65,0)+COLUMN(J$1)-2,\"\",\nINDEX($A56:$A65,$B56+MATCH(1,$B56:$B65,0)+COLUMN(J$1)-2)),\"\")","v":""},{"$f":"IF(AND($B56=1,$A56<>\"\"),\nIF(MATCH(1,$B57:$B65,0)<  $B56+MATCH(1,$B56:$B65,0)+COLUMN(K$1)-2,\"\",\nINDEX($A56:$A65,$B56+MATCH(1,$B56:$B65,0)+COLUMN(K$1)-2)),\"\")","v":""},{"$f":"IF(AND($B56=1,$A56<>\"\"),\nIF(MATCH(1,$B57:$B65,0)<  $B56+MATCH(1,$B56:$B65,0)+COLUMN(L$1)-2,\"\",\nINDEX($A56:$A65,$B56+MATCH(1,$B56:$B65,0)+COLUMN(L$1)-2)),\"\")","v":""},{"$f":"IF(AND($B56=1,$A56<>\"\"),\nIF(MATCH(1,$B57:$B65,0)<  $B56+MATCH(1,$B56:$B65,0)+COLUMN(M$1)-2,\"\",\nINDEX($A56:$A65,$B56+MATCH(1,$B56:$B65,0)+COLUMN(M$1)-2)),\"\")","v":""},{"$f":"IF(AND($B56=1,$A56<>\"\"),\nIF(MATCH(1,$B57:$B65,0)<  $B56+MATCH(1,$B56:$B65,0)+COLUMN(N$1)-2,\"\",\nINDEX($A56:$A65,$B56+MATCH(1,$B56:$B65,0)+COLUMN(N$1)-2)),\"\")","v":""},{"$f":"IF(AND($B56=1,$A56<>\"\"),\nIF(MATCH(1,$B57:$B65,0)<  $B56+MATCH(1,$B56:$B65,0)+COLUMN(O$1)-2,\"\",\nINDEX($A56:$A65,$B56+MATCH(1,$B56:$B65,0)+COLUMN(O$1)-2)),\"\")","v":""}]
["Тел.\\факс 77-43-73; 77-01-99, 77-25-86 ",{"$f":"IF(OR(ISNUMBER(--LEFTB(A57,SEARCH(\".\",A57,1)-1)),COUNTA(A57:$A$9123)=0),1,B56+1)","v":4},{"$f":"IF(AND($B57=1,$A57<>\"\"),\nIF(MATCH(1,$B58:$B65,0)<  $B57+MATCH(1,$B57:$B65,0)+COLUMN(A$1)-2,\"\",\nINDEX($A57:$A65,$B57+MATCH(1,$B57:$B65,0)+COLUMN(A$1)-2)),\"\")","v":""},{"$f":"IF(AND($B57=1,$A57<>\"\"),\nIF(MATCH(1,$B58:$B65,0)<  $B57+MATCH(1,$B57:$B65,0)+COLUMN(B$1)-2,\"\",\nINDEX($A57:$A65,$B57+MATCH(1,$B57:$B65,0)+COLUMN(B$1)-2)),\"\")","v":""},{"$f":"IF(AND($B57=1,$A57<>\"\"),\nIF(MATCH(1,$B58:$B65,0)<  $B57+MATCH(1,$B57:$B65,0)+COLUMN(C$1)-2,\"\",\nINDEX($A57:$A65,$B57+MATCH(1,$B57:$B65,0)+COLUMN(C$1)-2)),\"\")","v":""},{"$f":"IF(AND($B57=1,$A57<>\"\"),\nIF(MATCH(1,$B58:$B65,0)<  $B57+MATCH(1,$B57:$B65,0)+COLUMN(D$1)-2,\"\",\nINDEX($A57:$A65,$B57+MATCH(1,$B57:$B65,0)+COLUMN(D$1)-2)),\"\")","v":""},{"$f":"IF(AND($B57=1,$A57<>\"\"),\nIF(MATCH(1,$B58:$B65,0)<  $B57+MATCH(1,$B57:$B65,0)+COLUMN(E$1)-2,\"\",\nINDEX($A57:$A65,$B57+MATCH(1,$B57:$B65,0)+COLUMN(E$1)-2)),\"\")","v":""},{"$f":"IF(AND($B57=1,$A57<>\"\"),\nIF(MATCH(1,$B58:$B65,0)<  $B57+MATCH(1,$B57:$B65,0)+COLUMN(F$1)-2,\"\",\nINDEX($A57:$A65,$B57+MATCH(1,$B57:$B65,0)+COLUMN(F$1)-2)),\"\")","v":""},{"$f":"IF(AND($B57=1,$A57<>\"\"),\nIF(MATCH(1,$B58:$B65,0)<  $B57+MATCH(1,$B57:$B65,0)+COLUMN(G$1)-2,\"\",\nINDEX($A57:$A65,$B57+MATCH(1,$B57:$B65,0)+COLUMN(G$1)-2)),\"\")","v":""},{"$f":"IF(AND($B57=1,$A57<>\"\"),\nIF(MATCH(1,$B58:$B65,0)<  $B57+MATCH(1,$B57:$B65,0)+COLUMN(H$1)-2,\"\",\nINDEX($A57:$A65,$B57+MATCH(1,$B57:$B65,0)+COLUMN(H$1)-2)),\"\")","v":""},{"$f":"IF(AND($B57=1,$A57<>\"\"),\nIF(MATCH(1,$B58:$B65,0)<  $B57+MATCH(1,$B57:$B65,0)+COLUMN(I$1)-2,\"\",\nINDEX($A57:$A65,$B57+MATCH(1,$B57:$B65,0)+COLUMN(I$1)-2)),\"\")","v":""},{"$f":"IF(AND($B57=1,$A57<>\"\"),\nIF(MATCH(1,$B58:$B65,0)<  $B57+MATCH(1,$B57:$B65,0)+COLUMN(J$1)-2,\"\",\nINDEX($A57:$A65,$B57+MATCH(1,$B57:$B65,0)+COLUMN(J$1)-2)),\"\")","v":""},{"$f":"IF(AND($B57=1,$A57<>\"\"),\nIF(MATCH(1,$B58:$B65,0)<  $B57+MATCH(1,$B57:$B65,0)+COLUMN(K$1)-2,\"\",\nINDEX($A57:$A65,$B57+MATCH(1,$B57:$B65,0)+COLUMN(K$1)-2)),\"\")","v":""},{"$f":"IF(AND($B57=1,$A57<>\"\"),\nIF(MATCH(1,$B58:$B65,0)<  $B57+MATCH(1,$B57:$B65,0)+COLUMN(L$1)-2,\"\",\nINDEX($A57:$A65,$B57+MATCH(1,$B57:$B65,0)+COLUMN(L$1)-2)),\"\")","v":""},{"$f":"IF(AND($B57=1,$A57<>\"\"),\nIF(MATCH(1,$B58:$B65,0)<  $B57+MATCH(1,$B57:$B65,0)+COLUMN(M$1)-2,\"\",\nINDEX($A57:$A65,$B57+MATCH(1,$B57:$B65,0)+COLUMN(M$1)-2)),\"\")","v":""},{"$f":"IF(AND($B57=1,$A57<>\"\"),\nIF(MATCH(1,$B58:$B65,0)<  $B57+MATCH(1,$B57:$B65,0)+COLUMN(N$1)-2,\"\",\nINDEX($A57:$A65,$B57+MATCH(1,$B57:$B65,0)+COLUMN(N$1)-2)),\"\")","v":""},{"$f":"IF(AND($B57=1,$A57<>\"\"),\nIF(MATCH(1,$B58:$B65,0)<  $B57+MATCH(1,$B57:$B65,0)+COLUMN(O$1)-2,\"\",\nINDEX($A57:$A65,$B57+MATCH(1,$B57:$B65,0)+COLUMN(O$1)-2)),\"\")","v":""}]
["e-mail: metallist@esoo.ru ; www.gidropress-metalist.ru",{"$f":"IF(OR(ISNUMBER(--LEFTB(A58,SEARCH(\".\",A58,1)-1)),COUNTA(A58:$A$9123)=0),1,B57+1)","v":5},{"$f":"IF(AND($B58=1,$A58<>\"\"),\nIF(MATCH(1,$B59:$B65,0)<  $B58+MATCH(1,$B58:$B65,0)+COLUMN(A$1)-2,\"\",\nINDEX($A58:$A65,$B58+MATCH(1,$B58:$B65,0)+COLUMN(A$1)-2)),\"\")","v":""},{"$f":"IF(AND($B58=1,$A58<>\"\"),\nIF(MATCH(1,$B59:$B65,0)<  $B58+MATCH(1,$B58:$B65,0)+COLUMN(B$1)-2,\"\",\nINDEX($A58:$A65,$B58+MATCH(1,$B58:$B65,0)+COLUMN(B$1)-2)),\"\")","v":""},{"$f":"IF(AND($B58=1,$A58<>\"\"),\nIF(MATCH(1,$B59:$B65,0)<  $B58+MATCH(1,$B58:$B65,0)+COLUMN(C$1)-2,\"\",\nINDEX($A58:$A65,$B58+MATCH(1,$B58:$B65,0)+COLUMN(C$1)-2)),\"\")","v":""},{"$f":"IF(AND($B58=1,$A58<>\"\"),\nIF(MATCH(1,$B59:$B65,0)<  $B58+MATCH(1,$B58:$B65,0)+COLUMN(D$1)-2,\"\",\nINDEX($A58:$A65,$B58+MATCH(1,$B58:$B65,0)+COLUMN(D$1)-2)),\"\")","v":""},{"$f":"IF(AND($B58=1,$A58<>\"\"),\nIF(MATCH(1,$B59:$B65,0)<  $B58+MATCH(1,$B58:$B65,0)+COLUMN(E$1)-2,\"\",\nINDEX($A58:$A65,$B58+MATCH(1,$B58:$B65,0)+COLUMN(E$1)-2)),\"\")","v":""},{"$f":"IF(AND($B58=1,$A58<>\"\"),\nIF(MATCH(1,$B59:$B65,0)<  $B58+MATCH(1,$B58:$B65,0)+COLUMN(F$1)-2,\"\",\nINDEX($A58:$A65,$B58+MATCH(1,$B58:$B65,0)+COLUMN(F$1)-2)),\"\")","v":""},{"$f":"IF(AND($B58=1,$A58<>\"\"),\nIF(MATCH(1,$B59:$B65,0)<  $B58+MATCH(1,$B58:$B65,0)+COLUMN(G$1)-2,\"\",\nINDEX($A58:$A65,$B58+MATCH(1,$B58:$B65,0)+COLUMN(G$1)-2)),\"\")","v":""},{"$f":"IF(AND($B58=1,$A58<>\"\"),\nIF(MATCH(1,$B59:$B65,0)<  $B58+MATCH(1,$B58:$B65,0)+COLUMN(H$1)-2,\"\",\nINDEX($A58:$A65,$B58+MATCH(1,$B58:$B65,0)+COLUMN(H$1)-2)),\"\")","v":""},{"$f":"IF(AND($B58=1,$A58<>\"\"),\nIF(MATCH(1,$B59:$B65,0)<  $B58+MATCH(1,$B58:$B65,0)+COLUMN(I$1)-2,\"\",\nINDEX($A58:$A65,$B58+MATCH(1,$B58:$B65,0)+COLUMN(I$1)-2)),\"\")","v":""},{"$f":"IF(AND($B58=1,$A58<>\"\"),\nIF(MATCH(1,$B59:$B65,0)<  $B58+MATCH(1,$B58:$B65,0)+COLUMN(J$1)-2,\"\",\nINDEX($A58:$A65,$B58+MATCH(1,$B58:$B65,0)+COLUMN(J$1)-2)),\"\")","v":""},{"$f":"IF(AND($B58=1,$A58<>\"\"),\nIF(MATCH(1,$B59:$B65,0)<  $B58+MATCH(1,$B58:$B65,0)+COLUMN(K$1)-2,\"\",\nINDEX($A58:$A65,$B58+MATCH(1,$B58:$B65,0)+COLUMN(K$1)-2)),\"\")","v":""},{"$f":"IF(AND($B58=1,$A58<>\"\"),\nIF(MATCH(1,$B59:$B65,0)<  $B58+MATCH(1,$B58:$B65,0)+COLUMN(L$1)-2,\"\",\nINDEX($A58:$A65,$B58+MATCH(1,$B58:$B65,0)+COLUMN(L$1)-2)),\"\")","v":""},{"$f":"IF(AND($B58=1,$A58<>\"\"),\nIF(MATCH(1,$B59:$B65,0)<  $B58+MATCH(1,$B58:$B65,0)+COLUMN(M$1)-2,\"\",\nINDEX($A58:$A65,$B58+MATCH(1,$B58:$B65,0)+COLUMN(M$1)-2)),\"\")","v":""},{"$f":"IF(AND($B58=1,$A58<>\"\"),\nIF(MATCH(1,$B59:$B65,0)<  $B58+MATCH(1,$B58:$B65,0)+COLUMN(N$1)-2,\"\",\nINDEX($A58:$A65,$B58+MATCH(1,$B58:$B65,0)+COLUMN(N$1)-2)),\"\")","v":""},{"$f":"IF(AND($B58=1,$A58<>\"\"),\nIF(MATCH(1,$B59:$B65,0)<  $B58+MATCH(1,$B58:$B65,0)+COLUMN(O$1)-2,\"\",\nINDEX($A58:$A65,$B58+MATCH(1,$B58:$B65,0)+COLUMN(O$1)-2)),\"\")","v":""}]
["13.    ОАО \"Завод бурового оборудования\" ",{"$f":"IF(OR(ISNUMBER(--LEFTB(A59,SEARCH(\".\",A59,1)-1)),COUNTA(A59:$A$9123)=0),1,B58+1)","v":1},{"$f":"IF(AND($B59=1,$A59<>\"\"),\nIF(MATCH(1,$B60:$B65,0)<  $B59+MATCH(1,$B59:$B65,0)+COLUMN(A$1)-2,\"\",\nINDEX($A59:$A65,$B59+MATCH(1,$B59:$B65,0)+COLUMN(A$1)-2)),\"\")","v":"13.    ОАО \"Завод бурового оборудования\" "},{"$f":"IF(AND($B59=1,$A59<>\"\"),\nIF(MATCH(1,$B60:$B65,0)<  $B59+MATCH(1,$B59:$B65,0)+COLUMN(B$1)-2,\"\",\nINDEX($A59:$A65,$B59+MATCH(1,$B59:$B65,0)+COLUMN(B$1)-2)),\"\")","v":"       Генеральный директор Медведев Александр Константинович "},{"$f":"IF(AND($B59=1,$A59<>\"\"),\nIF(MATCH(1,$B60:$B65,0)<  $B59+MATCH(1,$B59:$B65,0)+COLUMN(C$1)-2,\"\",\nINDEX($A59:$A65,$B59+MATCH(1,$B59:$B65,0)+COLUMN(C$1)-2)),\"\")","v":" Нечеухин Владимир Васильевич – помощник генерального директора "},{"$f":"IF(AND($B59=1,$A59<>\"\"),\nIF(MATCH(1,$B60:$B65,0)<  $B59+MATCH(1,$B59:$B65,0)+COLUMN(D$1)-2,\"\",\nINDEX($A59:$A65,$B59+MATCH(1,$B59:$B65,0)+COLUMN(D$1)-2)),\"\")","v":"адрес: 460026 г. Оренбург, пр. Победы, 118 "},{"$f":"IF(AND($B59=1,$A59<>\"\"),\nIF(MATCH(1,$B60:$B65,0)<  $B59+MATCH(1,$B59:$B65,0)+COLUMN(E$1)-2,\"\",\nINDEX($A59:$A65,$B59+MATCH(1,$B59:$B65,0)+COLUMN(E$1)-2)),\"\")","v":"Тел. 75-68-14; факс 75-68-19; e-mail: pochta@zbo.ru; сайт: www.zbo.ru medvedev@zbo.ru "},{"$f":"IF(AND($B59=1,$A59<>\"\"),\nIF(MATCH(1,$B60:$B65,0)<  $B59+MATCH(1,$B59:$B65,0)+COLUMN(F$1)-2,\"\",\nINDEX($A59:$A65,$B59+MATCH(1,$B59:$B65,0)+COLUMN(F$1)-2)),\"\")","v":""},{"$f":"IF(AND($B59=1,$A59<>\"\"),\nIF(MATCH(1,$B60:$B65,0)<  $B59+MATCH(1,$B59:$B65,0)+COLUMN(G$1)-2,\"\",\nINDEX($A59:$A65,$B59+MATCH(1,$B59:$B65,0)+COLUMN(G$1)-2)),\"\")","v":""},{"$f":"IF(AND($B59=1,$A59<>\"\"),\nIF(MATCH(1,$B60:$B65,0)<  $B59+MATCH(1,$B59:$B65,0)+COLUMN(H$1)-2,\"\",\nINDEX($A59:$A65,$B59+MATCH(1,$B59:$B65,0)+COLUMN(H$1)-2)),\"\")","v":""},{"$f":"IF(AND($B59=1,$A59<>\"\"),\nIF(MATCH(1,$B60:$B65,0)<  $B59+MATCH(1,$B59:$B65,0)+COLUMN(I$1)-2,\"\",\nINDEX($A59:$A65,$B59+MATCH(1,$B59:$B65,0)+COLUMN(I$1)-2)),\"\")","v":""},{"$f":"IF(AND($B59=1,$A59<>\"\"),\nIF(MATCH(1,$B60:$B65,0)<  $B59+MATCH(1,$B59:$B65,0)+COLUMN(J$1)-2,\"\",\nINDEX($A59:$A65,$B59+MATCH(1,$B59:$B65,0)+COLUMN(J$1)-2)),\"\")","v":""},{"$f":"IF(AND($B59=1,$A59<>\"\"),\nIF(MATCH(1,$B60:$B65,0)<  $B59+MATCH(1,$B59:$B65,0)+COLUMN(K$1)-2,\"\",\nINDEX($A59:$A65,$B59+MATCH(1,$B59:$B65,0)+COLUMN(K$1)-2)),\"\")","v":""},{"$f":"IF(AND($B59=1,$A59<>\"\"),\nIF(MATCH(1,$B60:$B65,0)<  $B59+MATCH(1,$B59:$B65,0)+COLUMN(L$1)-2,\"\",\nINDEX($A59:$A65,$B59+MATCH(1,$B59:$B65,0)+COLUMN(L$1)-2)),\"\")","v":""},{"$f":"IF(AND($B59=1,$A59<>\"\"),\nIF(MATCH(1,$B60:$B65,0)<  $B59+MATCH(1,$B59:$B65,0)+COLUMN(M$1)-2,\"\",\nINDEX($A59:$A65,$B59+MATCH(1,$B59:$B65,0)+COLUMN(M$1)-2)),\"\")","v":""},{"$f":"IF(AND($B59=1,$A59<>\"\"),\nIF(MATCH(1,$B60:$B65,0)<  $B59+MATCH(1,$B59:$B65,0)+COLUMN(N$1)-2,\"\",\nINDEX($A59:$A65,$B59+MATCH(1,$B59:$B65,0)+COLUMN(N$1)-2)),\"\")","v":""},{"$f":"IF(AND($B59=1,$A59<>\"\"),\nIF(MATCH(1,$B60:$B65,0)<  $B59+MATCH(1,$B59:$B65,0)+COLUMN(O$1)-2,\"\",\nINDEX($A59:$A65,$B59+MATCH(1,$B59:$B65,0)+COLUMN(O$1)-2)),\"\")","v":""}]
["       Генеральный директор Медведев Александр Константинович ",{"$f":"IF(OR(ISNUMBER(--LEFTB(A60,SEARCH(\".\",A60,1)-1)),COUNTA(A60:$A$9123)=0),1,B59+1)","v":2},{"$f":"IF(AND($B60=1,$A60<>\"\"),\nIF(MATCH(1,$B61:$B65,0)<  $B60+MATCH(1,$B60:$B65,0)+COLUMN(A$1)-2,\"\",\nINDEX($A60:$A65,$B60+MATCH(1,$B60:$B65,0)+COLUMN(A$1)-2)),\"\")","v":""},{"$f":"IF(AND($B60=1,$A60<>\"\"),\nIF(MATCH(1,$B61:$B65,0)<  $B60+MATCH(1,$B60:$B65,0)+COLUMN(B$1)-2,\"\",\nINDEX($A60:$A65,$B60+MATCH(1,$B60:$B65,0)+COLUMN(B$1)-2)),\"\")","v":""},{"$f":"IF(AND($B60=1,$A60<>\"\"),\nIF(MATCH(1,$B61:$B65,0)<  $B60+MATCH(1,$B60:$B65,0)+COLUMN(C$1)-2,\"\",\nINDEX($A60:$A65,$B60+MATCH(1,$B60:$B65,0)+COLUMN(C$1)-2)),\"\")","v":""},{"$f":"IF(AND($B60=1,$A60<>\"\"),\nIF(MATCH(1,$B61:$B65,0)<  $B60+MATCH(1,$B60:$B65,0)+COLUMN(D$1)-2,\"\",\nINDEX($A60:$A65,$B60+MATCH(1,$B60:$B65,0)+COLUMN(D$1)-2)),\"\")","v":""},{"$f":"IF(AND($B60=1,$A60<>\"\"),\nIF(MATCH(1,$B61:$B65,0)<  $B60+MATCH(1,$B60:$B65,0)+COLUMN(E$1)-2,\"\",\nINDEX($A60:$A65,$B60+MATCH(1,$B60:$B65,0)+COLUMN(E$1)-2)),\"\")","v":""},{"$f":"IF(AND($B60=1,$A60<>\"\"),\nIF(MATCH(1,$B61:$B65,0)<  $B60+MATCH(1,$B60:$B65,0)+COLUMN(F$1)-2,\"\",\nINDEX($A60:$A65,$B60+MATCH(1,$B60:$B65,0)+COLUMN(F$1)-2)),\"\")","v":""},{"$f":"IF(AND($B60=1,$A60<>\"\"),\nIF(MATCH(1,$B61:$B65,0)<  $B60+MATCH(1,$B60:$B65,0)+COLUMN(G$1)-2,\"\",\nINDEX($A60:$A65,$B60+MATCH(1,$B60:$B65,0)+COLUMN(G$1)-2)),\"\")","v":""},{"$f":"IF(AND($B60=1,$A60<>\"\"),\nIF(MATCH(1,$B61:$B65,0)<  $B60+MATCH(1,$B60:$B65,0)+COLUMN(H$1)-2,\"\",\nINDEX($A60:$A65,$B60+MATCH(1,$B60:$B65,0)+COLUMN(H$1)-2)),\"\")","v":""},{"$f":"IF(AND($B60=1,$A60<>\"\"),\nIF(MATCH(1,$B61:$B65,0)<  $B60+MATCH(1,$B60:$B65,0)+COLUMN(I$1)-2,\"\",\nINDEX($A60:$A65,$B60+MATCH(1,$B60:$B65,0)+COLUMN(I$1)-2)),\"\")","v":""},{"$f":"IF(AND($B60=1,$A60<>\"\"),\nIF(MATCH(1,$B61:$B65,0)<  $B60+MATCH(1,$B60:$B65,0)+COLUMN(J$1)-2,\"\",\nINDEX($A60:$A65,$B60+MATCH(1,$B60:$B65,0)+COLUMN(J$1)-2)),\"\")","v":""},{"$f":"IF(AND($B60=1,$A60<>\"\"),\nIF(MATCH(1,$B61:$B65,0)<  $B60+MATCH(1,$B60:$B65,0)+COLUMN(K$1)-2,\"\",\nINDEX($A60:$A65,$B60+MATCH(1,$B60:$B65,0)+COLUMN(K$1)-2)),\"\")","v":""},{"$f":"IF(AND($B60=1,$A60<>\"\"),\nIF(MATCH(1,$B61:$B65,0)<  $B60+MATCH(1,$B60:$B65,0)+COLUMN(L$1)-2,\"\",\nINDEX($A60:$A65,$B60+MATCH(1,$B60:$B65,0)+COLUMN(L$1)-2)),\"\")","v":""},{"$f":"IF(AND($B60=1,$A60<>\"\"),\nIF(MATCH(1,$B61:$B65,0)<  $B60+MATCH(1,$B60:$B65,0)+COLUMN(M$1)-2,\"\",\nINDEX($A60:$A65,$B60+MATCH(1,$B60:$B65,0)+COLUMN(M$1)-2)),\"\")","v":""},{"$f":"IF(AND($B60=1,$A60<>\"\"),\nIF(MATCH(1,$B61:$B65,0)<  $B60+MATCH(1,$B60:$B65,0)+COLUMN(N$1)-2,\"\",\nINDEX($A60:$A65,$B60+MATCH(1,$B60:$B65,0)+COLUMN(N$1)-2)),\"\")","v":""},{"$f":"IF(AND($B60=1,$A60<>\"\"),\nIF(MATCH(1,$B61:$B65,0)<  $B60+MATCH(1,$B60:$B65,0)+COLUMN(O$1)-2,\"\",\nINDEX($A60:$A65,$B60+MATCH(1,$B60:$B65,0)+COLUMN(O$1)-2)),\"\")","v":""}]
[" Нечеухин Владимир Васильевич – помощник генерального директора ",{"$f":"IF(OR(ISNUMBER(--LEFTB(A61,SEARCH(\".\",A61,1)-1)),COUNTA(A61:$A$9123)=0),1,B60+1)","v":3},{"$f":"IF(AND($B61=1,$A61<>\"\"),\nIF(MATCH(1,$B62:$B65,0)<  $B61+MATCH(1,$B61:$B65,0)+COLUMN(A$1)-2,\"\",\nINDEX($A61:$A65,$B61+MATCH(1,$B61:$B65,0)+COLUMN(A$1)-2)),\"\")","v":""},{"$f":"IF(AND($B61=1,$A61<>\"\"),\nIF(MATCH(1,$B62:$B65,0)<  $B61+MATCH(1,$B61:$B65,0)+COLUMN(B$1)-2,\"\",\nINDEX($A61:$A65,$B61+MATCH(1,$B61:$B65,0)+COLUMN(B$1)-2)),\"\")","v":""},{"$f":"IF(AND($B61=1,$A61<>\"\"),\nIF(MATCH(1,$B62:$B65,0)<  $B61+MATCH(1,$B61:$B65,0)+COLUMN(C$1)-2,\"\",\nINDEX($A61:$A65,$B61+MATCH(1,$B61:$B65,0)+COLUMN(C$1)-2)),\"\")","v":""},{"$f":"IF(AND($B61=1,$A61<>\"\"),\nIF(MATCH(1,$B62:$B65,0)<  $B61+MATCH(1,$B61:$B65,0)+COLUMN(D$1)-2,\"\",\nINDEX($A61:$A65,$B61+MATCH(1,$B61:$B65,0)+COLUMN(D$1)-2)),\"\")","v":""},{"$f":"IF(AND($B61=1,$A61<>\"\"),\nIF(MATCH(1,$B62:$B65,0)<  $B61+MATCH(1,$B61:$B65,0)+COLUMN(E$1)-2,\"\",\nINDEX($A61:$A65,$B61+MATCH(1,$B61:$B65,0)+COLUMN(E$1)-2)),\"\")","v":""},{"$f":"IF(AND($B61=1,$A61<>\"\"),\nIF(MATCH(1,$B62:$B65,0)<  $B61+MATCH(1,$B61:$B65,0)+COLUMN(F$1)-2,\"\",\nINDEX($A61:$A65,$B61+MATCH(1,$B61:$B65,0)+COLUMN(F$1)-2)),\"\")","v":""},{"$f":"IF(AND($B61=1,$A61<>\"\"),\nIF(MATCH(1,$B62:$B65,0)<  $B61+MATCH(1,$B61:$B65,0)+COLUMN(G$1)-2,\"\",\nINDEX($A61:$A65,$B61+MATCH(1,$B61:$B65,0)+COLUMN(G$1)-2)),\"\")","v":""},{"$f":"IF(AND($B61=1,$A61<>\"\"),\nIF(MATCH(1,$B62:$B65,0)<  $B61+MATCH(1,$B61:$B65,0)+COLUMN(H$1)-2,\"\",\nINDEX($A61:$A65,$B61+MATCH(1,$B61:$B65,0)+COLUMN(H$1)-2)),\"\")","v":""},{"$f":"IF(AND($B61=1,$A61<>\"\"),\nIF(MATCH(1,$B62:$B65,0)<  $B61+MATCH(1,$B61:$B65,0)+COLUMN(I$1)-2,\"\",\nINDEX($A61:$A65,$B61+MATCH(1,$B61:$B65,0)+COLUMN(I$1)-2)),\"\")","v":""},{"$f":"IF(AND($B61=1,$A61<>\"\"),\nIF(MATCH(1,$B62:$B65,0)<  $B61+MATCH(1,$B61:$B65,0)+COLUMN(J$1)-2,\"\",\nINDEX($A61:$A65,$B61+MATCH(1,$B61:$B65,0)+COLUMN(J$1)-2)),\"\")","v":""},{"$f":"IF(AND($B61=1,$A61<>\"\"),\nIF(MATCH(1,$B62:$B65,0)<  $B61+MATCH(1,$B61:$B65,0)+COLUMN(K$1)-2,\"\",\nINDEX($A61:$A65,$B61+MATCH(1,$B61:$B65,0)+COLUMN(K$1)-2)),\"\")","v":""},{"$f":"IF(AND($B61=1,$A61<>\"\"),\nIF(MATCH(1,$B62:$B65,0)<  $B61+MATCH(1,$B61:$B65,0)+COLUMN(L$1)-2,\"\",\nINDEX($A61:$A65,$B61+MATCH(1,$B61:$B65,0)+COLUMN(L$1)-2)),\"\")","v":""},{"$f":"IF(AND($B61=1,$A61<>\"\"),\nIF(MATCH(1,$B62:$B65,0)<  $B61+MATCH(1,$B61:$B65,0)+COLUMN(M$1)-2,\"\",\nINDEX($A61:$A65,$B61+MATCH(1,$B61:$B65,0)+COLUMN(M$1)-2)),\"\")","v":""},{"$f":"IF(AND($B61=1,$A61<>\"\"),\nIF(MATCH(1,$B62:$B65,0)<  $B61+MATCH(1,$B61:$B65,0)+COLUMN(N$1)-2,\"\",\nINDEX($A61:$A65,$B61+MATCH(1,$B61:$B65,0)+COLUMN(N$1)-2)),\"\")","v":""},{"$f":"IF(AND($B61=1,$A61<>\"\"),\nIF(MATCH(1,$B62:$B65,0)<  $B61+MATCH(1,$B61:$B65,0)+COLUMN(O$1)-2,\"\",\nINDEX($A61:$A65,$B61+MATCH(1,$B61:$B65,0)+COLUMN(O$1)-2)),\"\")","v":""}]
["адрес: 460026 г. Оренбург, пр. Победы, 118 ",{"$f":"IF(OR(ISNUMBER(--LEFTB(A62,SEARCH(\".\",A62,1)-1)),COUNTA(A62:$A$9123)=0),1,B61+1)","v":4},{"$f":"IF(AND($B62=1,$A62<>\"\"),\nIF(MATCH(1,$B63:$B65,0)<  $B62+MATCH(1,$B62:$B65,0)+COLUMN(A$1)-2,\"\",\nINDEX($A62:$A65,$B62+MATCH(1,$B62:$B65,0)+COLUMN(A$1)-2)),\"\")","v":""},{"$f":"IF(AND($B62=1,$A62<>\"\"),\nIF(MATCH(1,$B63:$B65,0)<  $B62+MATCH(1,$B62:$B65,0)+COLUMN(B$1)-2,\"\",\nINDEX($A62:$A65,$B62+MATCH(1,$B62:$B65,0)+COLUMN(B$1)-2)),\"\")","v":""},{"$f":"IF(AND($B62=1,$A62<>\"\"),\nIF(MATCH(1,$B63:$B65,0)<  $B62+MATCH(1,$B62:$B65,0)+COLUMN(C$1)-2,\"\",\nINDEX($A62:$A65,$B62+MATCH(1,$B62:$B65,0)+COLUMN(C$1)-2)),\"\")","v":""},{"$f":"IF(AND($B62=1,$A62<>\"\"),\nIF(MATCH(1,$B63:$B65,0)<  $B62+MATCH(1,$B62:$B65,0)+COLUMN(D$1)-2,\"\",\nINDEX($A62:$A65,$B62+MATCH(1,$B62:$B65,0)+COLUMN(D$1)-2)),\"\")","v":""},{"$f":"IF(AND($B62=1,$A62<>\"\"),\nIF(MATCH(1,$B63:$B65,0)<  $B62+MATCH(1,$B62:$B65,0)+COLUMN(E$1)-2,\"\",\nINDEX($A62:$A65,$B62+MATCH(1,$B62:$B65,0)+COLUMN(E$1)-2)),\"\")","v":""},{"$f":"IF(AND($B62=1,$A62<>\"\"),\nIF(MATCH(1,$B63:$B65,0)<  $B62+MATCH(1,$B62:$B65,0)+COLUMN(F$1)-2,\"\",\nINDEX($A62:$A65,$B62+MATCH(1,$B62:$B65,0)+COLUMN(F$1)-2)),\"\")","v":""},{"$f":"IF(AND($B62=1,$A62<>\"\"),\nIF(MATCH(1,$B63:$B65,0)<  $B62+MATCH(1,$B62:$B65,0)+COLUMN(G$1)-2,\"\",\nINDEX($A62:$A65,$B62+MATCH(1,$B62:$B65,0)+COLUMN(G$1)-2)),\"\")","v":""},{"$f":"IF(AND($B62=1,$A62<>\"\"),\nIF(MATCH(1,$B63:$B65,0)<  $B62+MATCH(1,$B62:$B65,0)+COLUMN(H$1)-2,\"\",\nINDEX($A62:$A65,$B62+MATCH(1,$B62:$B65,0)+COLUMN(H$1)-2)),\"\")","v":""},{"$f":"IF(AND($B62=1,$A62<>\"\"),\nIF(MATCH(1,$B63:$B65,0)<  $B62+MATCH(1,$B62:$B65,0)+COLUMN(I$1)-2,\"\",\nINDEX($A62:$A65,$B62+MATCH(1,$B62:$B65,0)+COLUMN(I$1)-2)),\"\")","v":""},{"$f":"IF(AND($B62=1,$A62<>\"\"),\nIF(MATCH(1,$B63:$B65,0)<  $B62+MATCH(1,$B62:$B65,0)+COLUMN(J$1)-2,\"\",\nINDEX($A62:$A65,$B62+MATCH(1,$B62:$B65,0)+COLUMN(J$1)-2)),\"\")","v":""},{"$f":"IF(AND($B62=1,$A62<>\"\"),\nIF(MATCH(1,$B63:$B65,0)<  $B62+MATCH(1,$B62:$B65,0)+COLUMN(K$1)-2,\"\",\nINDEX($A62:$A65,$B62+MATCH(1,$B62:$B65,0)+COLUMN(K$1)-2)),\"\")","v":""},{"$f":"IF(AND($B62=1,$A62<>\"\"),\nIF(MATCH(1,$B63:$B65,0)<  $B62+MATCH(1,$B62:$B65,0)+COLUMN(L$1)-2,\"\",\nINDEX($A62:$A65,$B62+MATCH(1,$B62:$B65,0)+COLUMN(L$1)-2)),\"\")","v":""},{"$f":"IF(AND($B62=1,$A62<>\"\"),\nIF(MATCH(1,$B63:$B65,0)<  $B62+MATCH(1,$B62:$B65,0)+COLUMN(M$1)-2,\"\",\nINDEX($A62:$A65,$B62+MATCH(1,$B62:$B65,0)+COLUMN(M$1)-2)),\"\")","v":""},{"$f":"IF(AND($B62=1,$A62<>\"\"),\nIF(MATCH(1,$B63:$B65,0)<  $B62+MATCH(1,$B62:$B65,0)+COLUMN(N$1)-2,\"\",\nINDEX($A62:$A65,$B62+MATCH(1,$B62:$B65,0)+COLUMN(N$1)-2)),\"\")","v":""},{"$f":"IF(AND($B62=1,$A62<>\"\"),\nIF(MATCH(1,$B63:$B65,0)<  $B62+MATCH(1,$B62:$B65,0)+COLUMN(O$1)-2,\"\",\nINDEX($A62:$A65,$B62+MATCH(1,$B62:$B65,0)+COLUMN(O$1)-2)),\"\")","v":""}]
["Тел. 75-68-14; факс 75-68-19; e-mail: pochta@zbo.ru; сайт: www.zbo.ru medvedev@zbo.ru ",{"$f":"IF(OR(ISNUMBER(--LEFTB(A63,SEARCH(\".\",A63,1)-1)),COUNTA(A63:$A$9123)=0),1,B62+1)","v":5},{"$f":"IF(AND($B63=1,$A63<>\"\"),\nIF(MATCH(1,$B64:$B66,0)<  $B63+MATCH(1,$B63:$B66,0)+COLUMN(A$1)-2,\"\",\nINDEX($A63:$A66,$B63+MATCH(1,$B63:$B66,0)+COLUMN(A$1)-2)),\"\")","v":""},"","","","","","","","","","","","","",""]
["14.    ООО «Каталоги Справочники Путеводители - Оренбург»",{"$f":"IF(OR(ISNUMBER(--LEFTB(A64,SEARCH(\".\",A64,1)-1)),COUNTA(A64:$A$9123)=0),1,B63+1)","v":1},{"$f":"IF(AND($B64=1,$A64<>\"\"),\nIF(MATCH(1,$B65:$B67,0)<  $B64+MATCH(1,$B64:$B67,0)+COLUMN(A$1)-2,\"\",\nINDEX($A64:$A67,$B64+MATCH(1,$B64:$B67,0)+COLUMN(A$1)-2)),\"\")","v":"14.    ООО «Каталоги Справочники Путеводители - Оренбург»"},"Управляющий директор Киселёв Сергей Анатольевич ","","","","","","","","","","","","",""]
["Управляющий директор Киселёв Сергей Анатольевич ",{"$f":"IF(OR(ISNUMBER(--LEFTB(A65,SEARCH(\".\",A65,1)-1)),COUNTA(A65:$A$9123)=0),1,B64+1)","v":2},{"$f":"IF(AND($B65=1,$A65<>\"\"),\nIF(MATCH(1,$B66:$B68,0)<  $B65+MATCH(1,$B65:$B68,0)+COLUMN(A$1)-2,\"\",\nINDEX($A65:$A68,$B65+MATCH(1,$B65:$B68,0)+COLUMN(A$1)-2)),\"\")","v":""},"","","","","","","","","","","","","",""]
[null,{"$f":"IF(OR(ISNUMBER(--LEFTB(A66,SEARCH(\".\",A66,1)-1)),COUNTA(A66:$A$9123)=0),1,B65+1)","v":1},{"$f":"IF(AND($B66=1,$A66<>\"\"),\nIF(MATCH(1,$B67:$B69,0)<  $B66+MATCH(1,$B66:$B69,0)+COLUMN(A$1)-2,\"\",\nINDEX($A66:$A69,$B66+MATCH(1,$B66:$B69,0)+COLUMN(A$1)-2)),\"\")","v":""},"","","","","","","","","","","","","",""]
[null,{"$f":"IF(OR(ISNUMBER(--LEFTB(A67,SEARCH(\".\",A67,1)-1)),COUNTA(A67:$A$9123)=0),1,B66+1)","v":1},{"$f":"IF(AND($B67=1,$A67<>\"\"),\nIF(MATCH(1,$B68:$B70,0)<  $B67+MATCH(1,$B67:$B70,0)+COLUMN(A$1)-2,\"\",\nINDEX($A67:$A70,$B67+MATCH(1,$B67:$B70,0)+COLUMN(A$1)-2)),\"\")","v":""},"","","","","","","","","","","","","",""]
[null,{"$f":"IF(OR(ISNUMBER(--LEFTB(A68,SEARCH(\".\",A68,1)-1)),COUNTA(A68:$A$9123)=0),1,B67+1)","v":1},{"$f":"IF(AND($B68=1,$A68<>\"\"),\nIF(MATCH(1,$B69:$B71,0)<  $B68+MATCH(1,$B68:$B71,0)+COLUMN(A$1)-2,\"\",\nINDEX($A68:$A71,$B68+MATCH(1,$B68:$B71,0)+COLUMN(A$1)-2)),\"\")","v":""},"","","","","","","","","","","","","",""]
[null,{"$f":"IF(OR(ISNUMBER(--LEFTB(A69,SEARCH(\".\",A69,1)-1)),COUNTA(A69:$A$9123)=0),1,B68+1)","v":1},{"$f":"IF(AND($B69=1,$A69<>\"\"),\nIF(MATCH(1,$B70:$B72,0)<  $B69+MATCH(1,$B69:$B72,0)+COLUMN(A$1)-2,\"\",\nINDEX($A69:$A72,$B69+MATCH(1,$B69:$B72,0)+COLUMN(A$1)-2)),\"\")","v":""},"","","","","","","","","","","","","",""]
[null,null,{"$f":"IF(AND($B70=1,$A70<>\"\"),\nIF(MATCH(1,$B71:$B73,0)<  $B70+MATCH(1,$B70:$B73,0)+COLUMN(A$1)-2,\"\",\nINDEX($A70:$A73,$B70+MATCH(1,$B70:$B73,0)+COLUMN(A$1)-2)),\"\")","v":""},"","","","","","","","","","","","","",""]

{"sheet":"Что дожно получиться","index":1,"n_rows":4,"n_cols":5,"rows_kept":4,"cut":false,"hidden":false,"merged":[]}
["Компания","Руководитель","Адрес","Телефон","Мыло"]
["г. ОРЕНБУРГ"]
["2.    ООО «Торговый Дом» «Саракташский молочный завод»","Генеральный директор Ахмеров Наиль Ирфатович ","адрес: 460038 г.Оренбург, ул. Братская,6","т/ф. 64-65-29, 38-21-21, e-ральская стальmail: td-saraktash@yandex.ru или td-saraktash@mail.ru","сайт: www.anairzavod.ru"]
["3.    ОАО \"Банк \"Оренбург\" ","Председатель Правления Самойлов Юрий Владимирович","адрес: 460024 г.Оренбург, ул.Маршала Г.К. Жукова, 25 ","Тел. 343-000;  факс: 343-111; приемная 343-008","e-mail: info@orbank.ru; сайт: www.orbank.ru"]

{"sheet":"Лист3","index":2,"n_rows":0,"n_cols":0,"rows_kept":0,"cut":false,"hidden":false,"merged":[]}