{"text_format":"1","workbook":"xlsx","n_sheets":3,"sheets":["Лист1","Лист2","Лист3"],"not_rendered":{"charts":0,"images":0,"macros":1,"external_links":0,"defined_names":0,"comments":0,"pivot_tables":0},"unopened":[],"bounds":{"document_bytes":16777216,"sheet_cells":100000,"rows_first":2000,"rows_last":500,"rows_between":2000,"halvings":0,"cell_chars":16384,"cell_head_chars":4096},"cells_cut":0,"cells_raw":0,"read":"whole","date_system":"1900"}

{"sheet":"Лист1","index":0,"n_rows":103,"n_cols":27,"rows_kept":103,"cut":false,"hidden":false,"merged":[[0,18,0,20],[0,22,0,26]]}
[null,null,"x","xyyyyyyzzzzzz","результат","y","y","y","y","y","y","z","z","z","z","z","z","через UDF","последовательность в зависимости от первой цифры",null,null,"Проверка","какой символ соответствует цифре"]
[292010008001,{"$f":"10-MID((MID(A2,2,1)+MID(A2,4,1)+MID(A2,6,1)+MID(A2,8,1)+MID(A2,10,1)+MID(A2,12,1))*3+MID(A2,1,1)+MID(A2,3,1)+MID(A2,5,1)+MID(A2,7,1)+MID(A2,9,1)+MID(A2,11,1),2,1)","v":7},{"$f":"IF(B2<10,B2,0)","v":7},{"$f":"C2*1000000000000+A2","v":7292010008001},{"$f":"VLOOKUP($C2,$W$3:$X$12,2,0)&\"!\"&F2&G2&H2&I2&J2&K2&\"-\"&L2&M2&N2&O2&P2&Q2&\"!\"","v":"*!2J2A1A-aaiaab!"},{"$f":"INDEX($X$3:$AA$12,MATCH(--MID($A2,COLUMN(A1),1),$W$3:$W$12,0),MATCH(MID(VLOOKUP($C2,$S$3:$T$12,2,0),COLUMN(A1),1),$X$2:$AA$2,0))","v":2},{"$f":"INDEX($X$3:$AA$12,MATCH(--MID($A2,COLUMN(B1),1),$W$3:$W$12,0),MATCH(MID(VLOOKUP($C2,$S$3:$T$12,2,0),COLUMN(B1),1),$X$2:$AA$2,0))","v":"J"},2,"A",1,"A",{"$f":"LOWER(INDEX($AA$3:$AA$12,MATCH(--MID($A2,COLUMN(G1),1),$W$3:$W$12,0)))","v":"a"},{"$f":"LOWER(INDEX($AA$3:$AA$12,MATCH(--MID($A2,COLUMN(H1),1),$W$3:$W$12,0)))","v":"a"},"i","a","a",{"$f":"LOWER(INDEX($AA$3:$AA$12,MATCH(--MID($A2,COLUMN(L1),1),$W$3:$W$12,0)))","v":"b"},{"$f":"getEAN13(D2)","v":"*!2J2A1A-aaiaab!"},"x","yyyyyyy","zzzzzz",{"$f":"E2=R2","v":true},null,"X","L","S","s"]
[{"$f":"A2+1","v":292010008002},{"$f":"10-MID((MID(A3,2,1)+MID(A3,4,1)+MID(A3,6,1)+MID(A3,8,1)+MID(A3,10,1)+MID(A3,12,1))*3+MID(A3,1,1)+MID(A3,3,1)+MID(A3,5,1)+MID(A3,7,1)+MID(A3,9,1)+MID(A3,11,1),2,1)","v":4},{"$f":"IF(B3<10,B3,0)","v":4},4292010008002,{"$f":"VLOOKUP($C3,$W$3:$X$12,2,0)&\"!\"&F3&G3&H3&I3&J3&K3&\"-\"&L3&M3&N3&O3&P3&Q3&\"!\"","v":"'!2J20BA-aaiaac!"},{"$f":"INDEX($X$3:$AA$12,MATCH(--MID($A3,COLUMN(A2),1),$W$3:$W$12,0),MATCH(MID(VLOOKUP($C3,$S$3:$T$12,2,0),COLUMN(A2),1),$X$2:$AA$2,0))","v":2},{"$f":"INDEX($X$3:$AA$12,MATCH(--MID($A3,COLUMN(B2),1),$W$3:$W$12,0),MATCH(MID(VLOOKUP($C3,$S$3:$T$12,2,0),COLUMN(B2),1),$X$2:$AA$2,0))","v":"J"},{"$f":"INDEX($X$3:$AA$12,MATCH(--MID($A3,COLUMN(C2),1),$W$3:$W$12,0),MATCH(MID(VLOOKUP($C3,$S$3:$T$12,2,0),COLUMN(C2),1),$X$2:$AA$2,0))","v":2},{"$f":"INDEX($X$3:$AA$12,MATCH(--MID($A3,COLUMN(D2),1),$W$3:$W$12,0),MATCH(MID(VLOOKUP($C3,$S$3:$T$12,2,0),COLUMN(D2),1),$X$2:$AA$2,0))","v":0},{"$f":"INDEX($X$3:$AA$12,MATCH(--MID($A3,COLUMN(E2),1),$W$3:$W$12,0),MATCH(MID(VLOOKUP($C3,$S$3:$T$12,2,0),COLUMN(E2),1),$X$2:$AA$2,0))","v":"B"},{"$f":"INDEX($X$3:$AA$12,MATCH(--MID($A3,COLUMN(F2),1),$W$3:$W$12,0),MATCH(MID(VLOOKUP($C3,$S$3:$T$12,2,0),COLUMN(F2),1),$X$2:$AA$2,0))","v":"A"},{"$f":"LOWER(INDEX($AA$3:$AA$12,MATCH(--MID($A3,COLUMN(G2),1),$W$3:$W$12,0)))","v":"a"},{"$f":"LOWER(INDEX($AA$3:$AA$12,MATCH(--MID($A3,COLUMN(H2),1),$W$3:$W$12,0)))","v":"a"},{"$f":"LOWER(INDEX($AA$3:$AA$12,MATCH(--MID($A3,COLUMN(I2),1),$W$3:$W$12,0)))","v":"i"},{"$f":"LOWER(INDEX($AA$3:$AA$12,MATCH(--MID($A3,COLUMN(J2),1),$W$3:$W$12,0)))","v":"a"},{"$f":"LOWER(INDEX($AA$3:$AA$12,MATCH(--MID($A3,COLUMN(K2),1),$W$3:$W$12,0)))","v":"a"},{"$f":"LOWER(INDEX($AA$3:$AA$12,MATCH(--MID($A3,COLUMN(L2),1),$W$3:$W$12,0)))","v":"c"},{"$f":"getEAN13(D3)","v":"'!2J20BA-aaiaac!"},0,"LLLLLL","ssssss",{"$f":"E3=R3","v":true},0,"#",0,"A","a"]
[{"$f":"A3+1","v":292010008003},1,1,1292010008003,{"$f":"VLOOKUP($C4,$W$3:$X$12,2,0)&\"!\"&F4&G4&H4&I4&J4&K4&\"-\"&L4&M4&N4&O4&P4&Q4&\"!\"","v":"$!29C0BA-aaiaad!"},2,9,"C",0,"B","A","a","a","i","a","a","d","$!29C0BA-aaiaad!",1,"LLSLSS","ssssss",true,1,"$",1,"B","b"]
[292010008004,8,8,8292010008004,"+!2J2AB0-aaiaae!",2,"J",2,"A","B",0,"a","a","i","a","a","e","+!2J2AB0-aaiaae!",2,"LLSSLS","ssssss",true,2,"%",2,"C","c"]
[292010008005,5,5,5292010008005,"(!2JC01A-aaiaaf!",2,"J","C",0,1,"A","a","a","i","a","a","f","(!2JC01A-aaiaaf!",3,"LLSSSL","ssssss",true,3,"&",3,"D","d"]
[292010008006,2,2,2292010008006,"%!29CA1A-aaiaag!",2,9,"C","A",1,"A","a","a","i","a","a","g","%!29CA1A-aaiaag!",4,"LSLLSS","ssssss",true,4,"'",4,"E","e"]
[292010008007,9,9,9292010008007,",!2JC0B0-aaiaah!",2,"J","C",0,"B",0,"a","a","i","a","a","h",",!2JC0B0-aaiaah!",5,"LSSLLS","ssssss",true,5,"(",5,"F","f"]
[292010008008,6,6,6292010008008,")!2JCA10-aaiaai!",2,"J","C","A",1,0,"a","a","i","a","a","i",")!2JCA10-aaiaai!",6,"LSSSLL","ssssss",true,6,")",6,"G","g"]
[292010008009,3,3,3292010008009,"&!29CAB0-aaiaaj!",2,9,"C","A","B",0,"a","a","i","a","a","j","&!29CAB0-aaiaaj!",7,"LSLSLS","ssssss",true,7,"*",7,"H","h"]
[292010008010,9,9,9292010008010,",!2JC0B0-aaiaba!",2,"J","C",0,"B",0,"a","a","i","a","b","a",",!2JC0B0-aaiaba!",8,"LSLSSL","ssssss",true,8,"+",8,"I","i"]
[292010008011,6,6,6292010008011,")!2JCA10-aaiabb!",2,"J","C","A",1,0,"a","a","i","a","b","b",")!2JCA10-aaiabb!",9,"LSSLSL","ssssss",true,9,",",9,"J","j"]
[292010008012,3,3,3292010008012,"&!29CAB0-aaiabc!",2,9,"C","A","B",0,"a","a","i","a","b","c","&!29CAB0-aaiabc!",null,null,null,true]
[292010008013,10,0,292010008013,"#!292010-aaiabd!",2,9,2,0,1,0,"a","a","i","a","b","d","#!292010-aaiabd!",null,null,null,true]
[292010008014,7,7,7292010008014,"*!2J2A1A-aaiabe!",2,"J",2,"A",1,"A","a","a","i","a","b","e","*!2J2A1A-aaiabe!",null,null,null,true]
[292010008015,4,4,4292010008015,"'!2J20BA-aaiabf!",2,"J",2,0,"B","A","a","a","i","a","b","f","'!2J20BA-aaiabf!",null,null,null,true]
[292010008016,1,1,1292010008016,"$!29C0BA-aaiabg!",2,9,"C",0,"B","A","a","a","i","a","b","g","$!29C0BA-aaiabg!",null,null,null,true]
[292010008017,8,8,8292010008017,"+!2J2AB0-aaiabh!",2,"J",2,"A","B",0,"a","a","i","a","b","h","+!2J2AB0-aaiabh!",null,null,null,true]
[292010008018,5,5,5292010008018,"(!2JC01A-aaiabi!",2,"J","C",0,1,"A","a","a","i","a","b","i","(!2JC01A-aaiabi!",null,null,null,true]
[292010008019,2,2,2292010008019,"%!29CA1A-aaiabj!",2,9,"C","A",1,"A","a","a","i","a","b","j","%!29CA1A-aaiabj!",null,null,null,true]
[292010008020,8,8,8292010008020,"+!2J2AB0-aaiaca!",2,"J",2,"A","B",0,"a","a","i","a","c","a","+!2J2AB0-aaiaca!",null,null,null,true]
[292010008021,5,5,5292010008021,"(!2JC01A-aaiacb!",2,"J","C",0,1,"A","a","a","i","a","c","b","(!2JC01A-aaiacb!",null,null,null,true]
[292010008022,2,2,2292010008022,"%!29CA1A-aaiacc!",2,9,"C","A",1,"A","a","a","i","a","c","c","%!29CA1A-aaiacc!",null,null,null,true]
[292010008023,9,9,9292010008023,",!2JC0B0-aaiacd!",2,"J","C",0,"B",0,"a","a","i","a","c","d",",!2JC0B0-aaiacd!",null,null,null,true]
[292010008024,6,6,6292010008024,")!2JCA10-aaiace!",2,"J","C","A",1,0,"a","a","i","a","c","e",")!2JCA10-aaiace!",null,null,null,true]
[292010008025,3,3,3292010008025,"&!29CAB0-aaiacf!",2,9,"C","A","B",0,"a","a","i","a","c","f","&!29CAB0-aaiacf!",null,null,null,true]
[292010008026,10,0,292010008026,"#!292010-aaiacg!",2,9,2,0,1,0,"a","a","i","a","c","g","#!292010-aaiacg!",null,null,null,true]
[292010008027,7,7,7292010008027,"*!2J2A1A-aaiach!",2,"J",2,"A",1,"A","a","a","i","a","c","h","*!2J2A1A-aaiach!",null,null,null,true]
[292010008028,4,4,4292010008028,"'!2J20BA-aaiaci!",2,"J",2,0,"B","A","a","a","i","a","c","i","'!2J20BA-aaiaci!",null,null,null,true]
[292010008029,1,1,1292010008029,"$!29C0BA-aaiacj!",2,9,"C",0,"B","A","a","a","i","a","c","j","$!29C0BA-aaiacj!",null,null,null,true]
[292010008030,7,7,7292010008030,"*!2J2A1A-aaiada!",{"$f":"INDEX($X$3:$AA$12,MATCH(--MID($A31,COLUMN(A30),1),$W$3:$W$12,0),MATCH(MID(VLOOKUP($C31,$S$3:$T$12,2,0),COLUMN(A30),1),$X$2:$AA$2,0))","v":2},{"$f":"INDEX($X$3:$AA$12,MATCH(--MID($A31,COLUMN(B30),1),$W$3:$W$12,0),MATCH(MID(VLOOKUP($C31,$S$3:$T$12,2,0),COLUMN(B30),1),$X$2:$AA$2,0))","v":"J"},{"$f":"INDEX($X$3:$AA$12,MATCH(--MID($A31,COLUMN(C30),1),$W$3:$W$12,0),MATCH(MID(VLOOKUP($C31,$S$3:$T$12,2,0),COLUMN(C30),1),$X$2:$AA$2,0))","v":2},{"$f":"INDEX($X$3:$AA$12,MATCH(--MID($A31,COLUMN(D30),1),$W$3:$W$12,0),MATCH(MID(VLOOKUP($C31,$S$3:$T$12,2,0),COLUMN(D30),1),$X$2:$AA$2,0))","v":"A"},{"$f":"INDEX($X$3:$AA$12,MATCH(--MID($A31,COLUMN(E30),1),$W$3:$W$12,0),MATCH(MID(VLOOKUP($C31,$S$3:$T$12,2,0),COLUMN(E30),1),$X$2:$AA$2,0))","v":1},{"$f":"INDEX($X$3:$AA$12,MATCH(--MID($A31,COLUMN(F30),1),$W$3:$W$12,0),MATCH(MID(VLOOKUP($C31,$S$3:$T$12,2,0),COLUMN(F30),1),$X$2:$AA$2,0))","v":"A"},"a","a","i","a","d","a","*!2J2A1A-aaiada!",null,null,null,true]
[292010008031,4,4,4292010008031,"'!2J20BA-aaiadb!",2,"J",2,0,"B","A","a","a","i","a","d","b","'!2J20BA-aaiadb!",null,null,null,true]
[292010008032,1,1,1292010008032,"$!29C0BA-aaiadc!",2,9,"C",0,"B","A","a","a","i","a","d","c","$!29C0BA-aaiadc!",null,null,null,true]
[292010008033,8,8,8292010008033,"+!2J2AB0-aaiadd!",2,"J",2,"A","B",0,"a","a","i","a","d","d","+!2J2AB0-aaiadd!",null,null,null,true]
[292010008034,5,5,5292010008034,"(!2JC01A-aaiade!",2,"J","C",0,1,"A","a","a","i","a","d","e","(!2JC01A-aaiade!",null,null,null,true]
[292010008035,2,2,2292010008035,"%!29CA1A-aaiadf!",2,9,"C","A",1,"A","a","a","i","a","d","f","%!29CA1A-aaiadf!",null,null,null,true]
[292010008036,9,9,9292010008036,",!2JC0B0-aaiadg!",2,"J","C",0,"B",0,"a","a","i","a","d","g",",!2JC0B0-aaiadg!",null,null,null,true]
[292010008037,6,6,6292010008037,")!2JCA10-aaiadh!",2,"J","C","A",1,0,"a","a","i","a","d","h",")!2JCA10-aaiadh!",null,null,null,true]
[292010008038,3,3,3292010008038,"&!29CAB0-aaiadi!",2,9,"C","A","B",0,"a","a","i","a","d","i","&!29CAB0-aaiadi!",null,null,null,true]
[292010008039,10,0,292010008039,"#!292010-aaiadj!",2,9,2,0,1,0,"a","a","i","a","d","j","#!292010-aaiadj!",null,null,null,true]
[292010008040,6,6,6292010008040,")!2JCA10-aaiaea!",2,"J","C","A",1,0,"a","a","i","a","e","a",")!2JCA10-aaiaea!",null,null,null,true]
[292010008041,3,3,3292010008041,"&!29CAB0-aaiaeb!",2,9,"C","A","B",0,"a","a","i","a","e","b","&!29CAB0-aaiaeb!",null,null,null,true]
[292010008042,10,0,292010008042,"#!292010-aaiaec!",2,9,2,0,1,0,"a","a","i","a","e","c","#!292010-aaiaec!",null,null,null,true]
[292010008043,7,7,7292010008043,"*!2J2A1A-aaiaed!",2,"J",2,"A",1,"A","a","a","i","a","e","d","*!2J2A1A-aaiaed!",null,null,null,true]
[292010008044,4,4,4292010008044,"'!2J20BA-aaiaee!",2,"J",2,0,"B","A","a","a","i","a","e","e","'!2J20BA-aaiaee!",null,null,null,true]
[292010008045,1,1,1292010008045,"$!29C0BA-aaiaef!",2,9,"C",0,"B","A","a","a","i","a","e","f","$!29C0BA-aaiaef!",null,null,null,true]
[292010008046,8,8,8292010008046,"+!2J2AB0-aaiaeg!",2,"J",2,"A","B",0,"a","a","i","a","e","g","+!2J2AB0-aaiaeg!",null,null,null,true]
[292010008047,5,5,5292010008047,"(!2JC01A-aaiaeh!",2,"J","C",0,1,"A","a","a","i","a","e","h","(!2JC01A-aaiaeh!",null,null,null,true]
[292010008048,2,2,2292010008048,"%!29CA1A-aaiaei!",2,9,"C","A",1,"A","a","a","i","a","e","i","%!29CA1A-aaiaei!",null,null,null,true]
[292010008049,9,9,9292010008049,",!2JC0B0-aaiaej!",2,"J","C",0,"B",0,"a","a","i","a","e","j",",!2JC0B0-aaiaej!",null,null,null,true]
[292010008050,5,5,5292010008050,"(!2JC01A-aaiafa!",2,"J","C",0,1,"A","a","a","i","a","f","a","(!2JC01A-aaiafa!",null,null,null,true]
[292010008051,2,2,2292010008051,"%!29CA1A-aaiafb!",2,9,"C","A",1,"A","a","a","i","a","f","b","%!29CA1A-aaiafb!",null,null,null,true]
[292010008052,9,9,9292010008052,",!2JC0B0-aaiafc!",2,"J","C",0,"B",0,"a","a","i","a","f","c",",!2JC0B0-aaiafc!",null,null,null,true]
[292010008053,6,6,6292010008053,")!2JCA10-aaiafd!",2,"J","C","A",1,0,"a","a","i","a","f","d",")!2JCA10-aaiafd!",null,null,null,true]
[292010008054,3,3,3292010008054,"&!29CAB0-aaiafe!",2,9,"C","A","B",0,"a","a","i","a","f","e","&!29CAB0-aaiafe!",null,null,null,true]
[292010008055,10,0,292010008055,"#!292010-aaiaff!",2,9,2,0,1,0,"a","a","i","a","f","f","#!292010-aaiaff!",null,null,null,true]
[292010008056,7,7,7292010008056,"*!2J2A1A-aaiafg!",2,"J",2,"A",1,"A","a","a","i","a","f","g","*!2J2A1A-aaiafg!",null,null,null,true]
[292010008057,4,4,4292010008057,"'!2J20BA-aaiafh!",2,"J",2,0,"B","A","a","a","i","a","f","h","'!2J20BA-aaiafh!",null,null,null,true]
[292010008058,1,1,1292010008058,"$!29C0BA-aaiafi!",2,9,"C",0,"B","A","a","a","i","a","f","i","$!29C0BA-aaiafi!",null,null,null,true]
[292010008059,8,8,8292010008059,"+!2J2AB0-aaiafj!",2,"J",2,"A","B",0,"a","a","i","a","f","j","+!2J2AB0-aaiafj!",null,null,null,true]
[292010008060,4,4,4292010008060,"'!2J20BA-aaiaga!",2,"J",2,0,"B","A","a","a","i","a","g","a","'!2J20BA-aaiaga!",null,null,null,true]
[292010008061,1,1,1292010008061,"$!29C0BA-aaiagb!",2,9,"C",0,"B","A","a","a","i","a","g","b","$!29C0BA-aaiagb!",null,null,null,true]
[292010008062,8,8,8292010008062,"+!2J2AB0-aaiagc!",2,"J",2,"A","B",0,"a","a","i","a","g","c","+!2J2AB0-aaiagc!",null,null,null,true]
[292010008063,5,5,5292010008063,"(!2JC01A-aaiagd!",2,"J","C",0,1,"A","a","a","i","a","g","d","(!2JC01A-aaiagd!",null,null,null,true]
[292010008064,2,2,2292010008064,"%!29CA1A-aaiage!",2,9,"C","A",1,"A","a","a","i","a","g","e","%!29CA1A-aaiage!",null,null,null,true]
[292010008065,9,9,{"$f":"C66*1000000000000+A66","v":9292010008065},",!2JC0B0-aaiagf!",2,"J","C",0,"B",0,"a","a","i","a","g","f",",!2JC0B0-aaiagf!",null,null,null,true]
[292010008066,{"$f":"10-MID((MID(A67,2,1)+MID(A67,4,1)+MID(A67,6,1)+MID(A67,8,1)+MID(A67,10,1)+MID(A67,12,1))*3+MID(A67,1,1)+MID(A67,3,1)+MID(A67,5,1)+MID(A67,7,1)+MID(A67,9,1)+MID(A67,11,1),2,1)","v":6},{"$f":"IF(B67<10,B67,0)","v":6},6292010008066,")!2JCA10-aaiagg!",2,"J","C","A",1,0,{"$f":"LOWER(INDEX($AA$3:$AA$12,MATCH(--MID($A67,COLUMN(G66),1),$W$3:$W$12,0)))","v":"a"},{"$f":"LOWER(INDEX($AA$3:$AA$12,MATCH(--MID($A67,COLUMN(H66),1),$W$3:$W$12,0)))","v":"a"},{"$f":"LOWER(INDEX($AA$3:$AA$12,MATCH(--MID($A67,COLUMN(I66),1),$W$3:$W$12,0)))","v":"i"},{"$f":"LOWER(INDEX($AA$3:$AA$12,MATCH(--MID($A67,COLUMN(J66),1),$W$3:$W$12,0)))","v":"a"},{"$f":"LOWER(INDEX($AA$3:$AA$12,MATCH(--MID($A67,COLUMN(K66),1),$W$3:$W$12,0)))","v":"g"},{"$f":"LOWER(INDEX($AA$3:$AA$12,MATCH(--MID($A67,COLUMN(L66),1),$W$3:$W$12,0)))","v":"g"},{"$f":"getEAN13(D67)","v":")!2JCA10-aaiagg!"},null,null,null,{"$f":"E67=R67","v":true}]
[{"$f":"A67+1","v":292010008067},3,3,3292010008067,{"$f":"VLOOKUP($C68,$W$3:$X$12,2,0)&\"!\"&F68&G68&H68&I68&J68&K68&\"-\"&L68&M68&N68&O68&P68&Q68&\"!\"","v":"&!29CAB0-aaiagh!"},2,9,"C","A","B",0,"a","a","i","a","g","h","&!29CAB0-aaiagh!",null,null,null,true]
[292010008068,10,0,292010008068,"#!292010-aaiagi!",2,9,2,0,1,0,"a","a","i","a","g","i","#!292010-aaiagi!",null,null,null,true]
[292010008069,7,7,7292010008069,"*!2J2A1A-aaiagj!",2,"J",2,"A",1,"A","a","a","i","a","g","j","*!2J2A1A-aaiagj!",null,null,null,true]
[292010008070,3,3,3292010008070,"&!29CAB0-aaiaha!",2,9,"C","A","B",0,"a","a","i","a","h","a","&!29CAB0-aaiaha!",null,null,null,true]
[292010008071,10,0,292010008071,"#!292010-aaiahb!",2,9,2,0,1,0,"a","a","i","a","h","b","#!292010-aaiahb!",null,null,null,true]
[292010008072,7,7,7292010008072,"*!2J2A1A-aaiahc!",2,"J",2,"A",1,"A","a","a","i","a","h","c","*!2J2A1A-aaiahc!",null,null,null,true]
[292010008073,4,4,4292010008073,"'!2J20BA-aaiahd!",2,"J",2,0,"B","A","a","a","i","a","h","d","'!2J20BA-aaiahd!",null,null,null,true]
[292010008074,1,1,1292010008074,"$!29C0BA-aaiahe!",2,9,"C",0,"B","A","a","a","i","a","h","e","$!29C0BA-aaiahe!",null,null,null,true]
[292010008075,8,8,8292010008075,"+!2J2AB0-aaiahf!",2,"J",2,"A","B",0,"a","a","i","a","h","f","+!2J2AB0-aaiahf!",null,null,null,true]
[292010008076,5,5,5292010008076,"(!2JC01A-aaiahg!",2,"J","C",0,1,"A","a","a","i","a","h","g","(!2JC01A-aaiahg!",null,null,null,true]
[292010008077,2,2,2292010008077,"%!29CA1A-aaiahh!",2,9,"C","A",1,"A","a","a","i","a","h","h","%!29CA1A-aaiahh!",null,null,null,true]
[292010008078,9,9,9292010008078,",!2JC0B0-aaiahi!",2,"J","C",0,"B",0,"a","a","i","a","h","i",",!2JC0B0-aaiahi!",null,null,null,true]
[292010008079,6,6,6292010008079,")!2JCA10-aaiahj!",2,"J","C","A",1,0,"a","a","i","a","h","j",")!2JCA10-aaiahj!",null,null,null,true]
[292010008080,2,2,2292010008080,"%!29CA1A-aaiaia!",2,9,"C","A",1,"A","a","a","i","a","i","a","%!29CA1A-aaiaia!",null,null,null,true]
[292010008081,9,9,9292010008081,",!2JC0B0-aaiaib!",2,"J","C",0,"B",0,"a","a","i","a","i","b",",!2JC0B0-aaiaib!",null,null,null,true]
[292010008082,6,6,6292010008082,")!2JCA10-aaiaic!",2,"J","C","A",1,0,"a","a","i","a","i","c",")!2JCA10-aaiaic!",null,null,null,true]
[292010008083,3,3,3292010008083,"&!29CAB0-aaiaid!",2,9,"C","A","B",0,"a","a","i","a","i","d","&!29CAB0-aaiaid!",null,null,null,true]
[292010008084,10,0,292010008084,"#!292010-aaiaie!",2,9,2,0,1,0,"a","a","i","a","i","e","#!292010-aaiaie!",null,null,null,true]
[292010008085,7,7,7292010008085,"*!2J2A1A-aaiaif!",2,"J",2,"A",1,"A","a","a","i","a","i","f","*!2J2A1A-aaiaif!",null,null,null,true]
[292010008086,4,4,4292010008086,"'!2J20BA-aaiaig!",2,"J",2,0,"B","A","a","a","i","a","i","g","'!2J20BA-aaiaig!",null,null,null,true]
[292010008087,1,1,1292010008087,"$!29C0BA-aaiaih!",2,9,"C",0,"B","A","a","a","i","a","i","h","$!29C0BA-aaiaih!",null,null,null,true]
[292010008088,8,8,8292010008088,"+!2J2AB0-aaiaii!",2,"J",2,"A","B",0,"a","a","i","a","i","i","+!2J2AB0-aaiaii!",null,null,null,true]
[292010008089,5,5,5292010008089,"(!2JC01A-aaiaij!",2,"J","C",0,1,"A","a","a","i","a","i","j","(!2JC01A-aaiaij!",null,null,null,true]
[292010008090,1,1,1292010008090,"$!29C0BA-aaiaja!",2,9,"C",0,"B","A","a","a","i","a","j","a","$!29C0BA-aaiaja!",null,null,null,true]
[292010008091,8,8,8292010008091,"+!2J2AB0-aaiajb!",2,"J",2,"A","B",0,"a","a","i","a","j","b","+!2J2AB0-aaiajb!",null,null,null,true]
[292010008092,5,5,5292010008092,"(!2JC01A-aaiajc!",2,"J","C",0,1,"A","a","a","i","a","j","c","(!2JC01A-aaiajc!",null,null,null,true]
[292010008093,2,2,2292010008093,"%!29CA1A-aaiajd!",2,9,"C","A",1,"A","a","a","i","a","j","d","%!29CA1A-aaiajd!",null,null,null,true]
[292010008094,9,9,9292010008094,",!2JC0B0-aaiaje!",{"$f":"INDEX($X$3:$AA$12,MATCH(--MID($A95,COLUMN(A94),1),$W$3:$W$12,0),MATCH(MID(VLOOKUP($C95,$S$3:$T$12,2,0),COLUMN(A94),1),$X$2:$AA$2,0))","v":2},{"$f":"INDEX($X$3:$AA$12,MATCH(--MID($A95,COLUMN(B94),1),$W$3:$W$12,0),MATCH(MID(VLOOKUP($C95,$S$3:$T$12,2,0),COLUMN(B94),1),$X$2:$AA$2,0))","v":"J"},{"$f":"INDEX($X$3:$AA$12,MATCH(--MID($A95,COLUMN(C94),1),$W$3:$W$12,0),MATCH(MID(VLOOKUP($C95,$S$3:$T$12,2,0),COLUMN(C94),1),$X$2:$AA$2,0))","v":"C"},{"$f":"INDEX($X$3:$AA$12,MATCH(--MID($A95,COLUMN(D94),1),$W$3:$W$12,0),MATCH(MID(VLOOKUP($C95,$S$3:$T$12,2,0),COLUMN(D94),1),$X$2:$AA$2,0))","v":0},{"$f":"INDEX($X$3:$AA$12,MATCH(--MID($A95,COLUMN(E94),1),$W$3:$W$12,0),MATCH(MID(VLOOKUP($C95,$S$3:$T$12,2,0),COLUMN(E94),1),$X$2:$AA$2,0))","v":"B"},{"$f":"INDEX($X$3:$AA$12,MATCH(--MID($A95,COLUMN(F94),1),$W$3:$W$12,0),MATCH(MID(VLOOKUP($C95,$S$3:$T$12,2,0),COLUMN(F94),1),$X$2:$AA$2,0))","v":0},"a","a","i","a","j","e",",!2JC0B0-aaiaje!",null,null,null,true]
[292010008095,6,6,6292010008095,")!2JCA10-aaiajf!",2,"J","C","A",1,0,"a","a","i","a","j","f",")!2JCA10-aaiajf!",null,null,null,true]
[292010008096,3,3,3292010008096,"&!29CAB0-aaiajg!",2,9,"C","A","B",0,"a","a","i","a","j","g","&!29CAB0-aaiajg!",null,null,null,true]
[292010008097,10,0,292010008097,"#!292010-aaiajh!",2,9,2,0,1,0,"a","a","i","a","j","h","#!292010-aaiajh!",null,null,null,true]
[292010008098,7,7,7292010008098,"*!2J2A1A-aaiaji!",2,"J",2,"A",1,"A","a","a","i","a","j","i","*!2J2A1A-aaiaji!",null,null,null,true]
[292010008099,4,4,4292010008099,"'!2J20BA-aaiajj!",2,"J",2,0,"B","A","a","a","i","a","j","j","'!2J20BA-aaiajj!",null,null,null,true]
[292010008100,7,7,7292010008100,"*!2J2A1A-aaibaa!",2,"J",2,"A",1,"A","a","a","i","b","a","a","*!2J2A1A-aaibaa!",null,null,null,true]
[292010008101,4,4,4292010008101,"'!2J20BA-aaibab!",2,"J",2,0,"B","A","a","a","i","b","a","b","'!2J20BA-aaibab!",null,null,null,true]
[292010008102,1,1,1292010008102,"$!29C0BA-aaibac!",2,9,"C",0,"B","A","a","a","i","b","a","c","$!29C0BA-aaibac!",null,null,null,true]

{"sheet":"Лист2","index":1,"n_rows":0,"n_cols":0,"rows_kept":0,"cut":false,"hidden":false,"merged":[]}

{"sheet":"Лист3","index":2,"n_rows":0,"n_cols":0,"rows_kept":0,"cut":false,"hidden":false,"merged":[]}