{"text_format":"1","workbook":"xlsx","n_sheets":4,"sheets":["Начальная","БДМ№1","Общий табель","Список"],"not_rendered":{"charts":0,"images":0,"macros":1,"external_links":0,"defined_names":66,"comments":0,"pivot_tables":0},"unopened":[],"bounds":{"document_bytes":16777216,"sheet_cells":100000,"rows_first":2000,"rows_last":500,"rows_between":2000,"halvings":0,"cell_chars":16384,"cell_head_chars":4096},"cells_cut":0,"cells_raw":0,"read":"whole","date_system":"1900"}

{"sheet":"Начальная","index":0,"n_rows":52,"n_cols":6,"rows_kept":52,"cut":false,"hidden":true,"merged":[[1,5,1,12],[2,5,4,12],[5,5,6,12],[7,5,8,12],[9,5,10,12],[13,1,15,1],[13,5,14,12],[19,1,20,1],[15,5,16,12],[11,5,12,12]]}
[]
[null,null,"Настройки табеля",null,null,"Для заметок касающиеся улучшения работы табеля"]
[null,null,null,null,null,"1. Для правильной синхронизации книгу не перемещать.                  Путь: E:\\Хомич Н.Н\\! БРИГАДНЫЙ\\"]
[null,"Подразделение","Бумажный цех"]
[]
[null,"Начальник цеха","Романов В.В.",null,null,"2. Для правильной синхронизации листа \"Расчёт молока\" необходимо архив по месяцам хранить: E:\\Хомич Н.Н\\! БРИГАДНЫЙ\\по месяцам"]
[]
[null,"Мастер смены ","Хомич Н.Н."]
[]
[null,"Смена","см. Хомич Н.Н."]
[]
[null,"Месяц / Год","2015-12-01"]
[]
[null,"Цвет табеля"]
[]
[]
[]
[]
[]
[null,"Добавить / удалить фамилию"]
{"$rows_left_out":33}
{"sheet":"БДМ№1","index":1,"n_rows":99,"n_cols":4,"rows_kept":99,"cut":false,"hidden":false,"merged":[[0,1,0,2],[2,1,3,1],[2,2,3,3],[52,1,52,2],[54,1,55,1],[54,2,55,3]]}
[null,{"$f":"Начальная!C12","v":"2015-12-01"},null,{"$f":"Начальная!C10","v":"см. Хомич Н.Н."}]
[]
[null,"Таб№","Фамилия, Имя, Отчество"]
[]
[1,{"$f":"IFERROR(VLOOKUP(C5,Список!$B$2:$C$149,2,0),\"\")","v":465},"Рудницкий С.Н.","Машинист 6 р."]
[null,{"$f":"IFERROR(VLOOKUP(C6,Список!$B$2:$C$149,2,0),\"\")","v":""}]
[null,{"$f":"IFERROR(VLOOKUP(C7,Список!$B$2:$C$149,2,0),\"\")","v":""}]
[null,{"$f":"IFERROR(VLOOKUP(C8,Список!$B$2:$C$149,2,0),\"\")","v":""}]
[2,{"$f":"IFERROR(VLOOKUP(C9,Список!$B$2:$C$149,2,0),\"\")","v":761},"Сацук А.Л.","Машинист 6 р."]
[null,{"$f":"IFERROR(VLOOKUP(C10,Список!$B$2:$C$149,2,0),\"\")","v":761},"Сацук А.Л.","Накатчик 3 р. %"]
[null,{"$f":"IFERROR(VLOOKUP(C11,Список!$B$2:$C$149,2,0),\"\")","v":761},"Сацук А.Л.","Сушильщик 4 р. %"]
[null,{"$f":"IFERROR(VLOOKUP(C12,Список!$B$2:$C$149,2,0),\"\")","v":""}]
[null,{"$f":"IFERROR(VLOOKUP(C13,Список!$B$2:$C$149,2,0),\"\")","v":""}]
[3,{"$f":"IFERROR(VLOOKUP(C14,Список!$B$2:$C$149,2,0),\"\")","v":1674},"Орловский А.М.","Перссовщик 3 р."]
[null,{"$f":"IFERROR(VLOOKUP(C15,Список!$B$2:$C$149,2,0),\"\")","v":""}]
[null,{"$f":"IFERROR(VLOOKUP(C16,Список!$B$2:$C$149,2,0),\"\")","v":""}]
[4,{"$f":"IFERROR(VLOOKUP(C17,Список!$B$2:$C$149,2,0),\"\")","v":1179},"Брикун М.А.","Сушильщик 4 р."]
[null,{"$f":"IFERROR(VLOOKUP(C18,Список!$B$2:$C$149,2,0),\"\")","v":1179},"Брикун М.А.","Накатчик 3 р. %"]
[null,{"$f":"IFERROR(VLOOKUP(C19,Список!$B$2:$C$149,2,0),\"\")","v":""}]
[null,{"$f":"IFERROR(VLOOKUP(C20,Список!$B$2:$C$149,2,0),\"\")","v":""}]
{"$rows_left_out":80}
{"sheet":"Общий табель","index":2,"n_rows":66,"n_cols":4,"rows_kept":66,"cut":false,"hidden":false,"merged":[[2,3,4,3],[0,0,0,2],[93,0,93,3],[2,1,4,1],[2,0,4,0],[2,2,4,2]]}
[]
[]
["№","Таб.№","Ф.И.O.","Должность"]
[]
[]
[{"$f":"IF(C6<>\"\",ROW()-ROW(A$5),\"\")","v":1},{"$f":"IFERROR(VLOOKUP(C6,Список!$B$2:$C$149,2,0),\"\")","v":465},{"$f":"IFERROR(VLOOKUP(ROW($A1),БДМ№1!$A$5:$D$108,COLUMN(),0),\"\")","v":"Рудницкий С.Н."},{"$f":"IFERROR(VLOOKUP(ROW($A1),БДМ№1!$A$5:$D$108,COLUMN(),0),\"\")","v":"Машинист 6 р."}]
[{"$f":"IF(C7<>\"\",ROW()-ROW(A$5),\"\")","v":2},{"$f":"IFERROR(VLOOKUP(C7,Список!$B$2:$C$149,2,0),\"\")","v":761},{"$f":"IFERROR(VLOOKUP(ROW($A2),БДМ№1!$A$5:$D$108,COLUMN(),0),\"\")","v":"Сацук А.Л."},{"$f":"IFERROR(VLOOKUP(ROW($A2),БДМ№1!$A$5:$D$108,COLUMN(),0),\"\")","v":"Машинист 6 р."}]
[3,{"$f":"IFERROR(VLOOKUP(C8,Список!$B$2:$C$149,2,0),\"\")","v":1674},{"$f":"IFERROR(VLOOKUP(ROW($A3),БДМ№1!$A$5:$D$108,COLUMN(),0),\"\")","v":"Орловский А.М."},{"$f":"IFERROR(VLOOKUP(ROW($A3),БДМ№1!$A$5:$D$108,COLUMN(),0),\"\")","v":"Перссовщик 3 р."}]
[4,{"$f":"IFERROR(VLOOKUP(C9,Список!$B$2:$C$149,2,0),\"\")","v":1179},{"$f":"IFERROR(VLOOKUP(ROW($A4),БДМ№1!$A$5:$D$108,COLUMN(),0),\"\")","v":"Брикун М.А."},{"$f":"IFERROR(VLOOKUP(ROW($A4),БДМ№1!$A$5:$D$108,COLUMN(),0),\"\")","v":"Сушильщик 4 р."}]
[5,{"$f":"IFERROR(VLOOKUP(C10,Список!$B$2:$C$149,2,0),\"\")","v":491},{"$f":"IFERROR(VLOOKUP(ROW($A5),БДМ№1!$A$5:$D$108,COLUMN(),0),\"\")","v":"Жизневская Т.Ф."},{"$f":"IFERROR(VLOOKUP(ROW($A5),БДМ№1!$A$5:$D$108,COLUMN(),0),\"\")","v":"Разм. РПО 4 р."}]
[6,{"$f":"IFERROR(VLOOKUP(C11,Список!$B$2:$C$149,2,0),\"\")","v":856},{"$f":"IFERROR(VLOOKUP(ROW($A6),БДМ№1!$A$5:$D$108,COLUMN(),0),\"\")","v":"Залан А.В."},{"$f":"IFERROR(VLOOKUP(ROW($A6),БДМ№1!$A$5:$D$108,COLUMN(),0),\"\")","v":"Разм. РПО 3 р."}]
[7,{"$f":"IFERROR(VLOOKUP(C12,Список!$B$2:$C$149,2,0),\"\")","v":1311},{"$f":"IFERROR(VLOOKUP(ROW($A7),БДМ№1!$A$5:$D$108,COLUMN(),0),\"\")","v":"Грузд Н.Н."},{"$f":"IFERROR(VLOOKUP(ROW($A7),БДМ№1!$A$5:$D$108,COLUMN(),0),\"\")","v":"Ап.пр.хим.р-в 3 р."}]
[8,{"$f":"IFERROR(VLOOKUP(C13,Список!$B$2:$C$149,2,0),\"\")","v":170},{"$f":"IFERROR(VLOOKUP(ROW($A8),БДМ№1!$A$5:$D$108,COLUMN(),0),\"\")","v":"Кудревич О.М."},{"$f":"IFERROR(VLOOKUP(ROW($A8),БДМ№1!$A$5:$D$108,COLUMN(),0),\"\")","v":"Ап.пр.хим.р-в 3 р."}]
[9,{"$f":"IFERROR(VLOOKUP(C14,Список!$B$2:$C$149,2,0),\"\")","v":509},{"$f":"IFERROR(VLOOKUP(ROW($A9),БДМ№1!$A$5:$D$108,COLUMN(),0),\"\")","v":"Заяц Т.Л."},{"$f":"IFERROR(VLOOKUP(ROW($A9),БДМ№1!$A$5:$D$108,COLUMN(),0),\"\")","v":"Резчик ПРС 4 р."}]
[10,{"$f":"IFERROR(VLOOKUP(C15,Список!$B$2:$C$149,2,0),\"\")","v":1379},{"$f":"IFERROR(VLOOKUP(ROW($A10),БДМ№1!$A$5:$D$108,COLUMN(),0),\"\")","v":"Кадевич О.В."},{"$f":"IFERROR(VLOOKUP(ROW($A10),БДМ№1!$A$5:$D$108,COLUMN(),0),\"\")","v":"Резчик ПРС 3 р."}]
[11,{"$f":"IFERROR(VLOOKUP(C16,Список!$B$2:$C$149,2,0),\"\")","v":342},{"$f":"IFERROR(VLOOKUP(ROW($A11),БДМ№1!$A$5:$D$108,COLUMN(),0),\"\")","v":"Амосова Т.Ф."},{"$f":"IFERROR(VLOOKUP(ROW($A11),БДМ№1!$A$5:$D$108,COLUMN(),0),\"\")","v":"Маш.уп. маш. 2 р."}]
[12,{"$f":"IFERROR(VLOOKUP(C17,Список!$B$2:$C$149,2,0),\"\")","v":1140},{"$f":"IFERROR(VLOOKUP(ROW($A12),БДМ№1!$A$5:$D$108,COLUMN(),0),\"\")","v":"Цедрик Т.Н."},{"$f":"IFERROR(VLOOKUP(ROW($A12),БДМ№1!$A$5:$D$108,COLUMN(),0),\"\")","v":"Маш.уп. маш. 2 р."}]
[13,{"$f":"IFERROR(VLOOKUP(C18,Список!$B$2:$C$149,2,0),\"\")","v":552},{"$f":"IFERROR(VLOOKUP(ROW($A13),БДМ№1!$A$5:$D$108,COLUMN(),0),\"\")","v":"Гендик Н.В."},{"$f":"IFERROR(VLOOKUP(ROW($A13),БДМ№1!$A$5:$D$108,COLUMN(),0),\"\")","v":"Разм. ГРВ 3 р."}]
[14,{"$f":"IFERROR(VLOOKUP(C19,Список!$B$2:$C$149,2,0),\"\")","v":1454},{"$f":"IFERROR(VLOOKUP(ROW($A14),БДМ№1!$A$5:$D$108,COLUMN(),0),\"\")","v":"Комадей Д.В."},{"$f":"IFERROR(VLOOKUP(ROW($A14),БДМ№1!$A$5:$D$108,COLUMN(),0),\"\")","v":"Разм. ПО 3 р."}]
[15,{"$f":"IFERROR(VLOOKUP(C20,Список!$B$2:$C$149,2,0),\"\")","v":2035},{"$f":"IFERROR(VLOOKUP(ROW($A15),БДМ№1!$A$5:$D$108,COLUMN(),0),\"\")","v":"Дунаев С.Е."},{"$f":"IFERROR(VLOOKUP(ROW($A15),БДМ№1!$A$5:$D$108,COLUMN(),0),\"\")","v":"Разм. ПО 3 р."}]
{"$rows_left_out":47}
{"sheet":"Список","index":3,"n_rows":150,"n_cols":21,"rows_kept":150,"cut":false,"hidden":true,"merged":[]}
["№","ФИО","Таб.№","Конт-т","Кол.дог.","Проф.м.","За рук.бриг.","За сложн.","Тариф.коэфф-т","Надб.за стаж, %","Профессия","Час.т.ставка","Знаки","Месяц","Мастера смен","Наряды","Расценка за ед.","Праздники",null,"Ед.изм","Прочее"]
[1,"Агеева Е.В.",{"$f":"IF($B2=\"Агеева Е.В.\",1686)","v":1686},{"$f":"IF($B2=\"Агеева Е.В.\",50)","v":50},{"$f":"IF($B2=\"Агеева Е.В.\",0)","v":0},{"$f":"IF($B2=\"Агеева Е.В.\",0)","v":0},{"$f":"IF($B2=\"Агеева Е.В.\",0)","v":0},{"$f":"IF($B2=\"Агеева Е.В.\",0)","v":0},{"$f":"IF($B2=\"Агеева Е.В.\",1.35)","v":1.35},{"$f":"IF($B2=\"Агеева Е.В.\",0)","v":0},"Ап.пр.хим.р-в 3 р.",{"$f":"IF(K2=\"Ап.пр.хим.р-в 3 р.\",6029)","v":6029},1,{"$f":"DATE(YEAR(TODAY()),MONTH(1),1)","v":"2015-01-01"},"сгущеной целлюлозы (промежуточный)","в том числе связывание канатика",{"$f":"IF(P2=\"в том числе связывание канатика\",16309)","v":16309},"2015-01-07","Добавить / удалить фамилию","Кг","БДМ № 1"]
[2,"Адамюк Е.В.",{"$f":"IF($B3=\"Адамюк Е.В.\",2102)","v":2102},{"$f":"IF($B3=\"Адамюк Е.В.\",50)","v":50},{"$f":"IF($B3=\"Адамюк Е.В.\",0)","v":0},{"$f":"IF($B3=\"Адамюк Е.В.\",0)","v":0},{"$f":"IF($B3=\"Адамюк Е.В.\",0)","v":0},{"$f":"IF($B3=\"Адамюк Е.В.\",0)","v":0},{"$f":"IF($B3=\"Адамюк Е.В.\",1.16)","v":1.1599999999999999},{"$f":"IF($B3=\"Адамюк Е.В.\",0)","v":0},"Ап.пр.хим.р-в 3 р. %",{"$f":"IF(K3=\"Ап.пр.хим.р-в 3 р. %\",6029)","v":6029},2,{"$f":"DATE(YEAR(TODAY()),MONTH(N2)+1,1)","v":"2015-02-01"},"см. Буйко В.Г.","глинозёма",{"$f":"IF(P3=\"глинозёма\",21924)","v":21924},"2015-03-08","Добавить / удалить профессию","Т","БДМ № 2"]
[3,"Амосова Т.Ф.",{"$f":"IF($B4=\"Амосова Т.Ф.\",342)","v":342},{"$f":"IF($B4=\"Амосова Т.Ф.\",50)","v":50},{"$f":"IF($B4=\"Амосова Т.Ф.\",0)","v":0},{"$f":"IF($B4=\"Амосова Т.Ф.\",0)","v":0},{"$f":"IF($B4=\"Амосова Т.Ф.\",0)","v":0},{"$f":"IF($B4=\"Амосова Т.Ф.\",0)","v":0},{"$f":"IF($B4=\"Амосова Т.Ф.\",1.16)","v":1.1599999999999999},{"$f":"IF($B4=\"Амосова Т.Ф.\",15)","v":15},"Каландровщик 3 р.",{"$f":"IF(K4=\"Каландровщик 3 р.\",0)","v":0},3,{"$f":"DATE(YEAR(TODAY()),MONTH(N3)+1,1)","v":"2015-03-01"},"см. Булавский А.В.","избыточной воды",{"$f":"IF(P4=\"избыточной воды\",43026)","v":43026},"2015-04-21","Добавить / удалить наряд","Шт","Бумажный цех"]
[4,"Аниськович А.П.",{"$f":"IF($B5=\"Аниськович А.П.\",1339)","v":1339},{"$f":"IF($B5=\"Аниськович А.П.\",50)","v":50},{"$f":"IF($B5=\"Аниськович А.П.\",10)","v":10},{"$f":"IF($B5=\"Аниськович А.П.\",0)","v":0},{"$f":"IF($B5=\"Аниськович А.П.\",0)","v":0},{"$f":"IF($B5=\"Аниськович А.П.\",0)","v":0},{"$f":"IF($B5=\"Аниськович А.П.\",1.35)","v":1.35},{"$f":"IF($B5=\"Аниськович А.П.\",5)","v":5},"Каландровщик 3 р. %",{"$f":"IF(K5=\"Каландровщик 3 р. %\",0)","v":0},4,"2015-04-01","см. Кузьбар И.Н.","композиционного",{"$f":"IF(P5=\"композиционного\",32283)","v":32283},"2015-05-01","Добавить / удалить знаки",null,"Останов БДМ"]
[5,"Апет И.В.",{"$f":"IF($B6=\"Апет И.В.\",2234)","v":2234},{"$f":"IF($B6=\"Апет И.В.\",50)","v":50},{"$f":"IF($B6=\"Апет И.В.\",10)","v":10},{"$f":"IF($B6=\"Апет И.В.\",0)","v":0},{"$f":"IF($B6=\"Апет И.В.\",0)","v":0},{"$f":"IF($B6=\"Апет И.В.\",0)","v":0},{"$f":"IF($B6=\"Апет И.В.\",1.35)","v":1.35},{"$f":"IF($B6=\"Апет И.В.\",10)","v":10},"Каландровщик 4 р.",{"$f":"IF(K6=\"Каландровщик 4 р.\",0)","v":0},5,"2015-05-01","см. Сандульская Л.А.","машинного",{"$f":"IF(P6=\"машинного\",43026)","v":43026},"2015-05-09","Добавить / удалить праздники"]
[6,"Богодяж Т.А.",{"$f":"IF($B7=\"Богодяж Т.А.\",1609)","v":1609},{"$f":"IF($B7=\"Богодяж Т.А.\",50)","v":50},{"$f":"IF($B7=\"Богодяж Т.А.\",0)","v":0},{"$f":"IF($B7=\"Богодяж Т.А.\",0)","v":0},{"$f":"IF($B7=\"Богодяж Т.А.\",0)","v":0},{"$f":"IF($B7=\"Богодяж Т.А.\",0)","v":0},{"$f":"IF($B7=\"Богодяж Т.А.\",1.16)","v":1.1599999999999999},{"$f":"IF($B7=\"Богодяж Т.А.\",0)","v":0},"Кладовщик",{"$f":"IF(K7=\"Кладовщик\",6374)","v":6374},6,"2015-06-01","см. Хомич Н.Н.","мела (каолины)",{"$f":"IF(P7=\"мела (каолины)\",21924)","v":21924},"2015-07-03","Добавить / удалить ед.измерения"]
[7,"Брикун М.А.",{"$f":"IF($B8=\"Брикун М.А.\",1179)","v":1179},{"$f":"IF($B8=\"Брикун М.А.\",50)","v":50},{"$f":"IF($B8=\"Брикун М.А.\",30)","v":30},{"$f":"IF($B8=\"Брикун М.А.\",16)","v":16},{"$f":"IF($B8=\"Брикун М.А.\",0)","v":0},{"$f":"IF($B8=\"Брикун М.А.\",0)","v":0},{"$f":"IF($B8=\"Брикун М.А.\",1.57)","v":1.57},{"$f":"IF($B8=\"Брикун М.А.\",10)","v":10},"Мастер смены",{"$f":"IF(K8=\"Мастер смены\",2224823)","v":2224823},7,"2015-07-01",null,"металлического",{"$f":"IF(P8=\"металлического\",32283)","v":32283},"2015-11-07","Добавить / удалить прочее"]
[8,"Буйко В.Г.",{"$f":"IF($B9=\"Буйко В.Г.\",1241)","v":1241},{"$f":"IF($B9=\"Буйко В.Г.\",50)","v":50},{"$f":"IF($B9=\"Буйко В.Г.\",40)","v":40},{"$f":"IF($B9=\"Буйко В.Г.\",0)","v":0},{"$f":"IF($B9=\"Буйко В.Г.\",0)","v":0},{"$f":"IF($B9=\"Буйко В.Г.\",40)","v":40},{"$f":"IF($B9=\"Буйко В.Г.\",0)","v":0},{"$f":"IF($B9=\"Буйко В.Г.\",10)","v":10},"Маш.уп. маш. 2 р.",{"$f":"IF(K9=\"Маш.уп. маш. 2 р.\",5181)","v":5181},8,"2015-08-01",null,"оборотного брака",{"$f":"IF(P9=\"оборотного брака\",32283)","v":32283},"2015-11-07"]
[9,"Булавский А.В.",{"$f":"IF($B10=\"Булавский А.В.\",1515)","v":1515},{"$f":"IF($B10=\"Булавский А.В.\",50)","v":50},{"$f":"IF($B10=\"Булавский А.В.\",40)","v":40},{"$f":"IF($B10=\"Булавский А.В.\",0)","v":0},{"$f":"IF($B10=\"Булавский А.В.\",0)","v":0},{"$f":"IF($B10=\"Булавский А.В.\",40)","v":40},{"$f":"IF($B10=\"Булавский А.В.\",0)","v":0},{"$f":"IF($B10=\"Булавский А.В.\",5)","v":5},"Маш.уп. маш. 2 р. %",{"$f":"IF(K10=\"Маш.уп. маш. 2 р. %\",5181)","v":5181},9,"2015-09-01",null,"оборотной воды",{"$f":"IF(P10=\"оборотной воды\",21924)","v":21924},"2015-12-25"]
[10,"Буракова Т.А.",{"$f":"IF($B11=\"Буракова Т.А.\",643)","v":643},{"$f":"IF($B11=\"Буракова Т.А.\",50)","v":50},{"$f":"IF($B11=\"Буракова Т.А.\",50)","v":50},{"$f":"IF($B11=\"Буракова Т.А.\",12)","v":12},{"$f":"IF($B11=\"Буракова Т.А.\",0)","v":0},{"$f":"IF($B11=\"Буракова Т.А.\",0)","v":0},{"$f":"IF($B11=\"Буракова Т.А.\",1.35)","v":1.35},{"$f":"IF($B11=\"Буракова Т.А.\",15)","v":15},"Машинист 6 р.",{"$f":"IF(K11=\"Машинист 6 р.\",8486)","v":8486},10,"2015-10-01",null,"осветлённой воды",{"$f":"IF(P11=\"осветлённой воды\",21924)","v":21924},"2016-01-01"]
[11,"Бурдыко Е.А.",{"$f":"IF($B12=\"Бурдыко Е.А.\",2269)","v":2269},{"$f":"IF($B12=\"Бурдыко Е.А.\",50)","v":50},{"$f":"IF($B12=\"Бурдыко Е.А.\",0)","v":0},{"$f":"IF($B12=\"Бурдыко Е.А.\",0)","v":0},{"$f":"IF($B12=\"Бурдыко Е.А.\",0)","v":0},{"$f":"IF($B12=\"Бурдыко Е.А.\",0)","v":0},{"$f":"IF($B12=\"Бурдыко Е.А.\",1.73)","v":1.73},{"$f":"IF($B12=\"Бурдыко Е.А.\",10)","v":10},"Накатчик 3 р.",{"$f":"IF(K12=\"Накатчик 3 р.\",6029)","v":6029},11,"2015-11-01",null,"П-1",null,"2016-01-07"]
[12,"Бурыхин С.А.",{"$f":"IF($B13=\"Бурыхин С.А.\",1501)","v":1501},{"$f":"IF($B13=\"Бурыхин С.А.\",50)","v":50},{"$f":"IF($B13=\"Бурыхин С.А.\",10)","v":10},{"$f":"IF($B13=\"Бурыхин С.А.\",0)","v":0},{"$f":"IF($B13=\"Бурыхин С.А.\",0)","v":0},{"$f":"IF($B13=\"Бурыхин С.А.\",0)","v":0},{"$f":"IF($B13=\"Бурыхин С.А.\",1.35)","v":1.35},{"$f":"IF($B13=\"Бурыхин С.А.\",5)","v":5},"Накатчик 3 р. %",{"$f":"IF(K13=\"Накатчик 3 р. %\",6029)","v":6029},12,"2015-12-01",null,"П-2",null,"2016-03-08"]
[13,"Буслов А.А.",{"$f":"IF($B14=\"Буслов А.А.\",2150)","v":2150},{"$f":"IF($B14=\"Буслов А.А.\",50)","v":50},{"$f":"IF($B14=\"Буслов А.А.\",10)","v":10},{"$f":"IF($B14=\"Буслов А.А.\",0)","v":0},{"$f":"IF($B14=\"Буслов А.А.\",0)","v":0},{"$f":"IF($B14=\"Буслов А.А.\",0)","v":0},{"$f":"IF($B14=\"Буслов А.А.\",1.57)","v":1.57},{"$f":"IF($B14=\"Буслов А.А.\",10)","v":10},"Оклад",{"$f":"IF(K14=\"Оклад\",2669788)","v":2669788},"1'",null,null,"П-3",null,"2016-04-21"]
[14,"Бушкин В.Д.",{"$f":"IF($B15=\"Бушкин В.Д.\",1430)","v":1430},{"$f":"IF($B15=\"Бушкин В.Д.\",50)","v":50},{"$f":"IF($B15=\"Бушкин В.Д.\",20)","v":20},{"$f":"IF($B15=\"Бушкин В.Д.\",0)","v":0},{"$f":"IF($B15=\"Бушкин В.Д.\",0)","v":0},{"$f":"IF($B15=\"Бушкин В.Д.\",0)","v":0},{"$f":"IF($B15=\"Бушкин В.Д.\",1.57)","v":1.57},{"$f":"IF($B15=\"Бушкин В.Д.\",5)","v":5},"Оп.очист.оборуд.",{"$f":"IF(K15=\"Оп.очист.оборуд.\",6029)","v":6029},"10'",null,null,"П-4",null,"2016-05-01"]
[15,"Бушкина Т.П.",{"$f":"IF($B16=\"Бушкина Т.П.\",531)","v":531},{"$f":"IF($B16=\"Бушкина Т.П.\",50)","v":50},{"$f":"IF($B16=\"Бушкина Т.П.\",0)","v":0},{"$f":"IF($B16=\"Бушкина Т.П.\",0)","v":0},{"$f":"IF($B16=\"Бушкина Т.П.\",0)","v":0},{"$f":"IF($B16=\"Бушкина Т.П.\",0)","v":0},{"$f":"IF($B16=\"Бушкина Т.П.\",1.16)","v":1.1599999999999999},{"$f":"IF($B16=\"Бушкина Т.П.\",20)","v":20},"Перссовщик 3 р.",{"$f":"IF(K16=\"Перссовщик 3 р.\",6029)","v":6029},"11'",null,null,"Переупаковка ролевой бумаги",{"$f":"IF(P16=\"Переупаковка ролевой бумаги\",7536)","v":7536},"2016-05-09"]
[16,"Буяновская В.П.",{"$f":"IF($B17=\"Буяновская В.П.\",489)","v":489},{"$f":"IF($B17=\"Буяновская В.П.\",50)","v":50},{"$f":"IF($B17=\"Буяновская В.П.\",10)","v":10},{"$f":"IF($B17=\"Буяновская В.П.\",0)","v":0},{"$f":"IF($B17=\"Буяновская В.П.\",0)","v":0},{"$f":"IF($B17=\"Буяновская В.П.\",0)","v":0},{"$f":"IF($B17=\"Буяновская В.П.\",1.57)","v":1.57},{"$f":"IF($B17=\"Буяновская В.П.\",20)","v":20},"Перссовщик 3 р. %",{"$f":"IF(K17=\"Перссовщик 3 р. %\",6029)","v":6029},"12'",null,null,"приёмного",{"$f":"IF(P17=\"приёмного\",32283)","v":32283},"2016-07-03"]
[17,"Ваньков С.П.",{"$f":"IF($B18=\"Ваньков С.П.\",115)","v":115},{"$f":"IF($B18=\"Ваньков С.П.\",50)","v":50},{"$f":"IF($B18=\"Ваньков С.П.\",85)","v":85},{"$f":"IF($B18=\"Ваньков С.П.\",0)","v":0},{"$f":"IF($B18=\"Ваньков С.П.\",0)","v":0},{"$f":"IF($B18=\"Ваньков С.П.\",0)","v":0},{"$f":"IF($B18=\"Ваньков С.П.\",1.35)","v":1.35},{"$f":"IF($B18=\"Ваньков С.П.\",10)","v":10},"Разм. брака 2 р.",{"$f":"IF(K18=\"Разм. брака 2 р.\",4710)","v":4710},"2'",null,null,"размольного",{"$f":"IF(P18=\"размольного\",32283)","v":32283}]
[18,"Ванькова Л.Е.",{"$f":"IF($B19=\"Ванькова Л.Е.\",365)","v":365},{"$f":"IF($B19=\"Ванькова Л.Е.\",50)","v":50},{"$f":"IF($B19=\"Ванькова Л.Е.\",20)","v":20},{"$f":"IF($B19=\"Ванькова Л.Е.\",0)","v":0},{"$f":"IF($B19=\"Ванькова Л.Е.\",0)","v":0},{"$f":"IF($B19=\"Ванькова Л.Е.\",0)","v":0},{"$f":"IF($B19=\"Ванькова Л.Е.\",1.16)","v":1.1599999999999999},{"$f":"IF($B19=\"Ванькова Л.Е.\",20)","v":20},"Разм. брака 2 р. %",{"$f":"IF(K19=\"Разм. брака 2 р. %\",4710)","v":4710},"3'",null,null,"регистровой воды",{"$f":"IF(P19=\"регистровой воды\",21924)","v":21924}]
[19,"Васильева О.А.",{"$f":"IF($B20=\"Васильева О.А.\",1560)","v":1560},{"$f":"IF($B20=\"Васильева О.А.\",50)","v":50},{"$f":"IF($B20=\"Васильева О.А.\",10)","v":10},{"$f":"IF($B20=\"Васильева О.А.\",0)","v":0},{"$f":"IF($B20=\"Васильева О.А.\",0)","v":0},{"$f":"IF($B20=\"Васильева О.А.\",0)","v":0},{"$f":"IF($B20=\"Васильева О.А.\",1.16)","v":1.1599999999999999},{"$f":"IF($B20=\"Васильева О.А.\",5)","v":5},"Разм. ГРВ 3 р.",{"$f":"IF(K20=\"Разм. ГРВ 3 р.\",6029)","v":6029},"4'",null,null,"Резка и упаковка ленты бумажной для плоттеров 70 г/м2, ф. 1000 мм",{"$f":"IF(P20=\"Резка и упаковка ленты бумажной для плоттеров 70 г/м2, ф. 1000 мм\",4874)","v":4874}]
{"$rows_left_out":130}