{"text_format":"1","workbook":"xlsx","n_sheets":4,"sheets":["АА","ББ","База","Скидка"],"not_rendered":{"charts":0,"images":2,"macros":1,"external_links":0,"defined_names":4,"comments":0,"pivot_tables":0},"unopened":[],"bounds":{"document_bytes":16777216,"sheet_cells":100000,"rows_first":2000,"rows_last":500,"rows_between":2000,"halvings":0,"cell_chars":16384,"cell_head_chars":4096},"cells_cut":0,"cells_raw":0,"read":"whole","date_system":"1900"}

{"sheet":"АА","index":0,"n_rows":95,"n_cols":13,"rows_kept":95,"cut":false,"hidden":false,"merged":[]}
[]
[null,null,null,null,"Договор1",null,null,null,null,null,null,null,"а2"]
[]
[]
[null,null,null,null,"Дата действия прайс-листа: с 01 ДЕКАБРЯ 2015 года"]
[]
[null,"№","Линейка","Цена базовая, руб","Цена договора, руб","Цена базовая НОВАЯ, руб","Цена поставки НОВАЯ, руб","Изменение цены поставки, %"]
[null,null,"Скидка",null,{"$f":"VLOOKUP($E$2,Скидка!$A$2:$C$3,2,0)","v":0.26},null,{"$f":"VLOOKUP($E$2,Скидка!$A$2:$C$3,3,0)","v":0.35}]
[null,1,"а1",{"$f":"IFERROR(VLOOKUP($C9,База!$A$1:$F$15,2,0),\"\")","v":50},{"$f":"IFERROR(VLOOKUP($C9,База!$A$1:$F$15,3,0),\"\")","v":35.5},{"$f":"IFERROR(VLOOKUP($C9,База!$A$1:$F$15,4,0),\"\")","v":58},{"$f":"IFERROR(VLOOKUP($C9,База!$A$1:$F$15,5,0),\"\")","v":38.86},{"$f":"IFERROR(VLOOKUP($C9,База!$A$1:$F$15,2,0),\"\")","v":50}]
[null,2,"а2",{"$f":"IFERROR(VLOOKUP($C10,База!$A$1:$F$15,2,0),\"\")","v":94},{"$f":"IFERROR(VLOOKUP($C10,База!$A$1:$F$15,3,0),\"\")","v":66.739999999999995},{"$f":"IFERROR(VLOOKUP($C10,База!$A$1:$F$15,4,0),\"\")","v":104},{"$f":"IFERROR(VLOOKUP($C10,База!$A$1:$F$15,5,0),\"\")","v":69.679999999999993},{"$f":"IFERROR(VLOOKUP($C10,База!$A$1:$F$15,2,0),\"\")","v":94}]
[null,3,"а3",{"$f":"IFERROR(VLOOKUP($C11,База!$A$1:$F$15,2,0),\"\")","v":69},{"$f":"IFERROR(VLOOKUP($C11,База!$A$1:$F$15,3,0),\"\")","v":48.989999999999995},{"$f":"IFERROR(VLOOKUP($C11,База!$A$1:$F$15,4,0),\"\")","v":79},{"$f":"IFERROR(VLOOKUP($C11,База!$A$1:$F$15,5,0),\"\")","v":52.929999999999993},{"$f":"IFERROR(VLOOKUP($C11,База!$A$1:$F$15,2,0),\"\")","v":69}]
[null,4,"а4",{"$f":"IFERROR(VLOOKUP($C12,База!$A$1:$F$15,2,0),\"\")","v":78},{"$f":"IFERROR(VLOOKUP($C12,База!$A$1:$F$15,3,0),\"\")","v":55.379999999999995},{"$f":"IFERROR(VLOOKUP($C12,База!$A$1:$F$15,4,0),\"\")","v":91},{"$f":"IFERROR(VLOOKUP($C12,База!$A$1:$F$15,5,0),\"\")","v":60.969999999999992},{"$f":"IFERROR(VLOOKUP($C12,База!$A$1:$F$15,2,0),\"\")","v":78}]
[null,5,"а5",{"$f":"IFERROR(VLOOKUP($C13,База!$A$1:$F$15,2,0),\"\")","v":78},{"$f":"IFERROR(VLOOKUP($C13,База!$A$1:$F$15,3,0),\"\")","v":55.379999999999995},{"$f":"IFERROR(VLOOKUP($C13,База!$A$1:$F$15,4,0),\"\")","v":91},{"$f":"IFERROR(VLOOKUP($C13,База!$A$1:$F$15,5,0),\"\")","v":60.969999999999992},{"$f":"IFERROR(VLOOKUP($C13,База!$A$1:$F$15,2,0),\"\")","v":78}]
[null,6,"а6",{"$f":"IFERROR(VLOOKUP($C14,База!$A$1:$F$15,2,0),\"\")","v":97},{"$f":"IFERROR(VLOOKUP($C14,База!$A$1:$F$15,3,0),\"\")","v":68.86999999999999},{"$f":"IFERROR(VLOOKUP($C14,База!$A$1:$F$15,4,0),\"\")","v":113},{"$f":"IFERROR(VLOOKUP($C14,База!$A$1:$F$15,5,0),\"\")","v":75.709999999999994},{"$f":"IFERROR(VLOOKUP($C14,База!$A$1:$F$15,2,0),\"\")","v":97}]
[null,7,"а7",{"$f":"IFERROR(VLOOKUP($C15,База!$A$1:$F$15,2,0),\"\")","v":97},{"$f":"IFERROR(VLOOKUP($C15,База!$A$1:$F$15,3,0),\"\")","v":68.86999999999999},{"$f":"IFERROR(VLOOKUP($C15,База!$A$1:$F$15,4,0),\"\")","v":113},{"$f":"IFERROR(VLOOKUP($C15,База!$A$1:$F$15,5,0),\"\")","v":75.709999999999994},{"$f":"IFERROR(VLOOKUP($C15,База!$A$1:$F$15,2,0),\"\")","v":97}]
[null,8,"а8",{"$f":"IFERROR(VLOOKUP($C16,База!$A$1:$F$15,2,0),\"\")","v":97},{"$f":"IFERROR(VLOOKUP($C16,База!$A$1:$F$15,3,0),\"\")","v":68.86999999999999},{"$f":"IFERROR(VLOOKUP($C16,База!$A$1:$F$15,4,0),\"\")","v":113},{"$f":"IFERROR(VLOOKUP($C16,База!$A$1:$F$15,5,0),\"\")","v":75.709999999999994},{"$f":"IFERROR(VLOOKUP($C16,База!$A$1:$F$15,2,0),\"\")","v":97}]
[null,9,"а9",{"$f":"IFERROR(VLOOKUP($C17,База!$A$1:$F$15,2,0),\"\")","v":97},{"$f":"IFERROR(VLOOKUP($C17,База!$A$1:$F$15,3,0),\"\")","v":68.86999999999999},{"$f":"IFERROR(VLOOKUP($C17,База!$A$1:$F$15,4,0),\"\")","v":113},{"$f":"IFERROR(VLOOKUP($C17,База!$A$1:$F$15,5,0),\"\")","v":75.709999999999994},{"$f":"IFERROR(VLOOKUP($C17,База!$A$1:$F$15,2,0),\"\")","v":97}]
[null,10,"а10",{"$f":"IFERROR(VLOOKUP($C18,База!$A$1:$F$15,2,0),\"\")","v":79},{"$f":"IFERROR(VLOOKUP($C18,База!$A$1:$F$15,3,0),\"\")","v":56.089999999999996},{"$f":"IFERROR(VLOOKUP($C18,База!$A$1:$F$15,4,0),\"\")","v":92},{"$f":"IFERROR(VLOOKUP($C18,База!$A$1:$F$15,5,0),\"\")","v":61.639999999999993},{"$f":"IFERROR(VLOOKUP($C18,База!$A$1:$F$15,2,0),\"\")","v":79}]
[null,11,"а11",{"$f":"IFERROR(VLOOKUP($C19,База!$A$1:$F$15,2,0),\"\")","v":78},{"$f":"IFERROR(VLOOKUP($C19,База!$A$1:$F$15,3,0),\"\")","v":55.379999999999995},{"$f":"IFERROR(VLOOKUP($C19,База!$A$1:$F$15,4,0),\"\")","v":91},{"$f":"IFERROR(VLOOKUP($C19,База!$A$1:$F$15,5,0),\"\")","v":60.969999999999992},{"$f":"IFERROR(VLOOKUP($C19,База!$A$1:$F$15,2,0),\"\")","v":78}]
[null,12,"а12",{"$f":"IFERROR(VLOOKUP($C20,База!$A$1:$F$15,2,0),\"\")","v":100},{"$f":"IFERROR(VLOOKUP($C20,База!$A$1:$F$15,3,0),\"\")","v":71},{"$f":"IFERROR(VLOOKUP($C20,База!$A$1:$F$15,4,0),\"\")","v":117},{"$f":"IFERROR(VLOOKUP($C20,База!$A$1:$F$15,5,0),\"\")","v":78.389999999999986},{"$f":"IFERROR(VLOOKUP($C20,База!$A$1:$F$15,2,0),\"\")","v":100}]
[null,13,"а13",{"$f":"IFERROR(VLOOKUP($C21,База!$A$1:$F$15,2,0),\"\")","v":101},{"$f":"IFERROR(VLOOKUP($C21,База!$A$1:$F$15,3,0),\"\")","v":71.709999999999994},{"$f":"IFERROR(VLOOKUP($C21,База!$A$1:$F$15,4,0),\"\")","v":118},{"$f":"IFERROR(VLOOKUP($C21,База!$A$1:$F$15,5,0),\"\")","v":79.059999999999988},{"$f":"IFERROR(VLOOKUP($C21,База!$A$1:$F$15,2,0),\"\")","v":101}]
[null,14,"а14",{"$f":"IFERROR(VLOOKUP($C22,База!$A$1:$F$15,2,0),\"\")","v":100},{"$f":"IFERROR(VLOOKUP($C22,База!$A$1:$F$15,3,0),\"\")","v":71},{"$f":"IFERROR(VLOOKUP($C22,База!$A$1:$F$15,4,0),\"\")","v":116},{"$f":"IFERROR(VLOOKUP($C22,База!$A$1:$F$15,5,0),\"\")","v":77.72},{"$f":"IFERROR(VLOOKUP($C22,База!$A$1:$F$15,2,0),\"\")","v":100}]
[null,"","",{"$f":"IFERROR(VLOOKUP($C23,База!$A$1:$F$15,2,0),\"\")","v":""},{"$f":"IFERROR(VLOOKUP($C23,База!$A$1:$F$15,3,0),\"\")","v":""},{"$f":"IFERROR(VLOOKUP($C23,База!$A$1:$F$15,4,0),\"\")","v":""},{"$f":"IFERROR(VLOOKUP($C23,База!$A$1:$F$15,5,0),\"\")","v":""},{"$f":"IFERROR(VLOOKUP($C23,База!$A$1:$F$15,2,0),\"\")","v":""}]
[null,"","",{"$f":"IFERROR(VLOOKUP($C24,База!$A$1:$F$15,2,0),\"\")","v":""},{"$f":"IFERROR(VLOOKUP($C24,База!$A$1:$F$15,3,0),\"\")","v":""},{"$f":"IFERROR(VLOOKUP($C24,База!$A$1:$F$15,4,0),\"\")","v":""},{"$f":"IFERROR(VLOOKUP($C24,База!$A$1:$F$15,5,0),\"\")","v":""},{"$f":"IFERROR(VLOOKUP($C24,База!$A$1:$F$15,2,0),\"\")","v":""}]
[null,"","",{"$f":"IFERROR(VLOOKUP($C25,База!$A$1:$F$15,2,0),\"\")","v":""},{"$f":"IFERROR(VLOOKUP($C25,База!$A$1:$F$15,3,0),\"\")","v":""},{"$f":"IFERROR(VLOOKUP($C25,База!$A$1:$F$15,4,0),\"\")","v":""},{"$f":"IFERROR(VLOOKUP($C25,База!$A$1:$F$15,5,0),\"\")","v":""},{"$f":"IFERROR(VLOOKUP($C25,База!$A$1:$F$15,2,0),\"\")","v":""}]
[null,"","",{"$f":"IFERROR(VLOOKUP($C26,База!$A$1:$F$15,2,0),\"\")","v":""},{"$f":"IFERROR(VLOOKUP($C26,База!$A$1:$F$15,3,0),\"\")","v":""},{"$f":"IFERROR(VLOOKUP($C26,База!$A$1:$F$15,4,0),\"\")","v":""},{"$f":"IFERROR(VLOOKUP($C26,База!$A$1:$F$15,5,0),\"\")","v":""},{"$f":"IFERROR(VLOOKUP($C26,База!$A$1:$F$15,2,0),\"\")","v":""}]
[null,"","",{"$f":"IFERROR(VLOOKUP($C27,База!$A$1:$F$15,2,0),\"\")","v":""},{"$f":"IFERROR(VLOOKUP($C27,База!$A$1:$F$15,3,0),\"\")","v":""},{"$f":"IFERROR(VLOOKUP($C27,База!$A$1:$F$15,4,0),\"\")","v":""},{"$f":"IFERROR(VLOOKUP($C27,База!$A$1:$F$15,5,0),\"\")","v":""},{"$f":"IFERROR(VLOOKUP($C27,База!$A$1:$F$15,2,0),\"\")","v":""}]
[null,"","",{"$f":"IFERROR(VLOOKUP($C28,База!$A$1:$F$15,2,0),\"\")","v":""},{"$f":"IFERROR(VLOOKUP($C28,База!$A$1:$F$15,3,0),\"\")","v":""},{"$f":"IFERROR(VLOOKUP($C28,База!$A$1:$F$15,4,0),\"\")","v":""},{"$f":"IFERROR(VLOOKUP($C28,База!$A$1:$F$15,5,0),\"\")","v":""},{"$f":"IFERROR(VLOOKUP($C28,База!$A$1:$F$15,2,0),\"\")","v":""}]
[null,"","",{"$f":"IFERROR(VLOOKUP($C29,База!$A$1:$F$15,2,0),\"\")","v":""},{"$f":"IFERROR(VLOOKUP($C29,База!$A$1:$F$15,3,0),\"\")","v":""},{"$f":"IFERROR(VLOOKUP($C29,База!$A$1:$F$15,4,0),\"\")","v":""},{"$f":"IFERROR(VLOOKUP($C29,База!$A$1:$F$15,5,0),\"\")","v":""},{"$f":"IFERROR(VLOOKUP($C29,База!$A$1:$F$15,2,0),\"\")","v":""}]
[null,"","",{"$f":"IFERROR(VLOOKUP($C30,База!$A$1:$F$15,2,0),\"\")","v":""},{"$f":"IFERROR(VLOOKUP($C30,База!$A$1:$F$15,3,0),\"\")","v":""},{"$f":"IFERROR(VLOOKUP($C30,База!$A$1:$F$15,4,0),\"\")","v":""},{"$f":"IFERROR(VLOOKUP($C30,База!$A$1:$F$15,5,0),\"\")","v":""},{"$f":"IFERROR(VLOOKUP($C30,База!$A$1:$F$15,2,0),\"\")","v":""}]
[null,"","",{"$f":"IFERROR(VLOOKUP($C31,База!$A$1:$F$15,2,0),\"\")","v":""},{"$f":"IFERROR(VLOOKUP($C31,База!$A$1:$F$15,3,0),\"\")","v":""},{"$f":"IFERROR(VLOOKUP($C31,База!$A$1:$F$15,4,0),\"\")","v":""},{"$f":"IFERROR(VLOOKUP($C31,База!$A$1:$F$15,5,0),\"\")","v":""},{"$f":"IFERROR(VLOOKUP($C31,База!$A$1:$F$15,2,0),\"\")","v":""}]
[null,"","",{"$f":"IFERROR(VLOOKUP($C32,База!$A$1:$F$15,2,0),\"\")","v":""},{"$f":"IFERROR(VLOOKUP($C32,База!$A$1:$F$15,3,0),\"\")","v":""},{"$f":"IFERROR(VLOOKUP($C32,База!$A$1:$F$15,4,0),\"\")","v":""},{"$f":"IFERROR(VLOOKUP($C32,База!$A$1:$F$15,5,0),\"\")","v":""},{"$f":"IFERROR(VLOOKUP($C32,База!$A$1:$F$15,2,0),\"\")","v":""}]
[null,"","",{"$f":"IFERROR(VLOOKUP($C33,База!$A$1:$F$15,2,0),\"\")","v":""},{"$f":"IFERROR(VLOOKUP($C33,База!$A$1:$F$15,3,0),\"\")","v":""},{"$f":"IFERROR(VLOOKUP($C33,База!$A$1:$F$15,4,0),\"\")","v":""},{"$f":"IFERROR(VLOOKUP($C33,База!$A$1:$F$15,5,0),\"\")","v":""},{"$f":"IFERROR(VLOOKUP($C33,База!$A$1:$F$15,2,0),\"\")","v":""}]
[null,"","",{"$f":"IFERROR(VLOOKUP($C34,База!$A$1:$F$15,2,0),\"\")","v":""},{"$f":"IFERROR(VLOOKUP($C34,База!$A$1:$F$15,3,0),\"\")","v":""},{"$f":"IFERROR(VLOOKUP($C34,База!$A$1:$F$15,4,0),\"\")","v":""},{"$f":"IFERROR(VLOOKUP($C34,База!$A$1:$F$15,5,0),\"\")","v":""},{"$f":"IFERROR(VLOOKUP($C34,База!$A$1:$F$15,2,0),\"\")","v":""}]
[null,"","",{"$f":"IFERROR(VLOOKUP($C35,База!$A$1:$F$15,2,0),\"\")","v":""},{"$f":"IFERROR(VLOOKUP($C35,База!$A$1:$F$15,3,0),\"\")","v":""},{"$f":"IFERROR(VLOOKUP($C35,База!$A$1:$F$15,4,0),\"\")","v":""},{"$f":"IFERROR(VLOOKUP($C35,База!$A$1:$F$15,5,0),\"\")","v":""},{"$f":"IFERROR(VLOOKUP($C35,База!$A$1:$F$15,2,0),\"\")","v":""}]
[null,"","",{"$f":"IFERROR(VLOOKUP($C36,База!$A$1:$F$15,2,0),\"\")","v":""},{"$f":"IFERROR(VLOOKUP($C36,База!$A$1:$F$15,3,0),\"\")","v":""},{"$f":"IFERROR(VLOOKUP($C36,База!$A$1:$F$15,4,0),\"\")","v":""},{"$f":"IFERROR(VLOOKUP($C36,База!$A$1:$F$15,5,0),\"\")","v":""},{"$f":"IFERROR(VLOOKUP($C36,База!$A$1:$F$15,2,0),\"\")","v":""}]
[null,"","",{"$f":"IFERROR(VLOOKUP($C37,База!$A$1:$F$15,2,0),\"\")","v":""},{"$f":"IFERROR(VLOOKUP($C37,База!$A$1:$F$15,3,0),\"\")","v":""},{"$f":"IFERROR(VLOOKUP($C37,База!$A$1:$F$15,4,0),\"\")","v":""},{"$f":"IFERROR(VLOOKUP($C37,База!$A$1:$F$15,5,0),\"\")","v":""},{"$f":"IFERROR(VLOOKUP($C37,База!$A$1:$F$15,2,0),\"\")","v":""}]
[null,"","",{"$f":"IFERROR(VLOOKUP($C38,База!$A$1:$F$15,2,0),\"\")","v":""},{"$f":"IFERROR(VLOOKUP($C38,База!$A$1:$F$15,3,0),\"\")","v":""},{"$f":"IFERROR(VLOOKUP($C38,База!$A$1:$F$15,4,0),\"\")","v":""},{"$f":"IFERROR(VLOOKUP($C38,База!$A$1:$F$15,5,0),\"\")","v":""},{"$f":"IFERROR(VLOOKUP($C38,База!$A$1:$F$15,2,0),\"\")","v":""}]
[null,"","",{"$f":"IFERROR(VLOOKUP($C39,База!$A$1:$F$15,2,0),\"\")","v":""},{"$f":"IFERROR(VLOOKUP($C39,База!$A$1:$F$15,3,0),\"\")","v":""},{"$f":"IFERROR(VLOOKUP($C39,База!$A$1:$F$15,4,0),\"\")","v":""},{"$f":"IFERROR(VLOOKUP($C39,База!$A$1:$F$15,5,0),\"\")","v":""},{"$f":"IFERROR(VLOOKUP($C39,База!$A$1:$F$15,2,0),\"\")","v":""}]
[null,"","",{"$f":"IFERROR(VLOOKUP($C40,База!$A$1:$F$15,2,0),\"\")","v":""},{"$f":"IFERROR(VLOOKUP($C40,База!$A$1:$F$15,3,0),\"\")","v":""},{"$f":"IFERROR(VLOOKUP($C40,База!$A$1:$F$15,4,0),\"\")","v":""},{"$f":"IFERROR(VLOOKUP($C40,База!$A$1:$F$15,5,0),\"\")","v":""},{"$f":"IFERROR(VLOOKUP($C40,База!$A$1:$F$15,2,0),\"\")","v":""}]
[null,"","",{"$f":"IFERROR(VLOOKUP($C41,База!$A$1:$F$15,2,0),\"\")","v":""},{"$f":"IFERROR(VLOOKUP($C41,База!$A$1:$F$15,3,0),\"\")","v":""},{"$f":"IFERROR(VLOOKUP($C41,База!$A$1:$F$15,4,0),\"\")","v":""},{"$f":"IFERROR(VLOOKUP($C41,База!$A$1:$F$15,5,0),\"\")","v":""},{"$f":"IFERROR(VLOOKUP($C41,База!$A$1:$F$15,2,0),\"\")","v":""}]
[null,"","",{"$f":"IFERROR(VLOOKUP($C42,База!$A$1:$F$15,2,0),\"\")","v":""},{"$f":"IFERROR(VLOOKUP($C42,База!$A$1:$F$15,3,0),\"\")","v":""},{"$f":"IFERROR(VLOOKUP($C42,База!$A$1:$F$15,4,0),\"\")","v":""},{"$f":"IFERROR(VLOOKUP($C42,База!$A$1:$F$15,5,0),\"\")","v":""},{"$f":"IFERROR(VLOOKUP($C42,База!$A$1:$F$15,2,0),\"\")","v":""}]
[null,"","",{"$f":"IFERROR(VLOOKUP($C43,База!$A$1:$F$15,2,0),\"\")","v":""},{"$f":"IFERROR(VLOOKUP($C43,База!$A$1:$F$15,3,0),\"\")","v":""},{"$f":"IFERROR(VLOOKUP($C43,База!$A$1:$F$15,4,0),\"\")","v":""},{"$f":"IFERROR(VLOOKUP($C43,База!$A$1:$F$15,5,0),\"\")","v":""},{"$f":"IFERROR(VLOOKUP($C43,База!$A$1:$F$15,2,0),\"\")","v":""}]
[null,"","",{"$f":"IFERROR(VLOOKUP($C44,База!$A$1:$F$15,2,0),\"\")","v":""},{"$f":"IFERROR(VLOOKUP($C44,База!$A$1:$F$15,3,0),\"\")","v":""},{"$f":"IFERROR(VLOOKUP($C44,База!$A$1:$F$15,4,0),\"\")","v":""},{"$f":"IFERROR(VLOOKUP($C44,База!$A$1:$F$15,5,0),\"\")","v":""},{"$f":"IFERROR(VLOOKUP($C44,База!$A$1:$F$15,2,0),\"\")","v":""}]
[null,"","",{"$f":"IFERROR(VLOOKUP($C45,База!$A$1:$F$15,2,0),\"\")","v":""},{"$f":"IFERROR(VLOOKUP($C45,База!$A$1:$F$15,3,0),\"\")","v":""},{"$f":"IFERROR(VLOOKUP($C45,База!$A$1:$F$15,4,0),\"\")","v":""},{"$f":"IFERROR(VLOOKUP($C45,База!$A$1:$F$15,5,0),\"\")","v":""},{"$f":"IFERROR(VLOOKUP($C45,База!$A$1:$F$15,2,0),\"\")","v":""}]
[null,"","",{"$f":"IFERROR(VLOOKUP($C46,База!$A$1:$F$15,2,0),\"\")","v":""},{"$f":"IFERROR(VLOOKUP($C46,База!$A$1:$F$15,3,0),\"\")","v":""},{"$f":"IFERROR(VLOOKUP($C46,База!$A$1:$F$15,4,0),\"\")","v":""},{"$f":"IFERROR(VLOOKUP($C46,База!$A$1:$F$15,5,0),\"\")","v":""},{"$f":"IFERROR(VLOOKUP($C46,База!$A$1:$F$15,2,0),\"\")","v":""}]
[null,"","",{"$f":"IFERROR(VLOOKUP($C47,База!$A$1:$F$15,2,0),\"\")","v":""},{"$f":"IFERROR(VLOOKUP($C47,База!$A$1:$F$15,3,0),\"\")","v":""},{"$f":"IFERROR(VLOOKUP($C47,База!$A$1:$F$15,4,0),\"\")","v":""},{"$f":"IFERROR(VLOOKUP($C47,База!$A$1:$F$15,5,0),\"\")","v":""},{"$f":"IFERROR(VLOOKUP($C47,База!$A$1:$F$15,2,0),\"\")","v":""}]
[null,"","",{"$f":"IFERROR(VLOOKUP($C48,База!$A$1:$F$15,2,0),\"\")","v":""},{"$f":"IFERROR(VLOOKUP($C48,База!$A$1:$F$15,3,0),\"\")","v":""},{"$f":"IFERROR(VLOOKUP($C48,База!$A$1:$F$15,4,0),\"\")","v":""},{"$f":"IFERROR(VLOOKUP($C48,База!$A$1:$F$15,5,0),\"\")","v":""},{"$f":"IFERROR(VLOOKUP($C48,База!$A$1:$F$15,2,0),\"\")","v":""}]
[null,"","",{"$f":"IFERROR(VLOOKUP($C49,База!$A$1:$F$15,2,0),\"\")","v":""},{"$f":"IFERROR(VLOOKUP($C49,База!$A$1:$F$15,3,0),\"\")","v":""},{"$f":"IFERROR(VLOOKUP($C49,База!$A$1:$F$15,4,0),\"\")","v":""},{"$f":"IFERROR(VLOOKUP($C49,База!$A$1:$F$15,5,0),\"\")","v":""},{"$f":"IFERROR(VLOOKUP($C49,База!$A$1:$F$15,2,0),\"\")","v":""}]
[null,"","",{"$f":"IFERROR(VLOOKUP($C50,База!$A$1:$F$15,2,0),\"\")","v":""},{"$f":"IFERROR(VLOOKUP($C50,База!$A$1:$F$15,3,0),\"\")","v":""},{"$f":"IFERROR(VLOOKUP($C50,База!$A$1:$F$15,4,0),\"\")","v":""},{"$f":"IFERROR(VLOOKUP($C50,База!$A$1:$F$15,5,0),\"\")","v":""},{"$f":"IFERROR(VLOOKUP($C50,База!$A$1:$F$15,2,0),\"\")","v":""}]
[null,"","",{"$f":"IFERROR(VLOOKUP($C51,База!$A$1:$F$15,2,0),\"\")","v":""},{"$f":"IFERROR(VLOOKUP($C51,База!$A$1:$F$15,3,0),\"\")","v":""},{"$f":"IFERROR(VLOOKUP($C51,База!$A$1:$F$15,4,0),\"\")","v":""},{"$f":"IFERROR(VLOOKUP($C51,База!$A$1:$F$15,5,0),\"\")","v":""},{"$f":"IFERROR(VLOOKUP($C51,База!$A$1:$F$15,2,0),\"\")","v":""}]
[null,"","",{"$f":"IFERROR(VLOOKUP($C52,База!$A$1:$F$15,2,0),\"\")","v":""},{"$f":"IFERROR(VLOOKUP($C52,База!$A$1:$F$15,3,0),\"\")","v":""},{"$f":"IFERROR(VLOOKUP($C52,База!$A$1:$F$15,4,0),\"\")","v":""},{"$f":"IFERROR(VLOOKUP($C52,База!$A$1:$F$15,5,0),\"\")","v":""},{"$f":"IFERROR(VLOOKUP($C52,База!$A$1:$F$15,2,0),\"\")","v":""}]
[null,"","",{"$f":"IFERROR(VLOOKUP($C53,База!$A$1:$F$15,2,0),\"\")","v":""},{"$f":"IFERROR(VLOOKUP($C53,База!$A$1:$F$15,3,0),\"\")","v":""},{"$f":"IFERROR(VLOOKUP($C53,База!$A$1:$F$15,4,0),\"\")","v":""},{"$f":"IFERROR(VLOOKUP($C53,База!$A$1:$F$15,5,0),\"\")","v":""},{"$f":"IFERROR(VLOOKUP($C53,База!$A$1:$F$15,2,0),\"\")","v":""}]
[null,"","",{"$f":"IFERROR(VLOOKUP($C54,База!$A$1:$F$15,2,0),\"\")","v":""},{"$f":"IFERROR(VLOOKUP($C54,База!$A$1:$F$15,3,0),\"\")","v":""},{"$f":"IFERROR(VLOOKUP($C54,База!$A$1:$F$15,4,0),\"\")","v":""},{"$f":"IFERROR(VLOOKUP($C54,База!$A$1:$F$15,5,0),\"\")","v":""},{"$f":"IFERROR(VLOOKUP($C54,База!$A$1:$F$15,2,0),\"\")","v":""}]
[null,"","",{"$f":"IFERROR(VLOOKUP($C55,База!$A$1:$F$15,2,0),\"\")","v":""},{"$f":"IFERROR(VLOOKUP($C55,База!$A$1:$F$15,3,0),\"\")","v":""},{"$f":"IFERROR(VLOOKUP($C55,База!$A$1:$F$15,4,0),\"\")","v":""},{"$f":"IFERROR(VLOOKUP($C55,База!$A$1:$F$15,5,0),\"\")","v":""},{"$f":"IFERROR(VLOOKUP($C55,База!$A$1:$F$15,2,0),\"\")","v":""}]
[null,"","",{"$f":"IFERROR(VLOOKUP($C56,База!$A$1:$F$15,2,0),\"\")","v":""},{"$f":"IFERROR(VLOOKUP($C56,База!$A$1:$F$15,3,0),\"\")","v":""},{"$f":"IFERROR(VLOOKUP($C56,База!$A$1:$F$15,4,0),\"\")","v":""},{"$f":"IFERROR(VLOOKUP($C56,База!$A$1:$F$15,5,0),\"\")","v":""},{"$f":"IFERROR(VLOOKUP($C56,База!$A$1:$F$15,2,0),\"\")","v":""}]
[null,"","",{"$f":"IFERROR(VLOOKUP($C57,База!$A$1:$F$15,2,0),\"\")","v":""},{"$f":"IFERROR(VLOOKUP($C57,База!$A$1:$F$15,3,0),\"\")","v":""},{"$f":"IFERROR(VLOOKUP($C57,База!$A$1:$F$15,4,0),\"\")","v":""},{"$f":"IFERROR(VLOOKUP($C57,База!$A$1:$F$15,5,0),\"\")","v":""},{"$f":"IFERROR(VLOOKUP($C57,База!$A$1:$F$15,2,0),\"\")","v":""}]
[null,"","",{"$f":"IFERROR(VLOOKUP($C58,База!$A$1:$F$15,2,0),\"\")","v":""},{"$f":"IFERROR(VLOOKUP($C58,База!$A$1:$F$15,3,0),\"\")","v":""},{"$f":"IFERROR(VLOOKUP($C58,База!$A$1:$F$15,4,0),\"\")","v":""},{"$f":"IFERROR(VLOOKUP($C58,База!$A$1:$F$15,5,0),\"\")","v":""},{"$f":"IFERROR(VLOOKUP($C58,База!$A$1:$F$15,2,0),\"\")","v":""}]
[null,"","",{"$f":"IFERROR(VLOOKUP($C59,База!$A$1:$F$15,2,0),\"\")","v":""},{"$f":"IFERROR(VLOOKUP($C59,База!$A$1:$F$15,3,0),\"\")","v":""},{"$f":"IFERROR(VLOOKUP($C59,База!$A$1:$F$15,4,0),\"\")","v":""},{"$f":"IFERROR(VLOOKUP($C59,База!$A$1:$F$15,5,0),\"\")","v":""},{"$f":"IFERROR(VLOOKUP($C59,База!$A$1:$F$15,2,0),\"\")","v":""}]
[null,"","",{"$f":"IFERROR(VLOOKUP($C60,База!$A$1:$F$15,2,0),\"\")","v":""},{"$f":"IFERROR(VLOOKUP($C60,База!$A$1:$F$15,3,0),\"\")","v":""},{"$f":"IFERROR(VLOOKUP($C60,База!$A$1:$F$15,4,0),\"\")","v":""},{"$f":"IFERROR(VLOOKUP($C60,База!$A$1:$F$15,5,0),\"\")","v":""},{"$f":"IFERROR(VLOOKUP($C60,База!$A$1:$F$15,2,0),\"\")","v":""}]
{"$rows_left_out":36}
{"sheet":"ББ","index":1,"n_rows":92,"n_cols":8,"rows_kept":92,"cut":false,"hidden":false,"merged":[]}
[]
[null,null,null,null,"Договор2"]
[]
[]
[null,null,null,null,"Дата действия прайс-листа: с 01 ДЕКАБРЯ 2015 года"]
[]
[null,"№","Линейка","Цена базовая, руб","Цена договора, руб","Цена базовая НОВАЯ, руб","Цена поставки НОВАЯ, руб","Изменение цены поставки, %"]
[null,null,"Скидка",null,0.28999999999999998,null,0.33]
[null,1,"а1",50,35.5,58,38.86,9.464788732394358E-2]
[null,2,"а2",94,66.739999999999995,104,69.679999999999993,4.405154330236738E-2]
[null,3,"а3",69,48.989999999999995,79,52.929999999999993,8.0424576444172224E-2]
[null,4,"а4",78,55.379999999999995,91,60.969999999999992,0.10093896713615025]
[null,5,"а5",78,55.379999999999995,91,60.969999999999992,0.10093896713615025]
[null,6,"а6",97,68.86999999999999,113,75.709999999999994,9.9317554813416642E-2]
[null,7,"а7",97,68.86999999999999,113,75.709999999999994,9.9317554813416642E-2]
[null,8,"а8",97,68.86999999999999,113,75.709999999999994,9.9317554813416642E-2]
[null,9,"а9",97,68.86999999999999,113,75.709999999999994,9.9317554813416642E-2]
[null,10,"а10",79,56.089999999999996,92,61.639999999999993,9.894811909431267E-2]
[null,11,"а11",78,55.379999999999995,91,60.969999999999992,0.10093896713615025]
[null,"",null,"","","","",""]
[null,"",null,"","","","",""]
[null,"",null,"","","","",""]
[null,"","","","","","",""]
[null,"","","","","","",""]
[null,"","","","","","",""]
[null,"","","","","","",""]
[null,"","","","","","",""]
[null,"","","","","","",""]
[null,"","","","","","",""]
[null,"","","","","","",""]
[null,"","","","","","",""]
[null,"","","","","","",""]
[null,"","","","","","",""]
[null,"","","","","","",""]
[null,"","","","","","",""]
[null,"","","","","","",""]
[null,"","","","","","",""]
[null,"","","","","","",""]
[null,"","","","","","",""]
[null,"","","","","","",""]
[null,"","","","","","",""]
[null,"","","","","","",""]
[null,"","","","","","",""]
[null,"","","","","","",""]
[null,"","","","","","",""]
[null,"","","","","","",""]
[null,"","","","","","",""]
[null,"","","","","","",""]
[null,"","","","","","",""]
[null,"","","","","","",""]
[null,"","","","","","",""]
[null,"","","","","","",""]
[null,"","","","","","",""]
[null,"","","","","","",""]
[null,"","","","","","",""]
[null,"","","","","","",""]
[null,"","","","","","",""]
[null,"","","","","","",""]
[null,"","","","","","",""]
[null,"","","","","","",""]
{"$rows_left_out":33}
{"sheet":"База","index":2,"n_rows":15,"n_cols":6,"rows_kept":15,"cut":false,"hidden":false,"merged":[]}
["Линейка","Цена базовая, руб","Цена договора, руб","Цена базовая НОВАЯ, руб","Цена поставки НОВАЯ, руб","Изменение цены поставки, %"]
["а1",50,35.5,58,38.86,9.464788732394358E-2]
["а2",94,66.739999999999995,104,69.679999999999993,4.405154330236738E-2]
["а3",69,48.989999999999995,79,52.929999999999993,8.0424576444172224E-2]
["а4",78,55.379999999999995,91,60.969999999999992,0.10093896713615025]
["а5",78,55.379999999999995,91,60.969999999999992,0.10093896713615025]
["а6",97,68.86999999999999,113,75.709999999999994,9.9317554813416642E-2]
["а7",97,68.86999999999999,113,75.709999999999994,9.9317554813416642E-2]
["а8",97,68.86999999999999,113,75.709999999999994,9.9317554813416642E-2]
["а9",97,68.86999999999999,113,75.709999999999994,9.9317554813416642E-2]
["а10",79,56.089999999999996,92,61.639999999999993,9.894811909431267E-2]
["а11",78,55.379999999999995,91,60.969999999999992,0.10093896713615025]
["а12",100,71,117,78.389999999999986,0.10408450704225336]
["а13",101,71.709999999999994,118,79.059999999999988,0.10249616510946868]
["а14",100,71,116,77.72,9.464788732394358E-2]

{"sheet":"Скидка","index":3,"n_rows":3,"n_cols":3,"rows_kept":3,"cut":false,"hidden":false,"merged":[]}
[]
["Договор1",0.26,0.35]
["Договор2",0.23,0.48]