{"text_format":"1","workbook":"xlsx","n_sheets":2,"sheets":["Купоны","Пакеты"],"not_rendered":{"charts":0,"images":0,"macros":1,"external_links":0,"defined_names":6,"comments":1,"pivot_tables":0},"unopened":[],"bounds":{"document_bytes":16777216,"sheet_cells":100000,"rows_first":2000,"rows_last":500,"rows_between":2000,"halvings":0,"cell_chars":16384,"cell_head_chars":4096},"cells_cut":0,"cells_raw":0,"read":"whole","date_system":"1900"}

{"sheet":"Купоны","index":0,"n_rows":78,"n_cols":51,"rows_kept":78,"cut":false,"hidden":false,"merged":[[0,37,0,50],[0,1,0,9],[5,1,5,9],[1,1,1,9],[12,1,12,9],[2,1,2,9],[10,1,10,9],[3,1,3,9],[6,1,6,9],[7,1,7,9],[8,1,8,9],[9,1,9,9],[4,1,4,9],[6,39,6,48],[7,39,9,44],[7,45,9,48],[11,1,11,9],[15,1,15,9],[14,1,14,9],[10,39,12,43],[10,44,12,48],[13,1,13,9]]}
["№","Событие",null,null,null,null,null,null,null,null,"Пул","Исход",1,2,3,4,5,6,7,8,9,10,11,12,13,14,15,16,17,18,19,20,21,22,23,24,25,"Информация"]
[1,null,null,null,null,null,null,null,null,null,null,null,2,1,1,1,2]
[2,null,null,null,null,null,null,null,null,null,null,null,1,"x",1,2,1]
[3,null,null,null,null,null,null,null,null,null,null,null,2,1,"x",1,"x"]
[4,null,null,null,null,null,null,null,null,null,null,null,"x","x",1,1,"x"]
[5,null,null,null,null,null,null,null,null,null,null,null,"x",2,2,1,"x"]
[6,null,null,null,null,null,null,null,null,null,null,null,1,"x",1,1,1,null,null,null,null,null,null,null,null,null,null,null,null,null,null,null,null,null,null,null,null,null,null,"Заполнить случайно"]
[7,null,null,null,null,null,null,null,null,null,null,null,"x",1,1,2,2]
[8,null,null,null,null,null,null,null,null,null,null,null,"x",1,1,1,1]
[9,null,null,null,null,null,null,null,null,null,null,null,"x",2,2,2,"x"]
[10,null,null,null,null,null,null,null,null,null,null,null,2,"x",1,1,1]
[11,null,null,null,null,null,null,null,null,null,null,null,1,2,2,1,"x"]
[12,null,null,null,null,null,null,null,null,null,null,null,2,2,1,1,2]
[13,null,null,null,null,null,null,null,null,null,null,null,1,1,1,1,2]
[14,null,null,null,null,null,null,null,null,null,null,null,1,2,1,2,"x"]
{"$rows_left_out":64}
{"sheet":"Пакеты","index":1,"n_rows":27,"n_cols":93,"rows_kept":27,"cut":false,"hidden":false,"merged":[[26,0,29,92]]}
[50,";",1,"-","(",{"$f":"LOOKUP(2,1/(Купоны!M2<>\"\"),Купоны!M2)","v":2},")",";",2,"-","(",{"$f":"LOOKUP(2,1/(Купоны!M3<>\"\"),Купоны!M3)","v":1},")",";",3,"-","(",{"$f":"LOOKUP(2,1/(Купоны!M4<>\"\"),Купоны!M4)","v":2},")",";",4,"-","(",{"$f":"LOOKUP(2,1/(Купоны!M5<>\"\"),Купоны!M5)","v":"x"},")",";",5,"-","(",{"$f":"LOOKUP(2,1/(Купоны!M6<>\"\"),Купоны!M6)","v":"x"},")",";",6,"-","(",{"$f":"LOOKUP(2,1/(Купоны!M7<>\"\"),Купоны!M7)","v":1},")",";",7,"-","(",{"$f":"LOOKUP(2,1/(Купоны!M8<>\"\"),Купоны!M8)","v":"x"},")",";",8,"-","(",{"$f":"LOOKUP(2,1/(Купоны!M9<>\"\"),Купоны!M9)","v":"x"},")",";",9,"-","(",{"$f":"LOOKUP(2,1/(Купоны!M10<>\"\"),Купоны!M10)","v":"x"},")",";",10,"-","(",{"$f":"LOOKUP(2,1/(Купоны!M11<>\"\"),Купоны!M11)","v":2},")",";",11,"-","(",{"$f":"LOOKUP(2,1/(Купоны!M12<>\"\"),Купоны!M12)","v":1},")",";",12,"-","(",{"$f":"LOOKUP(2,1/(Купоны!M13<>\"\"),Купоны!M13)","v":2},")",";",13,"-","(",{"$f":"LOOKUP(2,1/(Купоны!M14<>\"\"),Купоны!M14)","v":1},")",";",14,"-","(",{"$f":"LOOKUP(2,1/(Купоны!M15<>\"\"),Купоны!M15)","v":1},")",";",15,"-","(",{"$f":"LOOKUP(2,1/(Купоны!M16<>\"\"),Купоны!M16)","v":"x"},")",".",{"$f":"IFERROR(CONCATENATE(A1,B1,C1,D1,E1,F1,G1,H1,I1,J1,K1,L1,M1,N1,O1,P1,Q1,R1,S1,T1,U1,V1,W1,X1,Y1,Z1,AA1,AB1,AC1,AD1,AE1,AF1,AG1,AH1,AI1,AJ1,AK1,AL1,AM1,AN1,AO1,AP1,AQ1,AR1,AS1,AT1,AU1,AV1,AW1,AX1,AY1,AZ1,BA1,BB1,BC1,BD1,BE1,BF1,BG1,BH1,BI1,BJ1,BK1,BL1,BM1,BN1,BO1,BP1,BQ1,BR1,BS1,BT1,BU1,BV1,BW1,BX1,BY1,BZ1,CA1,CB1,CC1,CD1,CE1,CF1,CG1,CH1,CI1,CJ1,CK1,CL1,CM1,CN1),\"\")","v":"50;1-(2);2-(1);3-(2);4-(x);5-(x);6-(1);7-(x);8-(x);9-(x);10-(2);11-(1);12-(2);13-(1);14-(1);15-(x)."}]
[50,";",1,"-","(",{"$f":"LOOKUP(2,1/(Купоны!N2<>\"\"),Купоны!N2)","v":1},")",";",2,"-","(",{"$f":"LOOKUP(2,1/(Купоны!N3<>\"\"),Купоны!N3)","v":"x"},")",";",3,"-","(",{"$f":"LOOKUP(2,1/(Купоны!N4<>\"\"),Купоны!N4)","v":1},")",";",4,"-","(",{"$f":"LOOKUP(2,1/(Купоны!N5<>\"\"),Купоны!N5)","v":"x"},")",";",5,"-","(",{"$f":"LOOKUP(2,1/(Купоны!N6<>\"\"),Купоны!N6)","v":2},")",";",6,"-","(",{"$f":"LOOKUP(2,1/(Купоны!N7<>\"\"),Купоны!N7)","v":"x"},")",";",7,"-","(",{"$f":"LOOKUP(2,1/(Купоны!N8<>\"\"),Купоны!N8)","v":1},")",";",8,"-","(",{"$f":"LOOKUP(2,1/(Купоны!N9<>\"\"),Купоны!N9)","v":1},")",";",9,"-","(",{"$f":"LOOKUP(2,1/(Купоны!N10<>\"\"),Купоны!N10)","v":2},")",";",10,"-","(",{"$f":"LOOKUP(2,1/(Купоны!N11<>\"\"),Купоны!N11)","v":"x"},")",";",11,"-","(",{"$f":"LOOKUP(2,1/(Купоны!N12<>\"\"),Купоны!N12)","v":2},")",";",12,"-","(",{"$f":"LOOKUP(2,1/(Купоны!N13<>\"\"),Купоны!N13)","v":2},")",";",13,"-","(",{"$f":"LOOKUP(2,1/(Купоны!N14<>\"\"),Купоны!N14)","v":1},")",";",14,"-","(",{"$f":"LOOKUP(2,1/(Купоны!N15<>\"\"),Купоны!N15)","v":2},")",";",15,"-","(",{"$f":"LOOKUP(2,1/(Купоны!N16<>\"\"),Купоны!N16)","v":1},")",".",{"$f":"IFERROR(CONCATENATE(A2,B2,C2,D2,E2,F2,G2,H2,I2,J2,K2,L2,M2,N2,O2,P2,Q2,R2,S2,T2,U2,V2,W2,X2,Y2,Z2,AA2,AB2,AC2,AD2,AE2,AF2,AG2,AH2,AI2,AJ2,AK2,AL2,AM2,AN2,AO2,AP2,AQ2,AR2,AS2,AT2,AU2,AV2,AW2,AX2,AY2,AZ2,BA2,BB2,BC2,BD2,BE2,BF2,BG2,BH2,BI2,BJ2,BK2,BL2,BM2,BN2,BO2,BP2,BQ2,BR2,BS2,BT2,BU2,BV2,BW2,BX2,BY2,BZ2,CA2,CB2,CC2,CD2,CE2,CF2,CG2,CH2,CI2,CJ2,CK2,CL2,CM2,CN2),\"\")","v":"50;1-(1);2-(x);3-(1);4-(x);5-(2);6-(x);7-(1);8-(1);9-(2);10-(x);11-(2);12-(2);13-(1);14-(2);15-(1)."}]
[50,";",1,"-","(",{"$f":"LOOKUP(2,1/(Купоны!O2<>\"\"),Купоны!O2)","v":1},")",";",2,"-","(",{"$f":"LOOKUP(2,1/(Купоны!O3<>\"\"),Купоны!O3)","v":1},")",";",3,"-","(",{"$f":"LOOKUP(2,1/(Купоны!O4<>\"\"),Купоны!O4)","v":"x"},")",";",4,"-","(",{"$f":"LOOKUP(2,1/(Купоны!O5<>\"\"),Купоны!O5)","v":1},")",";",5,"-","(",{"$f":"LOOKUP(2,1/(Купоны!O6<>\"\"),Купоны!O6)","v":2},")",";",6,"-","(",{"$f":"LOOKUP(2,1/(Купоны!O7<>\"\"),Купоны!O7)","v":1},")",";",7,"-","(",{"$f":"LOOKUP(2,1/(Купоны!O8<>\"\"),Купоны!O8)","v":1},")",";",8,"-","(",{"$f":"LOOKUP(2,1/(Купоны!O9<>\"\"),Купоны!O9)","v":1},")",";",9,"-","(",{"$f":"LOOKUP(2,1/(Купоны!O10<>\"\"),Купоны!O10)","v":2},")",";",10,"-","(",{"$f":"LOOKUP(2,1/(Купоны!O11<>\"\"),Купоны!O11)","v":1},")",";",11,"-","(",{"$f":"LOOKUP(2,1/(Купоны!O12<>\"\"),Купоны!O12)","v":2},")",";",12,"-","(",{"$f":"LOOKUP(2,1/(Купоны!O13<>\"\"),Купоны!O13)","v":1},")",";",13,"-","(",{"$f":"LOOKUP(2,1/(Купоны!O14<>\"\"),Купоны!O14)","v":1},")",";",14,"-","(",{"$f":"LOOKUP(2,1/(Купоны!O15<>\"\"),Купоны!O15)","v":1},")",";",15,"-","(",{"$f":"LOOKUP(2,1/(Купоны!O16<>\"\"),Купоны!O16)","v":2},")",".","50;1-(1);2-(1);3-(x);4-(1);5-(2);6-(1);7-(1);8-(1);9-(2);10-(1);11-(2);12-(1);13-(1);14-(1);15-(2)."]
[50,";",1,"-","(",{"$f":"LOOKUP(2,1/(Купоны!P2<>\"\"),Купоны!P2)","v":1},")",";",2,"-","(",{"$f":"LOOKUP(2,1/(Купоны!P3<>\"\"),Купоны!P3)","v":2},")",";",3,"-","(",{"$f":"LOOKUP(2,1/(Купоны!P4<>\"\"),Купоны!P4)","v":1},")",";",4,"-","(",{"$f":"LOOKUP(2,1/(Купоны!P5<>\"\"),Купоны!P5)","v":1},")",";",5,"-","(",{"$f":"LOOKUP(2,1/(Купоны!P6<>\"\"),Купоны!P6)","v":1},")",";",6,"-","(",{"$f":"LOOKUP(2,1/(Купоны!P7<>\"\"),Купоны!P7)","v":1},")",";",7,"-","(",{"$f":"LOOKUP(2,1/(Купоны!P8<>\"\"),Купоны!P8)","v":2},")",";",8,"-","(",{"$f":"LOOKUP(2,1/(Купоны!P9<>\"\"),Купоны!P9)","v":1},")",";",9,"-","(",{"$f":"LOOKUP(2,1/(Купоны!P10<>\"\"),Купоны!P10)","v":2},")",";",10,"-","(",{"$f":"LOOKUP(2,1/(Купоны!P11<>\"\"),Купоны!P11)","v":1},")",";",11,"-","(",{"$f":"LOOKUP(2,1/(Купоны!P12<>\"\"),Купоны!P12)","v":1},")",";",12,"-","(",{"$f":"LOOKUP(2,1/(Купоны!P13<>\"\"),Купоны!P13)","v":1},")",";",13,"-","(",{"$f":"LOOKUP(2,1/(Купоны!P14<>\"\"),Купоны!P14)","v":1},")",";",14,"-","(",{"$f":"LOOKUP(2,1/(Купоны!P15<>\"\"),Купоны!P15)","v":2},")",";",15,"-","(",{"$f":"LOOKUP(2,1/(Купоны!P16<>\"\"),Купоны!P16)","v":1},")",".","50;1-(1);2-(2);3-(1);4-(1);5-(1);6-(1);7-(2);8-(1);9-(2);10-(1);11-(1);12-(1);13-(1);14-(2);15-(1)."]
[50,";",1,"-","(",{"$f":"LOOKUP(2,1/(Купоны!Q2<>\"\"),Купоны!Q2)","v":2},")",";",2,"-","(",{"$f":"LOOKUP(2,1/(Купоны!Q3<>\"\"),Купоны!Q3)","v":1},")",";",3,"-","(",{"$f":"LOOKUP(2,1/(Купоны!Q4<>\"\"),Купоны!Q4)","v":"x"},")",";",4,"-","(",{"$f":"LOOKUP(2,1/(Купоны!Q5<>\"\"),Купоны!Q5)","v":"x"},")",";",5,"-","(",{"$f":"LOOKUP(2,1/(Купоны!Q6<>\"\"),Купоны!Q6)","v":"x"},")",";",6,"-","(",{"$f":"LOOKUP(2,1/(Купоны!Q7<>\"\"),Купоны!Q7)","v":1},")",";",7,"-","(",{"$f":"LOOKUP(2,1/(Купоны!Q8<>\"\"),Купоны!Q8)","v":2},")",";",8,"-","(",{"$f":"LOOKUP(2,1/(Купоны!Q9<>\"\"),Купоны!Q9)","v":1},")",";",9,"-","(",{"$f":"LOOKUP(2,1/(Купоны!Q10<>\"\"),Купоны!Q10)","v":"x"},")",";",10,"-","(",{"$f":"LOOKUP(2,1/(Купоны!Q11<>\"\"),Купоны!Q11)","v":1},")",";",11,"-","(",{"$f":"LOOKUP(2,1/(Купоны!Q12<>\"\"),Купоны!Q12)","v":"x"},")",";",12,"-","(",{"$f":"LOOKUP(2,1/(Купоны!Q13<>\"\"),Купоны!Q13)","v":2},")",";",13,"-","(",{"$f":"LOOKUP(2,1/(Купоны!Q14<>\"\"),Купоны!Q14)","v":2},")",";",14,"-","(",{"$f":"LOOKUP(2,1/(Купоны!Q15<>\"\"),Купоны!Q15)","v":"x"},")",";",15,"-","(",{"$f":"LOOKUP(2,1/(Купоны!Q16<>\"\"),Купоны!Q16)","v":2},")",".","50;1-(2);2-(1);3-(x);4-(x);5-(x);6-(1);7-(2);8-(1);9-(x);10-(1);11-(x);12-(2);13-(2);14-(x);15-(2)."]
[50,";",1,"-","(",{"$f":"LOOKUP(2,1/(Купоны!R2<>\"\"),Купоны!R2)","v":{"$error":"#DIV/0!"}},")",";",2,"-","(",{"$f":"LOOKUP(2,1/(Купоны!R3<>\"\"),Купоны!R3)","v":{"$error":"#DIV/0!"}},")",";",3,"-","(",{"$f":"LOOKUP(2,1/(Купоны!R4<>\"\"),Купоны!R4)","v":{"$error":"#DIV/0!"}},")",";",4,"-","(",{"$f":"LOOKUP(2,1/(Купоны!R5<>\"\"),Купоны!R5)","v":{"$error":"#DIV/0!"}},")",";",5,"-","(",{"$f":"LOOKUP(2,1/(Купоны!R6<>\"\"),Купоны!R6)","v":{"$error":"#DIV/0!"}},")",";",6,"-","(",{"$f":"LOOKUP(2,1/(Купоны!R7<>\"\"),Купоны!R7)","v":{"$error":"#DIV/0!"}},")",";",7,"-","(",{"$f":"LOOKUP(2,1/(Купоны!R8<>\"\"),Купоны!R8)","v":{"$error":"#DIV/0!"}},")",";",8,"-","(",{"$f":"LOOKUP(2,1/(Купоны!R9<>\"\"),Купоны!R9)","v":{"$error":"#DIV/0!"}},")",";",9,"-","(",{"$f":"LOOKUP(2,1/(Купоны!R10<>\"\"),Купоны!R10)","v":{"$error":"#DIV/0!"}},")",";",10,"-","(",{"$f":"LOOKUP(2,1/(Купоны!R11<>\"\"),Купоны!R11)","v":{"$error":"#DIV/0!"}},")",";",11,"-","(",{"$f":"LOOKUP(2,1/(Купоны!R12<>\"\"),Купоны!R12)","v":{"$error":"#DIV/0!"}},")",";",12,"-","(",{"$f":"LOOKUP(2,1/(Купоны!R13<>\"\"),Купоны!R13)","v":{"$error":"#DIV/0!"}},")",";",13,"-","(",{"$f":"LOOKUP(2,1/(Купоны!R14<>\"\"),Купоны!R14)","v":{"$error":"#DIV/0!"}},")",";",14,"-","(",{"$f":"LOOKUP(2,1/(Купоны!R15<>\"\"),Купоны!R15)","v":{"$error":"#DIV/0!"}},")",";",15,"-","(",{"$f":"LOOKUP(2,1/(Купоны!R16<>\"\"),Купоны!R16)","v":{"$error":"#DIV/0!"}},")",".",""]
[50,";",1,"-","(",{"$f":"LOOKUP(2,1/(Купоны!S2<>\"\"),Купоны!S2)","v":{"$error":"#DIV/0!"}},")",";",2,"-","(",{"$f":"LOOKUP(2,1/(Купоны!S3<>\"\"),Купоны!S3)","v":{"$error":"#DIV/0!"}},")",";",3,"-","(",{"$f":"LOOKUP(2,1/(Купоны!S4<>\"\"),Купоны!S4)","v":{"$error":"#DIV/0!"}},")",";",4,"-","(",{"$f":"LOOKUP(2,1/(Купоны!S5<>\"\"),Купоны!S5)","v":{"$error":"#DIV/0!"}},")",";",5,"-","(",{"$f":"LOOKUP(2,1/(Купоны!S6<>\"\"),Купоны!S6)","v":{"$error":"#DIV/0!"}},")",";",6,"-","(",{"$f":"LOOKUP(2,1/(Купоны!S7<>\"\"),Купоны!S7)","v":{"$error":"#DIV/0!"}},")",";",7,"-","(",{"$f":"LOOKUP(2,1/(Купоны!S8<>\"\"),Купоны!S8)","v":{"$error":"#DIV/0!"}},")",";",8,"-","(",{"$f":"LOOKUP(2,1/(Купоны!S9<>\"\"),Купоны!S9)","v":{"$error":"#DIV/0!"}},")",";",9,"-","(",{"$f":"LOOKUP(2,1/(Купоны!S10<>\"\"),Купоны!S10)","v":{"$error":"#DIV/0!"}},")",";",10,"-","(",{"$f":"LOOKUP(2,1/(Купоны!S11<>\"\"),Купоны!S11)","v":{"$error":"#DIV/0!"}},")",";",11,"-","(",{"$f":"LOOKUP(2,1/(Купоны!S12<>\"\"),Купоны!S12)","v":{"$error":"#DIV/0!"}},")",";",12,"-","(",{"$f":"LOOKUP(2,1/(Купоны!S13<>\"\"),Купоны!S13)","v":{"$error":"#DIV/0!"}},")",";",13,"-","(",{"$f":"LOOKUP(2,1/(Купоны!S14<>\"\"),Купоны!S14)","v":{"$error":"#DIV/0!"}},")",";",14,"-","(",{"$f":"LOOKUP(2,1/(Купоны!S15<>\"\"),Купоны!S15)","v":{"$error":"#DIV/0!"}},")",";",15,"-","(",{"$f":"LOOKUP(2,1/(Купоны!S16<>\"\"),Купоны!S16)","v":{"$error":"#DIV/0!"}},")",".",""]
[50,";",1,"-","(",{"$f":"LOOKUP(2,1/(Купоны!T2<>\"\"),Купоны!T2)","v":{"$error":"#DIV/0!"}},")",";",2,"-","(",{"$f":"LOOKUP(2,1/(Купоны!T3<>\"\"),Купоны!T3)","v":{"$error":"#DIV/0!"}},")",";",3,"-","(",{"$f":"LOOKUP(2,1/(Купоны!T4<>\"\"),Купоны!T4)","v":{"$error":"#DIV/0!"}},")",";",4,"-","(",{"$f":"LOOKUP(2,1/(Купоны!T5<>\"\"),Купоны!T5)","v":{"$error":"#DIV/0!"}},")",";",5,"-","(",{"$f":"LOOKUP(2,1/(Купоны!T6<>\"\"),Купоны!T6)","v":{"$error":"#DIV/0!"}},")",";",6,"-","(",{"$f":"LOOKUP(2,1/(Купоны!T7<>\"\"),Купоны!T7)","v":{"$error":"#DIV/0!"}},")",";",7,"-","(",{"$f":"LOOKUP(2,1/(Купоны!T8<>\"\"),Купоны!T8)","v":{"$error":"#DIV/0!"}},")",";",8,"-","(",{"$f":"LOOKUP(2,1/(Купоны!T9<>\"\"),Купоны!T9)","v":{"$error":"#DIV/0!"}},")",";",9,"-","(",{"$f":"LOOKUP(2,1/(Купоны!T10<>\"\"),Купоны!T10)","v":{"$error":"#DIV/0!"}},")",";",10,"-","(",{"$f":"LOOKUP(2,1/(Купоны!T11<>\"\"),Купоны!T11)","v":{"$error":"#DIV/0!"}},")",";",11,"-","(",{"$f":"LOOKUP(2,1/(Купоны!T12<>\"\"),Купоны!T12)","v":{"$error":"#DIV/0!"}},")",";",12,"-","(",{"$f":"LOOKUP(2,1/(Купоны!T13<>\"\"),Купоны!T13)","v":{"$error":"#DIV/0!"}},")",";",13,"-","(",{"$f":"LOOKUP(2,1/(Купоны!T14<>\"\"),Купоны!T14)","v":{"$error":"#DIV/0!"}},")",";",14,"-","(",{"$f":"LOOKUP(2,1/(Купоны!T15<>\"\"),Купоны!T15)","v":{"$error":"#DIV/0!"}},")",";",15,"-","(",{"$f":"LOOKUP(2,1/(Купоны!T16<>\"\"),Купоны!T16)","v":{"$error":"#DIV/0!"}},")",".",""]
[50,";",1,"-","(",{"$f":"LOOKUP(2,1/(Купоны!U2<>\"\"),Купоны!U2)","v":{"$error":"#DIV/0!"}},")",";",2,"-","(",{"$f":"LOOKUP(2,1/(Купоны!U3<>\"\"),Купоны!U3)","v":{"$error":"#DIV/0!"}},")",";",3,"-","(",{"$f":"LOOKUP(2,1/(Купоны!U4<>\"\"),Купоны!U4)","v":{"$error":"#DIV/0!"}},")",";",4,"-","(",{"$f":"LOOKUP(2,1/(Купоны!U5<>\"\"),Купоны!U5)","v":{"$error":"#DIV/0!"}},")",";",5,"-","(",{"$f":"LOOKUP(2,1/(Купоны!U6<>\"\"),Купоны!U6)","v":{"$error":"#DIV/0!"}},")",";",6,"-","(",{"$f":"LOOKUP(2,1/(Купоны!U7<>\"\"),Купоны!U7)","v":{"$error":"#DIV/0!"}},")",";",7,"-","(",{"$f":"LOOKUP(2,1/(Купоны!U8<>\"\"),Купоны!U8)","v":{"$error":"#DIV/0!"}},")",";",8,"-","(",{"$f":"LOOKUP(2,1/(Купоны!U9<>\"\"),Купоны!U9)","v":{"$error":"#DIV/0!"}},")",";",9,"-","(",{"$f":"LOOKUP(2,1/(Купоны!U10<>\"\"),Купоны!U10)","v":{"$error":"#DIV/0!"}},")",";",10,"-","(",{"$f":"LOOKUP(2,1/(Купоны!U11<>\"\"),Купоны!U11)","v":{"$error":"#DIV/0!"}},")",";",11,"-","(",{"$f":"LOOKUP(2,1/(Купоны!U12<>\"\"),Купоны!U12)","v":{"$error":"#DIV/0!"}},")",";",12,"-","(",{"$f":"LOOKUP(2,1/(Купоны!U13<>\"\"),Купоны!U13)","v":{"$error":"#DIV/0!"}},")",";",13,"-","(",{"$f":"LOOKUP(2,1/(Купоны!U14<>\"\"),Купоны!U14)","v":{"$error":"#DIV/0!"}},")",";",14,"-","(",{"$f":"LOOKUP(2,1/(Купоны!U15<>\"\"),Купоны!U15)","v":{"$error":"#DIV/0!"}},")",";",15,"-","(",{"$f":"LOOKUP(2,1/(Купоны!U16<>\"\"),Купоны!U16)","v":{"$error":"#DIV/0!"}},")",".",""]
[50,";",1,"-","(",{"$f":"LOOKUP(2,1/(Купоны!V2<>\"\"),Купоны!V2)","v":{"$error":"#DIV/0!"}},")",";",2,"-","(",{"$f":"LOOKUP(2,1/(Купоны!V3<>\"\"),Купоны!V3)","v":{"$error":"#DIV/0!"}},")",";",3,"-","(",{"$f":"LOOKUP(2,1/(Купоны!V4<>\"\"),Купоны!V4)","v":{"$error":"#DIV/0!"}},")",";",4,"-","(",{"$f":"LOOKUP(2,1/(Купоны!V5<>\"\"),Купоны!V5)","v":{"$error":"#DIV/0!"}},")",";",5,"-","(",{"$f":"LOOKUP(2,1/(Купоны!V6<>\"\"),Купоны!V6)","v":{"$error":"#DIV/0!"}},")",";",6,"-","(",{"$f":"LOOKUP(2,1/(Купоны!V7<>\"\"),Купоны!V7)","v":{"$error":"#DIV/0!"}},")",";",7,"-","(",{"$f":"LOOKUP(2,1/(Купоны!V8<>\"\"),Купоны!V8)","v":{"$error":"#DIV/0!"}},")",";",8,"-","(",{"$f":"LOOKUP(2,1/(Купоны!V9<>\"\"),Купоны!V9)","v":{"$error":"#DIV/0!"}},")",";",9,"-","(",{"$f":"LOOKUP(2,1/(Купоны!V10<>\"\"),Купоны!V10)","v":{"$error":"#DIV/0!"}},")",";",10,"-","(",{"$f":"LOOKUP(2,1/(Купоны!V11<>\"\"),Купоны!V11)","v":{"$error":"#DIV/0!"}},")",";",11,"-","(",{"$f":"LOOKUP(2,1/(Купоны!V12<>\"\"),Купоны!V12)","v":{"$error":"#DIV/0!"}},")",";",12,"-","(",{"$f":"LOOKUP(2,1/(Купоны!V13<>\"\"),Купоны!V13)","v":{"$error":"#DIV/0!"}},")",";",13,"-","(",{"$f":"LOOKUP(2,1/(Купоны!V14<>\"\"),Купоны!V14)","v":{"$error":"#DIV/0!"}},")",";",14,"-","(",{"$f":"LOOKUP(2,1/(Купоны!V15<>\"\"),Купоны!V15)","v":{"$error":"#DIV/0!"}},")",";",15,"-","(",{"$f":"LOOKUP(2,1/(Купоны!V16<>\"\"),Купоны!V16)","v":{"$error":"#DIV/0!"}},")",".",""]
[50,";",1,"-","(",{"$f":"LOOKUP(2,1/(Купоны!W2<>\"\"),Купоны!W2)","v":{"$error":"#DIV/0!"}},")",";",2,"-","(",{"$f":"LOOKUP(2,1/(Купоны!W3<>\"\"),Купоны!W3)","v":{"$error":"#DIV/0!"}},")",";",3,"-","(",{"$f":"LOOKUP(2,1/(Купоны!W4<>\"\"),Купоны!W4)","v":{"$error":"#DIV/0!"}},")",";",4,"-","(",{"$f":"LOOKUP(2,1/(Купоны!W5<>\"\"),Купоны!W5)","v":{"$error":"#DIV/0!"}},")",";",5,"-","(",{"$f":"LOOKUP(2,1/(Купоны!W6<>\"\"),Купоны!W6)","v":{"$error":"#DIV/0!"}},")",";",6,"-","(",{"$f":"LOOKUP(2,1/(Купоны!W7<>\"\"),Купоны!W7)","v":{"$error":"#DIV/0!"}},")",";",7,"-","(",{"$f":"LOOKUP(2,1/(Купоны!W8<>\"\"),Купоны!W8)","v":{"$error":"#DIV/0!"}},")",";",8,"-","(",{"$f":"LOOKUP(2,1/(Купоны!W9<>\"\"),Купоны!W9)","v":{"$error":"#DIV/0!"}},")",";",9,"-","(",{"$f":"LOOKUP(2,1/(Купоны!W10<>\"\"),Купоны!W10)","v":{"$error":"#DIV/0!"}},")",";",10,"-","(",{"$f":"LOOKUP(2,1/(Купоны!W11<>\"\"),Купоны!W11)","v":{"$error":"#DIV/0!"}},")",";",11,"-","(",{"$f":"LOOKUP(2,1/(Купоны!W12<>\"\"),Купоны!W12)","v":{"$error":"#DIV/0!"}},")",";",12,"-","(",{"$f":"LOOKUP(2,1/(Купоны!W13<>\"\"),Купоны!W13)","v":{"$error":"#DIV/0!"}},")",";",13,"-","(",{"$f":"LOOKUP(2,1/(Купоны!W14<>\"\"),Купоны!W14)","v":{"$error":"#DIV/0!"}},")",";",14,"-","(",{"$f":"LOOKUP(2,1/(Купоны!W15<>\"\"),Купоны!W15)","v":{"$error":"#DIV/0!"}},")",";",15,"-","(",{"$f":"LOOKUP(2,1/(Купоны!W16<>\"\"),Купоны!W16)","v":{"$error":"#DIV/0!"}},")",".",""]
[50,";",1,"-","(",{"$f":"LOOKUP(2,1/(Купоны!X2<>\"\"),Купоны!X2)","v":{"$error":"#DIV/0!"}},")",";",2,"-","(",{"$f":"LOOKUP(2,1/(Купоны!X3<>\"\"),Купоны!X3)","v":{"$error":"#DIV/0!"}},")",";",3,"-","(",{"$f":"LOOKUP(2,1/(Купоны!X4<>\"\"),Купоны!X4)","v":{"$error":"#DIV/0!"}},")",";",4,"-","(",{"$f":"LOOKUP(2,1/(Купоны!X5<>\"\"),Купоны!X5)","v":{"$error":"#DIV/0!"}},")",";",5,"-","(",{"$f":"LOOKUP(2,1/(Купоны!X6<>\"\"),Купоны!X6)","v":{"$error":"#DIV/0!"}},")",";",6,"-","(",{"$f":"LOOKUP(2,1/(Купоны!X7<>\"\"),Купоны!X7)","v":{"$error":"#DIV/0!"}},")",";",7,"-","(",{"$f":"LOOKUP(2,1/(Купоны!X8<>\"\"),Купоны!X8)","v":{"$error":"#DIV/0!"}},")",";",8,"-","(",{"$f":"LOOKUP(2,1/(Купоны!X9<>\"\"),Купоны!X9)","v":{"$error":"#DIV/0!"}},")",";",9,"-","(",{"$f":"LOOKUP(2,1/(Купоны!X10<>\"\"),Купоны!X10)","v":{"$error":"#DIV/0!"}},")",";",10,"-","(",{"$f":"LOOKUP(2,1/(Купоны!X11<>\"\"),Купоны!X11)","v":{"$error":"#DIV/0!"}},")",";",11,"-","(",{"$f":"LOOKUP(2,1/(Купоны!X12<>\"\"),Купоны!X12)","v":{"$error":"#DIV/0!"}},")",";",12,"-","(",{"$f":"LOOKUP(2,1/(Купоны!X13<>\"\"),Купоны!X13)","v":{"$error":"#DIV/0!"}},")",";",13,"-","(",{"$f":"LOOKUP(2,1/(Купоны!X14<>\"\"),Купоны!X14)","v":{"$error":"#DIV/0!"}},")",";",14,"-","(",{"$f":"LOOKUP(2,1/(Купоны!X15<>\"\"),Купоны!X15)","v":{"$error":"#DIV/0!"}},")",";",15,"-","(",{"$f":"LOOKUP(2,1/(Купоны!X16<>\"\"),Купоны!X16)","v":{"$error":"#DIV/0!"}},")",".",""]
[50,";",1,"-","(",{"$f":"LOOKUP(2,1/(Купоны!Y2<>\"\"),Купоны!Y2)","v":{"$error":"#DIV/0!"}},")",";",2,"-","(",{"$f":"LOOKUP(2,1/(Купоны!Y3<>\"\"),Купоны!Y3)","v":{"$error":"#DIV/0!"}},")",";",3,"-","(",{"$f":"LOOKUP(2,1/(Купоны!Y4<>\"\"),Купоны!Y4)","v":{"$error":"#DIV/0!"}},")",";",4,"-","(",{"$f":"LOOKUP(2,1/(Купоны!Y5<>\"\"),Купоны!Y5)","v":{"$error":"#DIV/0!"}},")",";",5,"-","(",{"$f":"LOOKUP(2,1/(Купоны!Y6<>\"\"),Купоны!Y6)","v":{"$error":"#DIV/0!"}},")",";",6,"-","(",{"$f":"LOOKUP(2,1/(Купоны!Y7<>\"\"),Купоны!Y7)","v":{"$error":"#DIV/0!"}},")",";",7,"-","(",{"$f":"LOOKUP(2,1/(Купоны!Y8<>\"\"),Купоны!Y8)","v":{"$error":"#DIV/0!"}},")",";",8,"-","(",{"$f":"LOOKUP(2,1/(Купоны!Y9<>\"\"),Купоны!Y9)","v":{"$error":"#DIV/0!"}},")",";",9,"-","(",{"$f":"LOOKUP(2,1/(Купоны!Y10<>\"\"),Купоны!Y10)","v":{"$error":"#DIV/0!"}},")",";",10,"-","(",{"$f":"LOOKUP(2,1/(Купоны!Y11<>\"\"),Купоны!Y11)","v":{"$error":"#DIV/0!"}},")",";",11,"-","(",{"$f":"LOOKUP(2,1/(Купоны!Y12<>\"\"),Купоны!Y12)","v":{"$error":"#DIV/0!"}},")",";",12,"-","(",{"$f":"LOOKUP(2,1/(Купоны!Y13<>\"\"),Купоны!Y13)","v":{"$error":"#DIV/0!"}},")",";",13,"-","(",{"$f":"LOOKUP(2,1/(Купоны!Y14<>\"\"),Купоны!Y14)","v":{"$error":"#DIV/0!"}},")",";",14,"-","(",{"$f":"LOOKUP(2,1/(Купоны!Y15<>\"\"),Купоны!Y15)","v":{"$error":"#DIV/0!"}},")",";",15,"-","(",{"$f":"LOOKUP(2,1/(Купоны!Y16<>\"\"),Купоны!Y16)","v":{"$error":"#DIV/0!"}},")",".",""]
[50,";",1,"-","(",{"$f":"LOOKUP(2,1/(Купоны!Z2<>\"\"),Купоны!Z2)","v":{"$error":"#DIV/0!"}},")",";",2,"-","(",{"$f":"LOOKUP(2,1/(Купоны!Z3<>\"\"),Купоны!Z3)","v":{"$error":"#DIV/0!"}},")",";",3,"-","(",{"$f":"LOOKUP(2,1/(Купоны!Z4<>\"\"),Купоны!Z4)","v":{"$error":"#DIV/0!"}},")",";",4,"-","(",{"$f":"LOOKUP(2,1/(Купоны!Z5<>\"\"),Купоны!Z5)","v":{"$error":"#DIV/0!"}},")",";",5,"-","(",{"$f":"LOOKUP(2,1/(Купоны!Z6<>\"\"),Купоны!Z6)","v":{"$error":"#DIV/0!"}},")",";",6,"-","(",{"$f":"LOOKUP(2,1/(Купоны!Z7<>\"\"),Купоны!Z7)","v":{"$error":"#DIV/0!"}},")",";",7,"-","(",{"$f":"LOOKUP(2,1/(Купоны!Z8<>\"\"),Купоны!Z8)","v":{"$error":"#DIV/0!"}},")",";",8,"-","(",{"$f":"LOOKUP(2,1/(Купоны!Z9<>\"\"),Купоны!Z9)","v":{"$error":"#DIV/0!"}},")",";",9,"-","(",{"$f":"LOOKUP(2,1/(Купоны!Z10<>\"\"),Купоны!Z10)","v":{"$error":"#DIV/0!"}},")",";",10,"-","(",{"$f":"LOOKUP(2,1/(Купоны!Z11<>\"\"),Купоны!Z11)","v":{"$error":"#DIV/0!"}},")",";",11,"-","(",{"$f":"LOOKUP(2,1/(Купоны!Z12<>\"\"),Купоны!Z12)","v":{"$error":"#DIV/0!"}},")",";",12,"-","(",{"$f":"LOOKUP(2,1/(Купоны!Z13<>\"\"),Купоны!Z13)","v":{"$error":"#DIV/0!"}},")",";",13,"-","(",{"$f":"LOOKUP(2,1/(Купоны!Z14<>\"\"),Купоны!Z14)","v":{"$error":"#DIV/0!"}},")",";",14,"-","(",{"$f":"LOOKUP(2,1/(Купоны!Z15<>\"\"),Купоны!Z15)","v":{"$error":"#DIV/0!"}},")",";",15,"-","(",{"$f":"LOOKUP(2,1/(Купоны!Z16<>\"\"),Купоны!Z16)","v":{"$error":"#DIV/0!"}},")",".",""]
[50,";",1,"-","(",{"$f":"LOOKUP(2,1/(Купоны!AA2<>\"\"),Купоны!AA2)","v":{"$error":"#DIV/0!"}},")",";",2,"-","(",{"$f":"LOOKUP(2,1/(Купоны!AA3<>\"\"),Купоны!AA3)","v":{"$error":"#DIV/0!"}},")",";",3,"-","(",{"$f":"LOOKUP(2,1/(Купоны!AA4<>\"\"),Купоны!AA4)","v":{"$error":"#DIV/0!"}},")",";",4,"-","(",{"$f":"LOOKUP(2,1/(Купоны!AA5<>\"\"),Купоны!AA5)","v":{"$error":"#DIV/0!"}},")",";",5,"-","(",{"$f":"LOOKUP(2,1/(Купоны!AA6<>\"\"),Купоны!AA6)","v":{"$error":"#DIV/0!"}},")",";",6,"-","(",{"$f":"LOOKUP(2,1/(Купоны!AA7<>\"\"),Купоны!AA7)","v":{"$error":"#DIV/0!"}},")",";",7,"-","(",{"$f":"LOOKUP(2,1/(Купоны!AA8<>\"\"),Купоны!AA8)","v":{"$error":"#DIV/0!"}},")",";",8,"-","(",{"$f":"LOOKUP(2,1/(Купоны!AA9<>\"\"),Купоны!AA9)","v":{"$error":"#DIV/0!"}},")",";",9,"-","(",{"$f":"LOOKUP(2,1/(Купоны!AA10<>\"\"),Купоны!AA10)","v":{"$error":"#DIV/0!"}},")",";",10,"-","(",{"$f":"LOOKUP(2,1/(Купоны!AA11<>\"\"),Купоны!AA11)","v":{"$error":"#DIV/0!"}},")",";",11,"-","(",{"$f":"LOOKUP(2,1/(Купоны!AA12<>\"\"),Купоны!AA12)","v":{"$error":"#DIV/0!"}},")",";",12,"-","(",{"$f":"LOOKUP(2,1/(Купоны!AA13<>\"\"),Купоны!AA13)","v":{"$error":"#DIV/0!"}},")",";",13,"-","(",{"$f":"LOOKUP(2,1/(Купоны!AA14<>\"\"),Купоны!AA14)","v":{"$error":"#DIV/0!"}},")",";",14,"-","(",{"$f":"LOOKUP(2,1/(Купоны!AA15<>\"\"),Купоны!AA15)","v":{"$error":"#DIV/0!"}},")",";",15,"-","(",{"$f":"LOOKUP(2,1/(Купоны!AA16<>\"\"),Купоны!AA16)","v":{"$error":"#DIV/0!"}},")",".",""]
{"$rows_left_out":12}