{"text_format":"1","workbook":"xlsx","n_sheets":3,"sheets":["Времена","50=50%","Лист1"],"not_rendered":{"charts":0,"images":0,"macros":1,"external_links":1,"defined_names":22,"comments":1,"pivot_tables":0},"unopened":[],"bounds":{"document_bytes":16777216,"sheet_cells":100000,"rows_first":2000,"rows_last":500,"rows_between":2000,"halvings":0,"cell_chars":16384,"cell_head_chars":4096},"cells_cut":0,"cells_raw":0,"read":"whole","date_system":"1900"}

{"sheet":"Времена","index":0,"n_rows":28,"n_cols":16383,"rows_kept":28,"cut":false,"hidden":false,"merged":[[22,5,22,7],[23,5,23,7],[24,5,24,7],[0,11,0,12],[1,6,6,6],[1,9,6,9],[17,8,18,8],[13,6,18,6],[14,10,15,10],[17,10,18,10],[11,10,12,10],[11,8,12,8],[8,8,9,8],[1,4,6,4],[0,3,0,4],[0,7,0,8],[1,5,6,5],[13,1,18,1],[7,1,12,1],[1,1,6,1],[1,2,6,2],[7,5,12,5],[11,2,12,2],[7,2,10,2],[13,2,18,2],[13,5,18,5],[7,6,12,6],[14,8,15,8],[13,4,18,4],[4,15,4,16],[13,9,18,9],[7,9,12,9],[1,10,6,10],[7,10,10,10]]}
[".","ВРЕМЯ",null,"ВОПРОС",null,null,null,"УТВЕРЖДЕНИЕ",null,null,null,"ОТРИЦАНИЕ",null,null,"выбрать ТОП непр.глаголов",null,null,null,"open"]
[null,"Будущее","WILL","I","open ?",null,null,"I",null,null,null,"I",null,null,"ТОП_50"]
[null,null,null,"YOU",null,null,null,"YOU",null,null,null,"YOU"]
[".",null,null,"WE",null,null,null,"WE","WILL",null,null,"WE","     WILL NOT"]
[null,null,null,"THEY",null,null,null,"THEY","open",null,null,"THEY","open",null,null,"№ изучаемого слова "]
[null,null,null,"HE",null,null,null,"HE",null,null,null,"HE",null,null,null,"в ТОП_50",{"$f":"IF(ISERROR(MATCH(#REF!,'50=50%'!$D$3:$D$52,0)),,MATCH(#REF!,'50=50%'!$D$3:$D$52,0))","v":0}]
[null,null,null,"SHE",null,null,null,"SHE",null,null,null,"SHE",null,null,null,"в ТОП_100",{"$f":"IF(ISERROR(MATCH(#REF!,#REF!,0)),,MATCH(#REF!,#REF!,0))","v":0}]
[null,"Настоящее","DO ","I",null,null,null,"I","5. begin",null,{"$f":"IF(ISERROR(VLOOKUP(I9,#REF!,2,0)),\"\",VLOOKUP(I9,#REF!,2,0))","v":""},"I",null,null,null,"в ТОП_149",{"$f":"IF(ISERROR(MATCH(#REF!,#REF!,0)),,MATCH(#REF!,#REF!,0))","v":0}]
[null,null,null,"YOU",null,null,null,"YOU",{"$f":"TRIM(RIGHTB(SUBSTITUTE(I8,\".\",REPT(\" \",100)),99))","v":"begin"},null,null,"YOU","   DON'T",null,"Кликнуть для озвучивания","в ТОП_200",{"$f":"IF(ISERROR(MATCH(#REF!,#REF!,0)),,MATCH(#REF!,#REF!,0))","v":0}]
[null,null,null,"WE","open ?",null,null,"WE",null,null,null,"WE",null,null,null,"в ТОП_300",{"$f":"IF(ISERROR(MATCH(#REF!,#REF!,0)),,MATCH(#REF!,#REF!,0))","v":0}]
[null,null,null,"THEY",null,null,null,"THEY",null,null,null,"THEY","               open",null,null,"в ТОП_366",{"$f":"IF(ISERROR(MATCH(#REF!,#REF!,0)),,MATCH(#REF!,#REF!,0))-1","v":-1}]
[null,null,"DOES","HE",null,null,null,"HE","opens",null,null,"HE","  DOESN'T"]
[null,null,null,"SHE",null,null,null,"SHE",null,null,null,"SHE"]
[null,"Прошедшее","DID","I","open ?",null,null,"I","2-я форма глагола",null,null,"I"]
[null,null,null,"YOU",null,null,null,"YOU",{"$f":"INDEX('50=50%'!$C$3:$I$52,MATCH(Времена!$I$8,'50=50%'!$D$3:$D$52,0),4)","v":"began"},null,{"$f":"IF(ISERROR(VLOOKUP(Времена!$I$15,#REF!,2,0)),\"\",VLOOKUP(Времена!$I$15,#REF!,2,0))","v":""},"YOU",null,null,null,"скрыть слово"]
["sp",null,null,"WE",null,null,null,"WE",null,null,null,"WE","     DID",null,"Кликнуть для озвучивания","V"]
[null,null,null,"THEY",null,null,null,"THEY","3-я форма глагола",null,null,"THEY","NOT"]
[null,null,null,"HE",null,null,null,"HE","began",null,{"$f":"IF(ISERROR(VLOOKUP(Времена!$I$18,#REF!,2,0)),\"\",VLOOKUP(Времена!$I$18,#REF!,2,0))","v":""},"HE","open",null,null,"скрыть слово"]
[null,null,null,"SHE",null,null,null,"SHE",null,null,null,"SHE",null,null,"Кликнуть для озвучивания","V"]
[null,null,null,null,null,null,null,null,{"$f":"INDEX('50=50%'!$C$3:$I$52,MATCH(Времена!$I$8,'50=50%'!$D$3:$D$52,0),1)","v":"начинать"}]
{"$rows_left_out":9}
{"sheet":"50=50%","index":1,"n_rows":208,"n_cols":10,"rows_kept":208,"cut":false,"hidden":false,"merged":[[0,3,0,4],[0,5,0,6],[0,7,0,8]]}
[null,null,null,"1 форма ",null,"2 форма ",null,"3 форма "]
[null,null,"Перевод","Infinitive ТОП_50","Транскрипция","Past Simple","Транскрипция2","Past Participle","Транскрипция3","Группа"]
[null,1,"класть","1. put","[pˈʊt]","put",null,"put",null,1]
[null,2,"позволять","2. let","[lˈet]","let",null,"let",null,1]
[null,3,"помещать; ставить, установить","3. set","[sˈet]","set",null,"set",null,1]
[null,4,"читать","4. read","[ri:d]","read","[red]","read","[red]",1]
[null,5,"начинать","5. begin","[bıʹgın]","began","[bıʹgæn]","begun","[bɪˈgʌn] ",2]
[null,6,"находить","6. find","[fˈaɪnd]","found","[fˈaʊːnd]","found",null,3]
[null,7,"стоять","7. stand","[stˈænd]","stood","[stuːd]","stood",null,3]
[null,8,"понимать","8. understand","[ʌndəstˈænd]","understood","[ˌʌndəˈstʊd] ","understood",null,3]
[null,9,"получать; становиться; добираться","9. get","[gˈet]","got","[gˈɒt]","got",null,3]
[null,10,"выиграть; победить","10. win","[wˈɪn]","won","[wˈʌn]","won",null,3]
[null,11,"сидеть","11. sit","[sˈɪt]","sat","[sˈæt]","sat",null,3]
[null,12,"встречать","12. meet","[mˈiːt]","met","[mˈet]","met",null,3]
[null,13,"вести, приводить","13. lead","[liːd]","led","[lˈed]","led",null,3]
[null,14,"держать","14. hold","[hould]","held","[hˈeld]","held",null,3]
[null,15,"мочь; уметь","15. can","[kˈæn]","could","[kˈʊd]","could",null,4]
[null,16,"рассказывать","16. tell","[tˈel]","told","[tould]","told",null,4]
[null,17,"слышать, услышать","17. hear","[hˈɪəː]","heard","[hˈɜːd]","heard",null,4]
[null,18,"мочь; иметь возможность","18. may","[mˈeɪː]","might","[mˈaɪt]","might",null,5]
{"$rows_left_out":189}
{"sheet":"Лист1","index":2,"n_rows":2,"n_cols":1,"rows_kept":2,"cut":false,"hidden":true,"merged":[]}
["V"]
["X"]