{"text_format":"1","workbook":"xlsx","n_sheets":8,"sheets":["Морозов","таблица","база","списки","Трубы","Крепеж","32","Лист6"],"not_rendered":{"charts":0,"images":3,"macros":1,"external_links":0,"defined_names":7,"comments":0,"pivot_tables":0},"unopened":[],"bounds":{"document_bytes":16777216,"sheet_cells":100000,"rows_first":2000,"rows_last":500,"rows_between":2000,"halvings":0,"cell_chars":16384,"cell_head_chars":4096},"cells_cut":0,"cells_raw":0,"read":"whole","date_system":"1900"}

{"sheet":"Морозов","index":0,"n_rows":84,"n_cols":15,"rows_kept":84,"cut":false,"hidden":false,"merged":[]}
[]
[]
[null,null,"№4",null,null,null,null,null,null,null,null,"Сварка","резка","итог","продажа"]
[null,null,null,null,null,null,null,null,35842,452.94,null,15336.803000000002,3834.2007500000004,55013.003750000003,74340]
[null,null,"Тип","Наименование","кол-во","ед.изм.","цена ед.","масса ед.","сумма","вес"]
[null,null,"Трубы","Труба 530х8 ГОСТ 10705-91",3,null,7375,103.1,22125,309.29999999999995,530]
[null,null,"Днища","Днище эллиптическое 530",2,null,2900,25.9,5800,51.8]
[null,null,"Трубы","Труба 159х4,5 ГОСТ 10704-91",1.4,null,750,17.2,1050,24.08,159]
[null,null,"Трубы","Труба 133х4 ГОСТ 10704-91",0.2,null,565,12.8,113,2.5600000000000005,133]
[null,null,"Фланцы","Фланец 12820-80 Ду-150, Ру-1,6 МПа ",7,null,829,8.3000000000000007,5803,58.100000000000009]
[null,null,"Фланцы","Фланец 12820-80 Ду-125, Ру-1,6 МПа ",1,null,915,6.8,915,6.8]
[null,null,"Фитинг","Фитинг стальной муфта 20 мм",3,null,12,0.1,36,0.30000000000000004,28]
[]
[]
[null,null,"№5",null,null,null,null,null,null,null,null,"Сварка","резка","итог","продажа"]
[null,null,null,null,null,null,null,null,30426,379.23999999999995,null,15336.803000000002,3834.2007500000004,49597.003750000003,67024]
[null,null,"Тип","Наименование","кол-во","ед.изм.","цена ед.","масса ед.","сумма","вес"]
[null,null,"Трубы","Труба 530х8 ГОСТ 10705-91",2.4,null,7375,103.1,17700,247.43999999999997,530]
[null,null,"Днища","Днище эллиптическое 530",2,null,2900,25.9,5800,51.8]
[null,null,"Трубы","Труба 159х4,5 ГОСТ 10704-91",1.2,null,750,17.2,900,20.639999999999997,159]
[null,null,"Трубы","Труба 133х4 ГОСТ 10704-91",0.2,null,565,12.8,113,2.5600000000000005,133]
[null,null,"Фланцы","Фланец 12820-80 Ду-150, Ру-1,6 МПа ",6,null,829,8.3000000000000007,4974,49.800000000000004]
[null,null,"Фланцы","Фланец 12820-80 Ду-125, Ру-1,6 МПа ",1,null,915,6.8,915,6.8]
[null,null,"Фитинг","Фитинг стальной муфта 20 мм",2,null,12,0.1,24,0.2,28]
[]
[]
[null,null,7,null,null,null,null,null,null,null,null,"Сварка","резка","итог","продажа"]
[null,null,null,null,null,null,null,null,33122.5,418.95,null,15336.803000000002,3834.2007500000004,52293.503750000003,70682]
[null,null,"Тип","Наименование","кол-во","ед.изм.","цена ед.","масса ед.","сумма","вес"]
[null,null,"Трубы","Труба 530х8 ГОСТ 10705-91",2.9,null,7375,103.1,21387.5,298.98999999999995,530]
[null,null,"Днища","Днище эллиптическое 530",2,null,2900,25.9,5800,51.8]
[null,null,"Трубы","Труба 159х4,5 ГОСТ 10704-91",1,null,750,17.2,750,17.2,159]
[null,null,"Трубы","Труба 133х4 ГОСТ 10704-91",0.2,null,565,12.8,113,2.5600000000000005,133]
[null,null,"Фланцы","Фланец 12820-80 Ду-150, Ру-1,6 МПа ",5,null,829,8.3000000000000007,4145,41.5]
[null,null,"Фланцы","Фланец 12820-80 Ду-125, Ру-1,6 МПа ",1,null,915,6.8,915,6.8]
[null,null,"Фитинг","Фитинг стальной муфта 20 мм",1,null,12,0.1,12,0.1,28]
[]
[]
[]
[]
{"$rows_left_out":45}
{"sheet":"таблица","index":1,"n_rows":35,"n_cols":16,"rows_kept":35,"cut":false,"hidden":false,"merged":[]}
[]
[7,null,null,null,null,null,null,null,null,"Сварка","резка","итог","+%","продажа",null,"Работа"]
[32,null,null,null,null,null,{"$f":"SUM($G$5:INDEX($G5:$G35,COUNTA($G5:$G35)))","v":6784},{"$f":"SUM($H$5:INDEX($H5:$H35,COUNTA($H5:$H35)))","v":148.35},null,{"$f":"SUMPRODUCT(I5:I35,J5:J35*PI())","v":4357.3890105290429},{"$f":"J3/4","v":1089.3472526322607},{"$f":"G3+J3+K3","v":12230.736263161303},30,{"$f":"ROUNDUP((L3*(1+$M$3/100))/1.18,-2)*1.18","v":15930},null,{"$f":"(J3+K3)/1000","v":5.446736263161303}]
["Тип","Наименование","кол-во","ед.изм.","цена ед.","масса ед.","сумма","вес","по сварке","кол-во швов"]
["Трубы","Труба 159х4,5 ГОСТ 10704-91",1.2,null,{"$f":"IFERROR(INDEX(база,MATCH($B5,назв,0),2),\"\")","v":750},{"$f":"IFERROR(INDEX(база,MATCH($B5,назв,0),3),\"\")","v":17.2},{"$f":"IFERROR(C5*E5,\"\")","v":900},{"$f":"IFERROR(C5*F5,\"\")","v":20.639999999999997},{"$f":"IF(C5<>\"\",IFERROR(INDEX(база!$B$29:$E$124,MATCH(B5,база!$B$29:$B$124,0),4),0),\"\")","v":159},5]
["Днища","Заглушка 159х4,5",2,null,185,1.5,{"$f":"IFERROR(C6*E6,\"\")","v":370},{"$f":"IFERROR(C6*F6,\"\")","v":3},{"$f":"IF(C6<>\"\",IFERROR(INDEX(база!$B$29:$E$124,MATCH(B6,база!$B$29:$B$124,0),4),0),\"\")","v":0}]
["Трубы","Труба 133х4 ГОСТ 10704-91",9,null,565,12.8,5085,115.2,{"$f":"IF(C7<>\"\",IFERROR(INDEX(база!$B$29:$E$124,MATCH(B7,база!$B$29:$B$124,0),4),0),\"\")","v":133},4]
["Трубы","Труба 15 ВГП",0.6,null,40,0.85,{"$f":"IFERROR(C8*E8,\"\")","v":24},{"$f":"IFERROR(C8*F8,\"\")","v":0.51},{"$f":"IF(C8<>\"\",IFERROR(INDEX(база!$B$29:$E$124,MATCH(B8,база!$B$29:$B$124,0),4),0),\"\")","v":20},3]
["Лист стальной","Лист стальной 6 мм",5,null,45,1,225,5,{"$f":"IF(C9<>\"\",IFERROR(INDEX(база!$B$29:$E$124,MATCH(B9,база!$B$29:$B$124,0),4),0),\"\")","v":0}]
["Лист стальной","Лист стальной 6 мм",4,null,45,1,180,4,{"$f":"IF(C10<>\"\",IFERROR(INDEX(база!$B$29:$E$124,MATCH(B10,база!$B$29:$B$124,0),4),0),\"\")","v":0}]
[null,null,null,null,"","","","",{"$f":"IF(C11<>\"\",IFERROR(INDEX(база!$B$29:$E$124,MATCH(B11,база!$B$29:$B$124,0),4),0),\"\")","v":""}]
[null,null,null,null,"","","","",{"$f":"IF(C12<>\"\",IFERROR(INDEX(база!$B$29:$E$124,MATCH(B12,база!$B$29:$B$124,0),4),0),\"\")","v":""}]
[null,null,null,null,"","","","",{"$f":"IF(C13<>\"\",IFERROR(INDEX(база!$B$29:$E$124,MATCH(B13,база!$B$29:$B$124,0),4),0),\"\")","v":""}]
[null,null,null,null,"","","","",{"$f":"IF(C14<>\"\",IFERROR(INDEX(база!$B$29:$E$124,MATCH(B14,база!$B$29:$B$124,0),4),0),\"\")","v":""}]
[null,null,null,null,"","","","",{"$f":"IF(C15<>\"\",IFERROR(INDEX(база!$B$29:$E$124,MATCH(B15,база!$B$29:$B$124,0),4),0),\"\")","v":""}]
[null,null,null,null,"","","","",{"$f":"IF(C16<>\"\",IFERROR(INDEX(база!$B$29:$E$124,MATCH(B16,база!$B$29:$B$124,0),4),0),\"\")","v":""}]
[null,null,null,null,"","","","",{"$f":"IF(C17<>\"\",IFERROR(INDEX(база!$B$29:$E$124,MATCH(B17,база!$B$29:$B$124,0),4),0),\"\")","v":""},null,null,"секций","швов"]
[null,null,null,null,"","","","",{"$f":"IF(C18<>\"\",IFERROR(INDEX(база!$B$29:$E$124,MATCH(B18,база!$B$29:$B$124,0),4),0),\"\")","v":""},null,null,6,{"$f":"(L18-1)*3+2","v":17}]
[null,null,null,null,"","","","",{"$f":"IF(C19<>\"\",IFERROR(INDEX(база!$B$29:$E$124,MATCH(B19,база!$B$29:$B$124,0),4),0),\"\")","v":""}]
[null,null,null,null,"","","","",{"$f":"IF(C20<>\"\",IFERROR(INDEX(база!$B$29:$E$124,MATCH(B20,база!$B$29:$B$124,0),4),0),\"\")","v":""}]
[null,null,null,null,"","","","",{"$f":"IF(C21<>\"\",IFERROR(INDEX(база!$B$29:$E$124,MATCH(B21,база!$B$29:$B$124,0),4),0),\"\")","v":""}]
[null,null,null,null,"","","","",{"$f":"IF(C22<>\"\",IFERROR(INDEX(база!$B$29:$E$124,MATCH(B22,база!$B$29:$B$124,0),4),0),\"\")","v":""}]
[null,null,null,null,"","","","",{"$f":"IF(C23<>\"\",IFERROR(INDEX(база!$B$29:$E$124,MATCH(B23,база!$B$29:$B$124,0),4),0),\"\")","v":""}]
[null,null,null,null,"","","","",{"$f":"IF(C24<>\"\",IFERROR(INDEX(база!$B$29:$E$124,MATCH(B24,база!$B$29:$B$124,0),4),0),\"\")","v":""}]
[null,null,null,null,"","","","",{"$f":"IF(C25<>\"\",IFERROR(INDEX(база!$B$29:$E$124,MATCH(B25,база!$B$29:$B$124,0),4),0),\"\")","v":""}]
[null,null,null,null,"","","","",{"$f":"IF(C26<>\"\",IFERROR(INDEX(база!$B$29:$E$124,MATCH(B26,база!$B$29:$B$124,0),4),0),\"\")","v":""}]
[null,null,null,null,"","","","",{"$f":"IF(C27<>\"\",IFERROR(INDEX(база!$B$29:$E$124,MATCH(B27,база!$B$29:$B$124,0),4),0),\"\")","v":""}]
[null,null,null,null,"","","","",{"$f":"IF(C28<>\"\",IFERROR(INDEX(база!$B$29:$E$124,MATCH(B28,база!$B$29:$B$124,0),4),0),\"\")","v":""}]
[null,null,null,null,"","","","",{"$f":"IF(C29<>\"\",IFERROR(INDEX(база!$B$29:$E$124,MATCH(B29,база!$B$29:$B$124,0),4),0),\"\")","v":""}]
[null,null,null,null,"","","","",{"$f":"IF(C30<>\"\",IFERROR(INDEX(база!$B$29:$E$124,MATCH(B30,база!$B$29:$B$124,0),4),0),\"\")","v":""}]
[null,null,null,null,"","","","",{"$f":"IF(C31<>\"\",IFERROR(INDEX(база!$B$29:$E$124,MATCH(B31,база!$B$29:$B$124,0),4),0),\"\")","v":""}]
[null,null,null,null,"","","","",{"$f":"IF(C32<>\"\",IFERROR(INDEX(база!$B$29:$E$124,MATCH(B32,база!$B$29:$B$124,0),4),0),\"\")","v":""}]
[null,null,null,null,"","","","",{"$f":"IF(C33<>\"\",IFERROR(INDEX(база!$B$29:$E$124,MATCH(B33,база!$B$29:$B$124,0),4),0),\"\")","v":""}]
[null,null,null,null,"","","","",{"$f":"IF(C34<>\"\",IFERROR(INDEX(база!$B$29:$E$124,MATCH(B34,база!$B$29:$B$124,0),4),0),\"\")","v":""}]
[null,null,null,null,"","","","",{"$f":"IF(C35<>\"\",IFERROR(INDEX(база!$B$29:$E$124,MATCH(B35,база!$B$29:$B$124,0),4),0),\"\")","v":""}]

{"sheet":"база","index":2,"n_rows":298,"n_cols":15,"rows_kept":298,"cut":false,"hidden":false,"merged":[]}
[null,"Наименование","цена","масса"]
[null,"Днище эллиптическое 57",37,0.6]
[null,"Днище эллиптическое 76",54,0.7]
[null,"Днище эллиптическое 89",70,0.9]
[null,"Днище эллиптическое 108",85,1]
[null,"Днище эллиптическое 133",110,1.1000000000000001]
[null,"Днище эллиптическое 159",185,1.5]
[null,"Днище эллиптическое 219",360,3.1]
[null,"Днище эллиптическое 273",570,4.5999999999999996]
[null,"Днище эллиптическое 325",1000,6.3]
[null,"Днище эллиптическое 373",1630,11]
[null,"Днище эллиптическое 426",2190,13.9]
[null,"Днище эллиптическое 530",2900,25.9]
[null,"Днище эллиптическое 630",9550,36.4]
[null,"Днище эллиптическое 820",16000,60.6]
[null,"Заглушка 57х3",37,0.6]
[null,"Заглушка 76х3",54,0.7]
[null,"Заглушка 89х3,5",70,0.9]
[null,"Заглушка 108х3,5",85,1]
[null,"Заглушка 133х4",110,1.1000000000000001]
[null,"Заглушка 159х4,5",185,1.5]
[null,"Заглушка 219х5",360,3.1]
[null,"Заглушка 273х6",570,4.5999999999999996]
[null,"Заглушка 325х6",1000,6.3]
[null,"Заглушка 426х8",2190,13.9]
[null,"Заглушка 530х8",2900,25.9]
[null,"Заглушка 630х10",9550,36.4]
[null,"Днище 820x10",16000,60.6]
[null,"Труба 15 ВГП",40,0.85,20]
[null,"Труба 20 ВГП",65,1.3,28]
[null,"Труба 25 ВГП",75,1.7,32]
[null,"Труба 32 ВГП",100,2.2000000000000002,38]
[null,"Труба 40 ВГП",125,2.8,48]
[null,"Труба 57х3 ГОСТ 10704-91",165,4,57]
[null,"Труба 76х3 ГОСТ 10704-91",225,5.5,76]
[null,"Труба 89х3 ГОСТ 10704-91",300,7.4,89]
[null,"Труба 108х3,5 ГОСТ 10704-91",400,9.1,108]
[null,"Труба 133х4 ГОСТ 10704-91",565,12.8,133]
[null,"Труба 159х4,5 ГОСТ 10704-91",750,17.2,159]
[null,"Труба 219х5 ГОСТ 10704-91",1320,26.5,219,null,null,null,null,"10704-91, 10705-91","57х3",3,4,{"$f":"O40*M40","v":128},32]
{"$rows_left_out":259}
{"sheet":"списки","index":3,"n_rows":60,"n_cols":28,"rows_kept":60,"cut":false,"hidden":false,"merged":[]}
["Тип",{"$f":"INDIRECT(ADDRESS(ROW($A$1)-COLUMN($A$1)+COLUMN(),1))","v":"Трубы"},{"$f":"INDIRECT(ADDRESS(ROW($A$1)-COLUMN($A$1)+COLUMN(),1))","v":"Днища"},"Фланцы","Крепеж","Прокладки","АТК","Лист стальной","Переход","Отвод","Фитинг","Сетка","Диски","Кольца","Прочее",0,0,0,0,0,0,0,0,0,0,0,0,0]
["Трубы","Труба 15 ВГП","Днище эллиптическое 57","Фланец 12820-80 Ду-15, Ру-1,6 МПа ","Болт М12х50","Прокладка паронитовая 15/16","Заглушка АТК Ду-15, Ру-1,6 МПа ","Лист стальной  4 мм","Переход стальной 20х15","Отвод стальной 57","Фитинг стальной муфта 15 мм","сетка нж 0,4","Диск 40","Кольцо 40","Пятка "]
["Днища","Труба 20 ВГП","Днище эллиптическое 76","Фланец 12820-80 Ду-20, Ру-1,6 МПа ","Болт М12х50","Прокладка паронитовая 20/16","Заглушка АТК Ду-20, Ру-1,6 МПа ","Лист стальной 6 мм","Переход стальной 25х15","Отвод стальной 76","Фитинг стальной муфта 20 мм","сетка нж 1,0","Диск 50","Кольцо 50","Проушина"]
["Фланцы","Труба 25 ВГП","Днище эллиптическое 89","Фланец 12820-80 Ду-25, Ру-1,6 МПа ","Болт М12х50","Прокладка паронитовая 25/16","Заглушка АТК Ду-25, Ру-1,6 МПа ","Лист стальной 14 мм","Переход стальной 25х20","Отвод стальной 89","Фитинг стальной муфта 25 мм","сетка нж 1,6","Диск 65","Кольцо 65","Штанга ФМ"]
["Крепеж","Труба 32 ВГП","Днище эллиптическое 108","Фланец 12820-80 Ду-32, Ру-1,6 МПа ","Болт М16х60","Прокладка паронитовая 32/16","Заглушка АТК Ду-32, Ру-1,6 МПа ","Лист стальной 20 мм","Переход стальной 32х15","Отвод стальной 108","Фитинг стальной муфта 32 мм","сетка нж 2,0","Диск 80","Кольцо 80","Проушина ФМ"]
["Прокладки","Труба 40 ВГП","Днище эллиптическое 133","Фланец 12820-80 Ду-40, Ру-1,6 МПа ","Болт М16х60","Прокладка паронитовая 40/16","Заглушка АТК Ду-40, Ру-1,6 МПа ",null,"Переход стальной 32х20","Отвод стальной 133","Фитинг стальной муфта 40 мм","сетка нж 5,0","Диск 100","Кольцо 100","Магнит 25х150"]
["АТК","Труба 57х3 ГОСТ 10704-91","Днище эллиптическое 159","Фланец 12820-80 Ду-50, Ру-1,6 МПа ","Болт М16х80","Прокладка паронитовая 50/16","Заглушка АТК Ду-50, Ру-1,6 МПа ",null,"Переход стальной 40х20","Отвод стальной 159","Фитинг стальной муфта 50 мм",null,"Диск 125","Кольцо 125"]
["Лист стальной","Труба 76х3 ГОСТ 10704-91","Днище эллиптическое 219","Фланец 12820-80 Ду-65, Ру-1,6 МПа ","Болт М16х80","Прокладка паронитовая 65/16","Заглушка АТК Ду-65, Ру-1,6 МПа ",null,"Переход стальной 40х25","Отвод стальной 219","Фитинг стальной резьба 15 мм",null,"Диск 150","Кольцо 150"]
["Переход","Труба 89х3 ГОСТ 10704-91","Днище эллиптическое 273","Фланец 12820-80 Ду-80, Ру-1,6 МПа ","Болт М16х80","Прокладка паронитовая 80/16","Заглушка АТК Ду-80, Ру-1,6 МПа ",null,"Переход стальной 40х32","Отвод стальной 273","Фитинг стальной резьба 20 мм",null,"Диск 200","Кольцо 200"]
["Отвод","Труба 108х3,5 ГОСТ 10704-91","Днище эллиптическое 325","Фланец 12820-80 Ду-100, Ру-1,6 МПа ","Болт М16х80","Прокладка паронитовая 100/16","Заглушка АТК Ду-100, Ру-1,6 МПа ",null,"Переход стальной 32х2-25х1,6","Отвод стальной 325","Фитинг стальной резьба 25 мм",null,"Диск 250","Кольцо 250"]
["Фитинг","Труба 133х4 ГОСТ 10704-91","Днище эллиптическое 373","Фланец 12820-80 Ду-125, Ру-1,6 МПа ","Болт М16х80","Прокладка паронитовая 125/16","Заглушка АТК Ду-125, Ру-1,6 МПа ",null,"Переход стальной 38х3-25х2","Отвод стальной 377","Фитинг стальной резьба 32 мм",null,"Диск 300","Кольцо 300"]
["Сетка","Труба 159х4,5 ГОСТ 10704-91","Днище эллиптическое 426","Фланец 12820-80 Ду-150, Ру-1,6 МПа ","Болт М20х90","Прокладка паронитовая 150/16","Заглушка АТК Ду-150, Ру-1,6 МПа ",null,"Переход стальной 38х3-32х2","Отвод стальной 426","Фитинг стальной резьба 40 мм",null,"Диск 400","Кольцо 400"]
["Диски","Труба 219х5 ГОСТ 10704-91","Днище эллиптическое 530","Фланец 12820-80 Ду-200, Ру-1,6 МПа ","Болт М20х90","Прокладка паронитовая 200/16","Заглушка АТК Ду-200, Ру-1,6 МПа ",null,"Переход стальной 45х2,5-25х1,6","Отвод стальной 530","Фитинг стальной резьба 50 мм",null,"Диск 500","Кольцо 500"]
["Кольца","Труба 273х5 ГОСТ 10704-91","Днище эллиптическое 630","Фланец 12820-80 Ду-250, Ру-1,6 МПа ","Болт М24х100","Прокладка паронитовая 250/16","Заглушка АТК Ду-250, Ру-1,6 МПа ",null,"Переход стальной 45х2,5-32(38)х2","Отвод стальной 630","Фитинг стальной пробка 32 мм",null,"Диск 600"]
["Прочее","Труба 325х6 ГОСТ 10704-91","Днище эллиптическое 820","Фланец 12820-80 Ду-300, Ру-1,6 МПа ","Болт М24х100","Прокладка паронитовая 300/16","Заглушка АТК Ду-300, Ру-1,6 МПа ",null,"Переход стальной 57х3-25х1,6"]
[null,"Труба 377х6 ГОСТ 10704-91","Заглушка 57х3","Фланец 12820-80 Ду-350, Ру-1,6 МПа ","Болт М24х100","Прокладка паронитовая 350/16","Заглушка АТК Ду-350, Ру-1,6 МПа ",null,"Переход стальной 57х3-32(38)х2"]
[null,"Труба 426х6 ГОСТ 10705-91","Заглушка 76х3","Фланец 12820-80 Ду-400, Ру-1,6 МПа ","Болт М27х110","Прокладка паронитовая 400/16","Заглушка АТК Ду-400, Ру-1,6 МПа ",null,"Переход стальной 57х3-45х2,5"]
[null,"Труба 530х8 ГОСТ 10705-91","Заглушка 89х3,5","Фланец 12820-80 Ду-500, Ру-1,6 МПа ","Болт М30х130","Прокладка паронитовая 500/16","Заглушка АТК Ду-500, Ру-1,6 МПа ",null,"Переход стальной 76х3,5-38х2,5"]
[null,"Труба 630х10 ГОСТ 10705-92","Заглушка 108х3,5","Фланец 12820-80 Ду-600, Ру-1,6 МПа ","Болт М36х150","Прокладка паронитовая 600/16","Заглушка АТК Ду-600, Ру-1,6 МПа ",null,"Переход стальной 76х3,5-45х2,5"]
[null,"Труба 820х10","Заглушка 133х4","Фланец 12820-80 Ду-800, Ру-1,6 МПа ","Болт М36х150","Прокладка паронитовая 800/16","Заглушка АТК Ду-800, Ру-1,6 МПа ",null,"Переход стальной 76х3,5-57х3"]
[null,"Труба 6х1 нж","Заглушка 159х4,5","Фланец 12820-80 Ду-900, Ру-1,6 МПа ","Гайка М12",null,"Заглушка АТК Ду-200, Ру-2,5 МПа ",null,"Переход стальной 89х3,5-45х2,5"]
[null,"Труба 10х2 нж","Заглушка 219х5","Фланец 12820-80 Ду-1000, Ру-1,6 МПа ","Гайка М16",null,"Заглушка АТК Ду-300, Ру-2,5 МПа ",null,"Переход стальной 89х3,5-57х3"]
[null,"Труба профильная 30х20х2","Заглушка 273х6","Фланец 12820-80 Ду-15, Ру-2,5 МПа ","Гайка М20",null,null,null,"Переход стальной 89х3,5-76х3,5"]
[null,"Труба профильная 40х40х2","Заглушка 325х6","Фланец 12820-80 Ду-20, Ру-2,5 МПа ","Гайка М24",null,null,null,"Переход стальной 108х4-57х3"]
[null,"Труба профильная 50х50х2","Заглушка 426х8","Фланец 12820-80 Ду-25, Ру-2,5 МПа ","Гайка М27",null,null,null,"Переход стальной 108х4-76х3,5"]
[null,"Труба профильная 60х60х2","Заглушка 530х8","Фланец 12820-80 Ду-32, Ру-2,5 МПа ","Гайка М30",null,null,null,"Переход стальной 108х4-89х3,5"]
[null,"Труба профильная 80х80х3","Заглушка 630х10","Фланец 12820-80 Ду-40, Ру-2,5 МПа ","Гайка М36",null,null,null,"Переход стальной 114х4-76х3,5"]
[null,"Труба профильная 100х100х3","Днище 820x10","Фланец 12820-80 Ду-50, Ру-2,5 МПа ","Шайба М12",null,null,null,"Переход стальной 133х4-57х3"]
[null,null,null,"Фланец 12820-80 Ду-65, Ру-2,5 МПа ","Шайба М16",null,null,null,"Переход стальной 133х5-76х3,5"]
[null,null,null,"Фланец 12820-80 Ду-80, Ру-2,5 МПа ","Шайба М20",null,null,null,"Переход стальной 133х5-89х3,5"]
[null,null,null,"Фланец 12820-80 Ду-100, Ру-2,5 МПа ","Шайба М24",null,null,null,"Переход стальной 133х5-108х4"]
[null,null,null,"Фланец 12820-80 Ду-125, Ру-2,5 МПа ","Шайба М27",null,null,null,"Переход стальной 159х4,5-57х3"]
[null,null,null,"Фланец 12820-80 Ду-150, Ру-2,5 МПа ","Шайба М30",null,null,null,"Переход стальной 159х4,5-76х3,5"]
[null,null,null,"Фланец 12820-80 Ду-200, Ру-2,5 МПа ","Шайба М36",null,null,null,"Переход стальной 159х4,5-89х3,5"]
[null,null,null,"Фланец 12820-80 Ду-250, Ру-2,5 МПа ",null,null,null,null,"Переход стальной 159х4,5-108х4"]
[null,null,null,"Фланец 12820-80 Ду-300, Ру-2,5 МПа ",null,null,null,null,"Переход стальной 159х4,5-133х4"]
[null,null,null,"Фланец 12820-80 Ду-350, Ру-2,5 МПа ",null,null,null,null,"Переход стальной 219х6-57х3"]
[null,null,null,"Фланец 12820-80 Ду-400, Ру-2,5 МПа ",null,null,null,null,"Переход стальной 219х6-76х3,5"]
[null,null,null,"Фланец 12820-80 Ду-500, Ру-2,5 МПа ",null,null,null,null,"Переход стальной 219х6-89х3,5"]
[null,null,null,"Фланец 12820-80 Ду-600, Ру-2,5 МПа ",null,null,null,null,"Переход стальной 219х6-108х4"]
{"$rows_left_out":21}
{"sheet":"Трубы","index":4,"n_rows":64,"n_cols":6,"rows_kept":64,"cut":false,"hidden":false,"merged":[[36,0,40,0],[42,0,53,0]]}
[]
[]
[null,null,"кол-во",null,"цена ед.","масса ед."]
[]
[null,"Труба 15 ВГП",1,"п.м.",40,0.85]
[null,"Труба 20 ВГП",1,"п.м.",65,1.3]
[null,"Труба 25 ВГП",1,"п.м.",75,1.7]
[null,"Труба 32 ВГП",1,"п.м.",100,2.2000000000000002]
[null,"Труба 40 ВГП",1,"п.м.",125,2.8]
[]
[null,"Труба 57х3 ГОСТ 10704-91",1,"п.м.",165,4]
[null,"Труба 76х3 ГОСТ 10704-91",1,"п.м.",225,5.5]
[null,"Труба 89х3 ГОСТ 10704-91",1,"п.м.",300,7.4]
[null,"Труба 108х3,5 ГОСТ 10704-91",1,"п.м.",400,9.1]
[null,"Труба 133х4 ГОСТ 10704-91",1,"п.м.",565,12.8]
[null,"Труба 159х4,5 ГОСТ 10704-91",1,"п.м.",750,17.2]
[null,"Труба 219х5 ГОСТ 10704-91",1,"п.м.",1320,26.5]
[null,"Труба 273х5 ГОСТ 10704-91",1,"п.м.",1625,33.1]
[null,"Труба 325х6 ГОСТ 10704-91",1,"п.м.",2750,47.5]
[null,"Труба 377х6 ГОСТ 10704-91",1,"п.м.",5125,82.6]
[null,"Труба 426х6 ГОСТ 10705-91",1,"п.м.",5125,82.6]
[null,"Труба 530х8 ГОСТ 10705-91",1,"п.м.",7375,103.1]
[null,"Труба 630х10 ГОСТ 10705-92",1,"п.м.",13125,153.1]
[null,"Труба820х10",1,"п.м.",20625,199.9]
[]
[]
[null,"Труба 6х1 нж",1,"п.м.",150,0.15]
[null,"Труба 10х2 нж",1,"п.м.",300,0.4]
[]
[]
[]
[]
[]
[]
[null,"Труба","стенка","вес 1 п/м","цена 1 п/м","цена кг"]
[]
["ВГП",15,2.5,0.85,{"$f":"F37*D37*1.1","v":29.92},32]
[null,20,3,1.3,{"$f":"F38*D38*1.1","v":45.760000000000005},32]
[null,25,3,1.7,59.84,32]
[null,32,3,2.2000000000000002,77.440000000000012,32]
{"$rows_left_out":25}
{"sheet":"Крепеж","index":5,"n_rows":82,"n_cols":14,"rows_kept":82,"cut":false,"hidden":false,"merged":[]}
[]
["фланец",null,"кол-во",null,"цена ед.","масса ед.",null,"фланец",null,"кол-во",null,"цена ед.","масса ед."]
[]
["15/16","Болт М12х50",4,"шт.",10,6.2E-2,null,"15/16","Болт М12х50",4,"шт.",10,6.2E-2]
["20/16","Болт М12х50",4,"шт.",10,6.2E-2,null,null,"Гайка М12",1,"шт.",4,1.84E-2]
["25/16","Болт М12х50",4,"шт.",10,6.2E-2,null,null,"Шайба М12",1,"шт.",3,3.5000000000000001E-3]
["32/16","Болт М16х60",4,"шт.",23,0.13]
["40/16","Болт М16х60",4,"шт.",23,0.13,null,"20/16","Болт М12х50",4,"шт.",10,6.2E-2]
["50/16","Болт М16х80",4,"шт.",28,0.17,null,null,"Гайка М12",1,"шт.",4,1.84E-2]
["65/16","Болт М16х80",4,"шт.",28,0.17,null,null,"Шайба М12",1,"шт.",3,3.5000000000000001E-3]
["80/16","Болт М16х80",4,"шт.",28,0.17]
["100/16","Болт М16х80",8,"шт.",28,0.17,null,"25/16","Болт М12х50",4,"шт.",10,6.2E-2]
["125/16","Болт М16х80",8,"шт.",28,0.17,null,null,"Гайка М12",1,"шт.",4,1.84E-2]
["150/16","Болт М20х90",8,"шт.",47,0.3,null,null,"Шайба М12",1,"шт.",3,3.5000000000000001E-3]
["200/16","Болт М20х90",12,"шт.",47,0.3]
["250/16","Болт М24х100",12,"шт.",73,0.48,null,"32/16","Болт М16х60",4,"шт.",23,0.13]
["300/16","Болт М24х100",12,"шт.",73,0.48,null,null,"Гайка М16",1,"шт.",8,3.7600000000000001E-2]
["350/16","Болт М24х100",16,"шт.",73,0.48,null,null,"Шайба М16",1,"шт.",5,6.0000000000000001E-3]
["400/16","Болт М27х110",16,"шт.",115,0.68]
["500/16","Болт М30х130",20,"шт.",140,0.97,null,"40/16","Болт М16х60",4,"шт.",23,0.13]
["600/16","Болт М36х150",20,"шт.",165,1.64,null,null,"Гайка М16",1,"шт.",8,3.7600000000000001E-2]
["800/16","Болт М36х150",24,"шт.",165,1.64,null,null,"Шайба М16",1,"шт.",5,6.0000000000000001E-3]
["1000/16","Болт М42х180",28,"шт.",500]
[null,null,null,null,null,null,null,"50/16","Болт М16х80",4,"шт.",28,0.17]
[null,"Гайка М12",1,"шт.",4,1.84E-2,null,null,"Гайка М16",1,"шт.",8,3.7600000000000001E-2]
[null,"Гайка М16",1,"шт.",8,3.7600000000000001E-2,null,null,"Шайба М16",1,"шт.",5,6.0000000000000001E-3]
[null,"Гайка М20",1,"шт.",14,7.1400000000000005E-2]
[null,"Гайка М24",1,"шт.",25,0.123,null,"65/16","Болт М16х80",4,"шт.",28,0.17]
[null,"Гайка М27",1,"шт.",42,0.17599999999999999,null,null,"Гайка М16",1,"шт.",8,3.7600000000000001E-2]
[null,"Гайка М30",1,"шт.",48,0.24299999999999999,null,null,"Шайба М16",1,"шт.",5,6.0000000000000001E-3]
[null,"Гайка М36",1,"шт.",95,0.14699999999999999]
[null,"Гайка М42",1,"шт.",125,null,null,"80/16","Болт М16х80",4,"шт.",28,0.17,{"$f":"(SUM(M32:M34))*4","v":0.85440000000000005}]
[null,null,null,null,null,null,null,null,"Гайка М16",1,"шт.",8,3.7600000000000001E-2]
[null,"Шайба М12",1,"шт.",3,3.5000000000000001E-3,null,null,"Шайба М16",1,"шт.",5,6.0000000000000001E-3]
[null,"Шайба М16",1,"шт.",5,6.0000000000000001E-3]
[null,"Шайба М20",1,"шт.",7,1.2999999999999999E-2,null,"100/16","Болт М16х80",8,"шт.",28,0.17,{"$f":"(SUM(M36:M38))*8","v":1.7088000000000001}]
[null,"Шайба М24",1,"шт.",9,2.3E-2,null,null,"Гайка М16",1,"шт.",8,3.7600000000000001E-2]
[null,"Шайба М27",1,"шт.",10,0.03,null,null,"Шайба М16",1,"шт.",5,6.0000000000000001E-3]
[null,"Шайба М30",1,"шт.",12,0.04]
[null,"Шайба М36",1,"шт.",19,7.0999999999999994E-2,null,"125/16","Болт М16х80",8,"шт.",28,0.17]
{"$rows_left_out":43}
{"sheet":"32","index":6,"n_rows":13,"n_cols":10,"rows_kept":13,"cut":false,"hidden":false,"merged":[]}
[]
[]
[]
["Тип","Наименование","кол-во","ед.изм.","цена ед.","масса ед.","сумма","вес","по сварке","кол-во швов"]
["Трубы","Труба 159х4,5 ГОСТ 10704-91",1.2,null,750,17.2,900,20.639999999999997,159,5]
["Днища","Заглушка 159х4,5",2,null,185,1.5,370,3,0]
["Трубы","Труба 133х4 ГОСТ 10704-91",9,null,565,12.8,5085,115.2,133,4]
["Трубы","Труба 15 ВГП",0.6,null,40,0.85,24,0.51,20,3]
["Лист стальной","Лист стальной 6 мм",5,null,45,1,225,5,0]
["Лист стальной","Лист стальной 6 мм",4,null,45,1,180,4,0]
[]
[null,"Сварка","резка","итог","+%","продажа"]
[null,4357.3890105290429,1089.3472526322607,12230.736263161303,30,15930]

{"sheet":"Лист6","index":7,"n_rows":13,"n_cols":10,"rows_kept":13,"cut":false,"hidden":false,"merged":[]}
[]
[]
[]
["Тип","Наименование","кол-во","ед.изм.","цена ед.","масса ед.","сумма","вес","по сварке","кол-во швов"]
["Трубы","Труба 159х4,5 ГОСТ 10704-91",1.2,null,750,17.2,900,20.639999999999997,159,5]
["Днища","Заглушка 159х4,5",2,null,185,1.5,370,3,0]
["Трубы","Труба 133х4 ГОСТ 10704-91",9,null,565,12.8,5085,115.2,133,4]
["Трубы","Труба 15 ВГП",0.6,null,40,0.85,24,0.51,20,3]
["Лист стальной","Лист стальной 6 мм",5,null,45,1,225,5,0]
["Лист стальной","Лист стальной 6 мм",4,null,45,1,180,4,0]
[]
[null,"Сварка","резка","итог","+%","продажа"]
[null,4357.3890105290429,1089.3472526322607,12230.736263161303,30,15930]