{"text_format":"1","workbook":"xlsx","n_sheets":5,"sheets":["ЗП","KUR","MAR","1004","1005"],"not_rendered":{"charts":0,"images":0,"macros":1,"external_links":0,"defined_names":3,"comments":1,"pivot_tables":0},"unopened":[],"bounds":{"document_bytes":16777216,"sheet_cells":100000,"rows_first":2000,"rows_last":500,"rows_between":2000,"halvings":0,"cell_chars":16384,"cell_head_chars":4096},"cells_cut":0,"cells_raw":0,"read":"whole","date_system":"1900"}

{"sheet":"ЗП","index":0,"n_rows":405,"n_cols":11,"rows_kept":405,"cut":false,"hidden":false,"merged":[[31,1,34,1],[36,1,39,1],[41,1,44,1],[46,1,49,1],[1,1,4,1],[6,1,9,1],[11,1,14,1],[16,1,19,1],[21,1,24,1],[26,1,29,1],[51,1,54,1],[56,1,59,1],[61,1,64,1],[66,1,69,1],[71,1,74,1],[76,1,79,1],[81,1,84,1],[86,1,89,1],[91,1,94,1],[96,1,99,1],[101,1,104,1],[106,1,109,1],[111,1,114,1],[116,1,119,1],[121,1,124,1],[126,1,129,1],[131,1,134,1],[136,1,139,1],[141,1,144,1],[146,1,149,1],[151,1,154,1],[156,1,159,1],[161,1,164,1],[166,1,169,1],[171,1,174,1],[176,1,179,1],[181,1,184,1],[186,1,189,1],[191,1,194,1],[196,1,199,1],[201,1,204,1],[206,1,209,1],[211,1,214,1],[216,1,220,1],[222,1,225,1],[227,1,230,1],[232,1,235,1],[237,1,240,1],[242,1,245,1],[247,1,250,1],[252,1,255,1],[257,1,260,1],[262,1,265,1],[267,1,271,1],[273,1,276,1],[278,1,281,1],[283,1,286,1],[288,1,291,1],[293,1,296,1],[298,1,301,1],[334,1,337,1],[339,1,342,1],[344,1,347,1],[349,1,352,1],[303,1,306,1],[308,1,311,1],[313,1,316,1],[318,1,322,1],[324,1,327,1],[451,1,454,1],[405,1,408,1],[410,1,413,1],[415,1,418,1],[420,1,424,1],[426,1,429,1],[2,10,11,18],[431,1,434,1],[436,1,439,1],[441,1,444,1],[446,1,449,1],[380,1,383,1],[385,1,388,1],[390,1,393,1],[395,1,398,1],[400,1,403,1],[354,1,357,1],[359,1,362,1],[364,1,367,1],[369,1,373,1],[375,1,378,1],[329,1,332,1]]}
[null,"Ф.И.О","№ маршрута",null,"З/П","Итог"]
[1,"Анна Алексеевна  ","a",null,{"$f":"IF(ISNA(VLOOKUP($B$6,'1004'!$D$2:O66,4,0)),\"\",VLOOKUP($B$6,'1004'!$D$2:$L$100,4,0))","v":""}]
[1,null,"a",null,{"$f":"IF(ISNA(VLOOKUP($B$6,'1004'!$D$2:O67,4,0)),\"\",VLOOKUP($B$6,'1004'!$D$2:$L$100,4,0))","v":""},null,null,null,null,null,"Нужно что бы был поиск по коду работника в листах где этот код встречается ( листов будет до 30 (1004,1005,1006 итд)) и вставляло в яжейку\" № маршрута\" сам номер маршрута который находиться в Листах \"D2\" после совпадения вносит в соответствующую строку ячейку З/П (зп начисленная)"]
[1,null,"a"]
[1,null,"a"]
[1,1,"a",null,null,{"$f":"SUM(E2:E6)","v":0}]
[5," Евгения Ивановна",1003,"a",{"$f":"IFERROR(VLOOKUP($A7,INDIRECT(\"'\"&C7&\"'!\"&\"$B$2:$L$100\"),11,0),0)","v":0}]
[5,null,1004,"a",{"$f":"IFERROR(VLOOKUP($A8,INDIRECT(\"'\"&C8&\"'!\"&\"$B$2:$L$100\"),11,0),0)","v":48.618000000000002}]
[5,null,1005,"a",{"$f":"IFERROR(VLOOKUP($A9,INDIRECT(\"'\"&C9&\"'!\"&\"$B$2:$L$100\"),11,0),0)","v":0}]
[5,null,1006,null,0]
[5,5,1007,null,0,{"$f":"SUM(E7:E11)","v":48.618000000000002}]
[null," Людмила "]
[]
[]
[]
{"$rows_left_out":391}
{"sheet":"KUR","index":1,"n_rows":75,"n_cols":5,"rows_kept":75,"cut":false,"hidden":false,"merged":[]}
["Код работника","Ф.И.О.","Адрес","тел","наименование участка "]
["П","Печерск","Печерск","Печерск","Печерск"]
[1,"Валентина Михайловна","бул. Леси 362в 1 п","097-330-22-83","СМ"]
[2,"Юрий, Татьяна","бул. Леси 362в 2 п","097-330-22-84","СМ"]
["Г","Голосеевский","Голосеевский","Голосеевский","Голосеевский"]
[3,"Анна Алексеевна  (заранее)","Глушкова,41,кв.64","096-405-13-50","г1"]
[4,"Ольга Филиповна","Глушкова,41,кв.65","096-405-13-51","г1"]
[5,"Людмила ","Глушкова,41,кв.66","096-405-13-52","г1"]
[6,"Света (за 40 м)","Глушкова,41,кв.67","096-405-13-53","г2"]
[7,"Евгения Ивановна","Глушкова,41,кв.68","096-405-13-54","г3"]
["Св","Святошинский","Святошинский","Святошинский","Святошинский"]
[8,"Руслан ","Чернобыльская 10","067-455-45-90","с 14,15"]
[9,"Ирина Викторовна","Чернобыльская 11","067-455-45-91","с11"]
[10,"Алла Николаевна (за 30 м)","Чернобыльская 12","067-455-45-92","с 5"]
[11,"Андрей ","Чернобыльская 13","067-455-45-93","с9,10"]
{"$rows_left_out":61}
{"sheet":"MAR","index":2,"n_rows":49,"n_cols":13,"rows_kept":49,"cut":false,"hidden":false,"merged":[]}
[null,null,"дата","маршрут №"]
[null,null,"2016-01-06",1005,null,null,"цена","цена","цена"]
[null,null,null,null,null,null,0.219,2.1000000000000001E-2,0.16]
["№","№ кода","имя","адрес","тел","участок","смик","алнат","брв","коментарий","подпись","ЗП на выплату","ЗП начисленна"]
[null,1,{"$f":"IF(ISNA(VLOOKUP($B5,KUR!A2:E67,2,0)),\"\",VLOOKUP(B5,KUR!$A$2:$C$100,2,0))","v":"Валентина Михайловна"},{"$f":"IF(ISNA(VLOOKUP($B5,KUR!$A2:F67,3,0)),\"\",VLOOKUP(B5,KUR!$A$2:$C$100,3,0))","v":"бул. Леси 362в 1 п"},{"$f":"IF(ISNA(VLOOKUP($B5,KUR!$A$2:E67,4,0)),\"\",VLOOKUP(B5,KUR!$A2:$D$100,4,0))","v":"097-330-22-83"},{"$f":"IF(ISNA(VLOOKUP($B5,KUR!A$2:H67,5,0)),\"\",VLOOKUP(B5,KUR!$A$2:$E$100,5,0))","v":"СМ"},null,null,null,null,null,null,{"$f":"(G$3*G5)+(H$3*H5)+I$3*I5","v":0}]
[null,2,{"$f":"IF(ISNA(VLOOKUP($B6,KUR!A3:E68,2,0)),\"\",VLOOKUP(B6,KUR!$A$2:$C$100,2,0))","v":"Юрий, Татьяна"},{"$f":"IF(ISNA(VLOOKUP($B6,KUR!$A3:F68,3,0)),\"\",VLOOKUP(B6,KUR!$A$2:$C$100,3,0))","v":"бул. Леси 362в 2 п"},{"$f":"IF(ISNA(VLOOKUP($B6,KUR!$A$2:E68,4,0)),\"\",VLOOKUP(B6,KUR!$A3:$D$100,4,0))","v":"097-330-22-84"},{"$f":"IF(ISNA(VLOOKUP($B6,KUR!A$2:H68,5,0)),\"\",VLOOKUP(B6,KUR!$A$2:$E$100,5,0))","v":"СМ"},null,null,null,null,null,null,{"$f":"(G$3*G6)+(H$3*H6)+I$3*I6","v":0}]
[null,3,{"$f":"IF(ISNA(VLOOKUP($B7,KUR!A4:E69,2,0)),\"\",VLOOKUP(B7,KUR!$A$2:$C$100,2,0))","v":"Анна Алексеевна  (заранее)"},{"$f":"IF(ISNA(VLOOKUP($B7,KUR!$A4:F69,3,0)),\"\",VLOOKUP(B7,KUR!$A$2:$C$100,3,0))","v":"Глушкова,41,кв.64"},{"$f":"IF(ISNA(VLOOKUP($B7,KUR!$A$2:E69,4,0)),\"\",VLOOKUP(B7,KUR!$A4:$D$100,4,0))","v":"096-405-13-50"},{"$f":"IF(ISNA(VLOOKUP($B7,KUR!A$2:H69,5,0)),\"\",VLOOKUP(B7,KUR!$A$2:$E$100,5,0))","v":"г1"},null,null,null,null,null,null,0]
[null,4,{"$f":"IF(ISNA(VLOOKUP($B8,KUR!A$2:E70,2,0)),\"\",VLOOKUP(B8,KUR!$A$2:$C$100,2,0))","v":"Ольга Филиповна"},{"$f":"IF(ISNA(VLOOKUP($B8,KUR!$A5:F70,3,0)),\"\",VLOOKUP(B8,KUR!$A$2:$C$100,3,0))","v":"Глушкова,41,кв.65"},{"$f":"IF(ISNA(VLOOKUP($B8,KUR!$A$2:E70,4,0)),\"\",VLOOKUP(B8,KUR!$A5:$D$100,4,0))","v":"096-405-13-51"},{"$f":"IF(ISNA(VLOOKUP($B8,KUR!A$2:H70,5,0)),\"\",VLOOKUP(B8,KUR!$A$2:$E$100,5,0))","v":"г1"},null,null,null,null,null,null,0]
[null,5,{"$f":"IF(ISNA(VLOOKUP($B9,KUR!A$2:E71,2,0)),\"\",VLOOKUP(B9,KUR!$A$2:$C$100,2,0))","v":"Людмила "},{"$f":"IF(ISNA(VLOOKUP($B9,KUR!$A$2:F71,3,0)),\"\",VLOOKUP(B9,KUR!$A$2:$C$100,3,0))","v":"Глушкова,41,кв.66"},{"$f":"IF(ISNA(VLOOKUP($B9,KUR!$A$2:E71,4,0)),\"\",VLOOKUP(B9,KUR!$A$2:$D$100,4,0))","v":"096-405-13-52"},{"$f":"IF(ISNA(VLOOKUP($B9,KUR!A$2:H71,5,0)),\"\",VLOOKUP(B9,KUR!$A$2:$E$100,5,0))","v":"г1"},null,null,null,null,null,null,0]
[null,6,{"$f":"IF(ISNA(VLOOKUP($B10,KUR!A$2:E72,2,0)),\"\",VLOOKUP(B10,KUR!$A$2:$C$100,2,0))","v":"Света (за 40 м)"},{"$f":"IF(ISNA(VLOOKUP($B10,KUR!$A$2:F72,3,0)),\"\",VLOOKUP(B10,KUR!$A$2:$C$100,3,0))","v":"Глушкова,41,кв.67"},{"$f":"IF(ISNA(VLOOKUP($B10,KUR!$A$2:E72,4,0)),\"\",VLOOKUP(B10,KUR!$A$2:$D$100,4,0))","v":"096-405-13-53"},{"$f":"IF(ISNA(VLOOKUP($B10,KUR!A$2:H72,5,0)),\"\",VLOOKUP(B10,KUR!$A$2:$E$100,5,0))","v":"г2"},null,null,null,null,null,null,0]
[null,"п",{"$f":"IF(ISNA(VLOOKUP($B11,KUR!A2:B73,2,0)),\"\",VLOOKUP(B11,KUR!$A$2:$C$100,2,0))","v":"Печерск"},{"$f":"IF(ISNA(VLOOKUP($B11,KUR!$A2:C73,3,0)),\"\",VLOOKUP(B11,KUR!$A$2:$C$100,3,0))","v":"Печерск"},{"$f":"IF(ISNA(VLOOKUP($B11,KUR!$A$2:E70,4,0)),\"\",VLOOKUP(B11,KUR!$A2:$D$100,4,0))","v":"Печерск"},{"$f":"IF(ISNA(VLOOKUP($B11,KUR!A$2:H73,5,0)),\"\",VLOOKUP(B11,KUR!$A$2:$E$100,5,0))","v":"Печерск"},null,null,null,null,null,null,0]
[null,null,{"$f":"IF(ISNA(VLOOKUP($B12,KUR!A3:B74,2,0)),\"\",VLOOKUP(B12,KUR!$A$2:$C$100,2,0))","v":""},{"$f":"IF(ISNA(VLOOKUP($B12,KUR!$A3:C74,3,0)),\"\",VLOOKUP(B12,KUR!$A$2:$C$100,3,0))","v":""},{"$f":"IF(ISNA(VLOOKUP($B12,KUR!$A$2:D70,4,0)),\"\",VLOOKUP(B12,KUR!$A$2:$D$100,4,0))","v":""},{"$f":"IF(ISNA(VLOOKUP($B12,KUR!A$2:H74,5,0)),\"\",VLOOKUP(B12,KUR!$A$2:$E$100,5,0))","v":""},null,null,null,null,null,null,0]
[null,null,{"$f":"IF(ISNA(VLOOKUP($B13,KUR!A$2:B75,2,0)),\"\",VLOOKUP(B13,KUR!$A$2:$C$100,2,0))","v":""},{"$f":"IF(ISNA(VLOOKUP($B13,KUR!$A$2:C75,3,0)),\"\",VLOOKUP(B13,KUR!$A$2:$C$100,3,0))","v":""},{"$f":"IF(ISNA(VLOOKUP($B13,KUR!$A$2:D70,4,0)),\"\",VLOOKUP(B13,KUR!$A$2:$D$100,4,0))","v":""},{"$f":"IF(ISNA(VLOOKUP($B13,KUR!A$2:H75,5,0)),\"\",VLOOKUP(B13,KUR!$A$2:$E$100,5,0))","v":""},null,null,null,null,null,null,0]
[null,null,{"$f":"IF(ISNA(VLOOKUP($B14,KUR!A5:B76,2,0)),\"\",VLOOKUP(B14,KUR!$A$2:$C$100,2,0))","v":""},{"$f":"IF(ISNA(VLOOKUP($B14,KUR!$A5:C76,3,0)),\"\",VLOOKUP(B14,KUR!$A$2:$C$100,3,0))","v":""},null,{"$f":"IF(ISNA(VLOOKUP($B14,KUR!A$2:H76,5,0)),\"\",VLOOKUP(B14,KUR!$A$2:$E$100,5,0))","v":""},null,null,null,null,null,null,0]
[null,null,{"$f":"IF(ISNA(VLOOKUP($B15,KUR!A6:B77,2,0)),\"\",VLOOKUP(B15,KUR!$A$2:$C$100,2,0))","v":""},{"$f":"IF(ISNA(VLOOKUP($B15,KUR!$A6:C77,3,0)),\"\",VLOOKUP(B15,KUR!$A$2:$C$100,3,0))","v":""},{"$f":"IF(ISNA(VLOOKUP($B15,KUR!$A$2:D77,4,0)),\"\",VLOOKUP(B15,KUR!$A$2:$D$100,4,0))","v":""},{"$f":"IF(ISNA(VLOOKUP($B15,KUR!A$2:H77,5,0)),\"\",VLOOKUP(B15,KUR!$A$2:$E$100,5,0))","v":""},null,null,null,null,null,null,0]
{"$rows_left_out":35}
{"sheet":"1004","index":3,"n_rows":49,"n_cols":13,"rows_kept":49,"cut":false,"hidden":false,"merged":[]}
[null,null,"дата","маршрут №"]
[null,null,"2016-12-06",1004,null,null,"цена","цена","цена"]
[null,null,null,null,null,null,0.219,2.1000000000000001E-2,0.16]
["№","№ кода","имя","адрес","тел","участок","смик","алнат","брв","коментарий","подпись","ЗП на выплату","ЗП начисленна"]
[null,1,{"$f":"IF(ISNA(VLOOKUP($B5,KUR!A2:E67,2,0)),\"\",VLOOKUP(B5,KUR!$A$2:$C$100,2,0))","v":"Валентина Михайловна"},{"$f":"IF(ISNA(VLOOKUP($B5,KUR!$A2:F67,3,0)),\"\",VLOOKUP(B5,KUR!$A$2:$C$100,3,0))","v":"бул. Леси 362в 1 п"},{"$f":"IF(ISNA(VLOOKUP($B5,KUR!$A$2:E67,4,0)),\"\",VLOOKUP(B5,KUR!$A2:$D$100,4,0))","v":"097-330-22-83"},{"$f":"IF(ISNA(VLOOKUP($B5,KUR!A$2:H67,5,0)),\"\",VLOOKUP(B5,KUR!$A$2:$E$100,5,0))","v":"СМ"},null,5000,null,null,null,12222,{"$f":"(G$3*G5)+(H$3*H5)+I$3*I5","v":105}]
[null,5,{"$f":"IF(ISNA(VLOOKUP($B6,KUR!A3:E68,2,0)),\"\",VLOOKUP(B6,KUR!$A$2:$C$100,2,0))","v":"Людмила "},{"$f":"IF(ISNA(VLOOKUP($B6,KUR!$A3:F68,3,0)),\"\",VLOOKUP(B6,KUR!$A$2:$C$100,3,0))","v":"Глушкова,41,кв.66"},{"$f":"IF(ISNA(VLOOKUP($B6,KUR!$A$2:E68,4,0)),\"\",VLOOKUP(B6,KUR!$A3:$D$100,4,0))","v":"096-405-13-52"},{"$f":"IF(ISNA(VLOOKUP($B6,KUR!A$2:H68,5,0)),\"\",VLOOKUP(B6,KUR!$A$2:$E$100,5,0))","v":"г1"},5000,null,null,null,null,48.618000000000002,{"$f":"(G$3*G6)+(H$3*H6)+I$3*I6","v":1095}]
[null,6,{"$f":"IF(ISNA(VLOOKUP($B7,KUR!A4:E69,2,0)),\"\",VLOOKUP(B7,KUR!$A$2:$C$100,2,0))","v":"Света (за 40 м)"},{"$f":"IF(ISNA(VLOOKUP($B7,KUR!$A4:F69,3,0)),\"\",VLOOKUP(B7,KUR!$A$2:$C$100,3,0))","v":"Глушкова,41,кв.67"},{"$f":"IF(ISNA(VLOOKUP($B7,KUR!$A$2:E69,4,0)),\"\",VLOOKUP(B7,KUR!$A4:$D$100,4,0))","v":"096-405-13-53"},{"$f":"IF(ISNA(VLOOKUP($B7,KUR!A$2:H69,5,0)),\"\",VLOOKUP(B7,KUR!$A$2:$E$100,5,0))","v":"г2"},null,null,1000,null,null,null,160]
[null,8,{"$f":"IF(ISNA(VLOOKUP($B8,KUR!A$2:E70,2,0)),\"\",VLOOKUP(B8,KUR!$A$2:$C$100,2,0))","v":"Руслан "},{"$f":"IF(ISNA(VLOOKUP($B8,KUR!$A5:F70,3,0)),\"\",VLOOKUP(B8,KUR!$A$2:$C$100,3,0))","v":"Чернобыльская 10"},{"$f":"IF(ISNA(VLOOKUP($B8,KUR!$A$2:E70,4,0)),\"\",VLOOKUP(B8,KUR!$A5:$D$100,4,0))","v":"067-455-45-90"},{"$f":"IF(ISNA(VLOOKUP($B8,KUR!A$2:H70,5,0)),\"\",VLOOKUP(B8,KUR!$A$2:$E$100,5,0))","v":"с 14,15"},null,null,null,null,null,null,0]
[null,null,{"$f":"IF(ISNA(VLOOKUP($B9,KUR!A$2:E71,2,0)),\"\",VLOOKUP(B9,KUR!$A$2:$C$100,2,0))","v":""},{"$f":"IF(ISNA(VLOOKUP($B9,KUR!$A$2:F71,3,0)),\"\",VLOOKUP(B9,KUR!$A$2:$C$100,3,0))","v":""},{"$f":"IF(ISNA(VLOOKUP($B9,KUR!$A$2:E71,4,0)),\"\",VLOOKUP(B9,KUR!$A$2:$D$100,4,0))","v":""},{"$f":"IF(ISNA(VLOOKUP($B9,KUR!A$2:H71,5,0)),\"\",VLOOKUP(B9,KUR!$A$2:$E$100,5,0))","v":""},null,null,null,null,null,null,0]
[null,null,{"$f":"IF(ISNA(VLOOKUP($B10,KUR!A$2:E72,2,0)),\"\",VLOOKUP(B10,KUR!$A$2:$C$100,2,0))","v":""},{"$f":"IF(ISNA(VLOOKUP($B10,KUR!$A$2:F72,3,0)),\"\",VLOOKUP(B10,KUR!$A$2:$C$100,3,0))","v":""},{"$f":"IF(ISNA(VLOOKUP($B10,KUR!$A$2:E72,4,0)),\"\",VLOOKUP(B10,KUR!$A$2:$D$100,4,0))","v":""},{"$f":"IF(ISNA(VLOOKUP($B10,KUR!A$2:H72,5,0)),\"\",VLOOKUP(B10,KUR!$A$2:$E$100,5,0))","v":""},null,null,null,null,null,null,0]
[null,null,{"$f":"IF(ISNA(VLOOKUP($B11,KUR!A2:B73,2,0)),\"\",VLOOKUP(B11,KUR!$A$2:$C$100,2,0))","v":""},{"$f":"IF(ISNA(VLOOKUP($B11,KUR!$A2:C73,3,0)),\"\",VLOOKUP(B11,KUR!$A$2:$C$100,3,0))","v":""},{"$f":"IF(ISNA(VLOOKUP($B11,KUR!$A$2:E70,4,0)),\"\",VLOOKUP(B11,KUR!$A2:$D$100,4,0))","v":""},{"$f":"IF(ISNA(VLOOKUP($B11,KUR!A$2:H73,5,0)),\"\",VLOOKUP(B11,KUR!$A$2:$E$100,5,0))","v":""},null,null,null,null,null,null,0]
[null,null,{"$f":"IF(ISNA(VLOOKUP($B12,KUR!A3:B74,2,0)),\"\",VLOOKUP(B12,KUR!$A$2:$C$100,2,0))","v":""},{"$f":"IF(ISNA(VLOOKUP($B12,KUR!$A3:C74,3,0)),\"\",VLOOKUP(B12,KUR!$A$2:$C$100,3,0))","v":""},{"$f":"IF(ISNA(VLOOKUP($B12,KUR!$A$2:D70,4,0)),\"\",VLOOKUP(B12,KUR!$A$2:$D$100,4,0))","v":""},{"$f":"IF(ISNA(VLOOKUP($B12,KUR!A$2:H74,5,0)),\"\",VLOOKUP(B12,KUR!$A$2:$E$100,5,0))","v":""},null,null,null,null,null,null,0]
[null,null,{"$f":"IF(ISNA(VLOOKUP($B13,KUR!A$2:B75,2,0)),\"\",VLOOKUP(B13,KUR!$A$2:$C$100,2,0))","v":""},{"$f":"IF(ISNA(VLOOKUP($B13,KUR!$A$2:C75,3,0)),\"\",VLOOKUP(B13,KUR!$A$2:$C$100,3,0))","v":""},{"$f":"IF(ISNA(VLOOKUP($B13,KUR!$A$2:D70,4,0)),\"\",VLOOKUP(B13,KUR!$A$2:$D$100,4,0))","v":""},{"$f":"IF(ISNA(VLOOKUP($B13,KUR!A$2:H75,5,0)),\"\",VLOOKUP(B13,KUR!$A$2:$E$100,5,0))","v":""},null,null,null,null,null,null,0]
[null,null,{"$f":"IF(ISNA(VLOOKUP($B14,KUR!A5:B76,2,0)),\"\",VLOOKUP(B14,KUR!$A$2:$C$100,2,0))","v":""},{"$f":"IF(ISNA(VLOOKUP($B14,KUR!$A5:C76,3,0)),\"\",VLOOKUP(B14,KUR!$A$2:$C$100,3,0))","v":""},null,{"$f":"IF(ISNA(VLOOKUP($B14,KUR!A$2:H76,5,0)),\"\",VLOOKUP(B14,KUR!$A$2:$E$100,5,0))","v":""},null,null,null,null,null,null,0]
[null,null,{"$f":"IF(ISNA(VLOOKUP($B15,KUR!A6:B77,2,0)),\"\",VLOOKUP(B15,KUR!$A$2:$C$100,2,0))","v":""},{"$f":"IF(ISNA(VLOOKUP($B15,KUR!$A6:C77,3,0)),\"\",VLOOKUP(B15,KUR!$A$2:$C$100,3,0))","v":""},{"$f":"IF(ISNA(VLOOKUP($B15,KUR!$A$2:D77,4,0)),\"\",VLOOKUP(B15,KUR!$A$2:$D$100,4,0))","v":""},{"$f":"IF(ISNA(VLOOKUP($B15,KUR!A$2:H77,5,0)),\"\",VLOOKUP(B15,KUR!$A$2:$E$100,5,0))","v":""},null,null,null,null,null,null,0]
{"$rows_left_out":35}
{"sheet":"1005","index":4,"n_rows":49,"n_cols":13,"rows_kept":49,"cut":false,"hidden":false,"merged":[]}
[null,null,"дата","маршрут №"]
[null,null,"2016-12-06",1005,null,null,"цена","цена","цена"]
[null,null,null,null,null,null,0.219,2.1000000000000001E-2,0.16]
["№","№ кода","имя","адрес","тел","участок","смик","алнат","брв","коментарий","подпись","ЗП на выплату","ЗП начисленна"]
[null,1,{"$f":"IF(ISNA(VLOOKUP($B5,KUR!A2:E67,2,0)),\"\",VLOOKUP(B5,KUR!$A$2:$C$100,2,0))","v":"Валентина Михайловна"},{"$f":"IF(ISNA(VLOOKUP($B5,KUR!$A2:F67,3,0)),\"\",VLOOKUP(B5,KUR!$A$2:$C$100,3,0))","v":"бул. Леси 362в 1 п"},{"$f":"IF(ISNA(VLOOKUP($B5,KUR!$A$2:E67,4,0)),\"\",VLOOKUP(B5,KUR!$A2:$D$100,4,0))","v":"097-330-22-83"},{"$f":"IF(ISNA(VLOOKUP($B5,KUR!A$2:H67,5,0)),\"\",VLOOKUP(B5,KUR!$A$2:$E$100,5,0))","v":"СМ"},null,null,2000,null,null,null,{"$f":"(G$3*G5)+(H$3*H5)+I$3*I5","v":320}]
[null,44,{"$f":"IF(ISNA(VLOOKUP($B6,KUR!A3:E68,2,0)),\"\",VLOOKUP(B6,KUR!$A$2:$C$100,2,0))","v":"Александр    "},{"$f":"IF(ISNA(VLOOKUP($B6,KUR!$A3:F68,3,0)),\"\",VLOOKUP(B6,KUR!$A$2:$C$100,3,0))","v":"Кибальчича,3б,кв.176,4п."},{"$f":"IF(ISNA(VLOOKUP($B6,KUR!$A$2:E68,4,0)),\"\",VLOOKUP(B6,KUR!$A3:$D$100,4,0))","v":"099-143-35-19"},{"$f":"IF(ISNA(VLOOKUP($B6,KUR!A$2:H68,5,0)),\"\",VLOOKUP(B6,KUR!$A$2:$E$100,5,0))","v":0},null,null,5000,null,null,null,{"$f":"(G$3*G6)+(H$3*H6)+I$3*I6","v":800}]
[null,36,{"$f":"IF(ISNA(VLOOKUP($B7,KUR!A4:E69,2,0)),\"\",VLOOKUP(B7,KUR!$A$2:$C$100,2,0))","v":"Светлана Георгиевна"},{"$f":"IF(ISNA(VLOOKUP($B7,KUR!$A4:F69,3,0)),\"\",VLOOKUP(B7,KUR!$A$2:$C$100,3,0))","v":"Вигуровскийпр.,7"},{"$f":"IF(ISNA(VLOOKUP($B7,KUR!$A$2:E69,4,0)),\"\",VLOOKUP(B7,KUR!$A4:$D$100,4,0))","v":"098-420-04-32"},{"$f":"IF(ISNA(VLOOKUP($B7,KUR!A$2:H69,5,0)),\"\",VLOOKUP(B7,KUR!$A$2:$E$100,5,0))","v":"СМ"},null,null,3500,null,null,null,560]
[null,48,{"$f":"IF(ISNA(VLOOKUP($B8,KUR!A$2:E70,2,0)),\"\",VLOOKUP(B8,KUR!$A$2:$C$100,2,0))","v":"Мария Дмитриевна"},{"$f":"IF(ISNA(VLOOKUP($B8,KUR!$A5:F70,3,0)),\"\",VLOOKUP(B8,KUR!$A$2:$C$100,3,0))","v":"Тичины,21, кв.16, 5 п."},{"$f":"IF(ISNA(VLOOKUP($B8,KUR!$A$2:E70,4,0)),\"\",VLOOKUP(B8,KUR!$A5:$D$100,4,0))","v":"093-114-00-100"},{"$f":"IF(ISNA(VLOOKUP($B8,KUR!A$2:H70,5,0)),\"\",VLOOKUP(B8,KUR!$A$2:$E$100,5,0))","v":0},null,null,null,null,null,null,0]
[null,null,{"$f":"IF(ISNA(VLOOKUP($B9,KUR!A$2:E71,2,0)),\"\",VLOOKUP(B9,KUR!$A$2:$C$100,2,0))","v":""},{"$f":"IF(ISNA(VLOOKUP($B9,KUR!$A$2:F71,3,0)),\"\",VLOOKUP(B9,KUR!$A$2:$C$100,3,0))","v":""},{"$f":"IF(ISNA(VLOOKUP($B9,KUR!$A$2:E71,4,0)),\"\",VLOOKUP(B9,KUR!$A$2:$D$100,4,0))","v":""},{"$f":"IF(ISNA(VLOOKUP($B9,KUR!A$2:H71,5,0)),\"\",VLOOKUP(B9,KUR!$A$2:$E$100,5,0))","v":""},null,null,null,null,null,null,0]
[null,null,{"$f":"IF(ISNA(VLOOKUP($B10,KUR!A$2:E72,2,0)),\"\",VLOOKUP(B10,KUR!$A$2:$C$100,2,0))","v":""},{"$f":"IF(ISNA(VLOOKUP($B10,KUR!$A$2:F72,3,0)),\"\",VLOOKUP(B10,KUR!$A$2:$C$100,3,0))","v":""},{"$f":"IF(ISNA(VLOOKUP($B10,KUR!$A$2:E72,4,0)),\"\",VLOOKUP(B10,KUR!$A$2:$D$100,4,0))","v":""},{"$f":"IF(ISNA(VLOOKUP($B10,KUR!A$2:H72,5,0)),\"\",VLOOKUP(B10,KUR!$A$2:$E$100,5,0))","v":""},null,null,null,null,null,null,0]
[null,null,{"$f":"IF(ISNA(VLOOKUP($B11,KUR!A2:B73,2,0)),\"\",VLOOKUP(B11,KUR!$A$2:$C$100,2,0))","v":""},{"$f":"IF(ISNA(VLOOKUP($B11,KUR!$A2:C73,3,0)),\"\",VLOOKUP(B11,KUR!$A$2:$C$100,3,0))","v":""},{"$f":"IF(ISNA(VLOOKUP($B11,KUR!$A$2:E70,4,0)),\"\",VLOOKUP(B11,KUR!$A2:$D$100,4,0))","v":""},{"$f":"IF(ISNA(VLOOKUP($B11,KUR!A$2:H73,5,0)),\"\",VLOOKUP(B11,KUR!$A$2:$E$100,5,0))","v":""},null,null,null,null,null,null,0]
[null,null,{"$f":"IF(ISNA(VLOOKUP($B12,KUR!A3:B74,2,0)),\"\",VLOOKUP(B12,KUR!$A$2:$C$100,2,0))","v":""},{"$f":"IF(ISNA(VLOOKUP($B12,KUR!$A3:C74,3,0)),\"\",VLOOKUP(B12,KUR!$A$2:$C$100,3,0))","v":""},{"$f":"IF(ISNA(VLOOKUP($B12,KUR!$A$2:D70,4,0)),\"\",VLOOKUP(B12,KUR!$A$2:$D$100,4,0))","v":""},{"$f":"IF(ISNA(VLOOKUP($B12,KUR!A$2:H74,5,0)),\"\",VLOOKUP(B12,KUR!$A$2:$E$100,5,0))","v":""},null,null,null,null,null,null,0]
[null,null,{"$f":"IF(ISNA(VLOOKUP($B13,KUR!A$2:B75,2,0)),\"\",VLOOKUP(B13,KUR!$A$2:$C$100,2,0))","v":""},{"$f":"IF(ISNA(VLOOKUP($B13,KUR!$A$2:C75,3,0)),\"\",VLOOKUP(B13,KUR!$A$2:$C$100,3,0))","v":""},{"$f":"IF(ISNA(VLOOKUP($B13,KUR!$A$2:D70,4,0)),\"\",VLOOKUP(B13,KUR!$A$2:$D$100,4,0))","v":""},{"$f":"IF(ISNA(VLOOKUP($B13,KUR!A$2:H75,5,0)),\"\",VLOOKUP(B13,KUR!$A$2:$E$100,5,0))","v":""},null,null,null,null,null,null,0]
[null,null,{"$f":"IF(ISNA(VLOOKUP($B14,KUR!A5:B76,2,0)),\"\",VLOOKUP(B14,KUR!$A$2:$C$100,2,0))","v":""},{"$f":"IF(ISNA(VLOOKUP($B14,KUR!$A5:C76,3,0)),\"\",VLOOKUP(B14,KUR!$A$2:$C$100,3,0))","v":""},null,{"$f":"IF(ISNA(VLOOKUP($B14,KUR!A$2:H76,5,0)),\"\",VLOOKUP(B14,KUR!$A$2:$E$100,5,0))","v":""},null,null,null,null,null,null,0]
[null,null,{"$f":"IF(ISNA(VLOOKUP($B15,KUR!A6:B77,2,0)),\"\",VLOOKUP(B15,KUR!$A$2:$C$100,2,0))","v":""},{"$f":"IF(ISNA(VLOOKUP($B15,KUR!$A6:C77,3,0)),\"\",VLOOKUP(B15,KUR!$A$2:$C$100,3,0))","v":""},{"$f":"IF(ISNA(VLOOKUP($B15,KUR!$A$2:D77,4,0)),\"\",VLOOKUP(B15,KUR!$A$2:$D$100,4,0))","v":""},{"$f":"IF(ISNA(VLOOKUP($B15,KUR!A$2:H77,5,0)),\"\",VLOOKUP(B15,KUR!$A$2:$E$100,5,0))","v":""},null,null,null,null,null,null,0]
{"$rows_left_out":34}