{"text_format":"1","workbook":"xlsx","n_sheets":3,"sheets":["сводная","диплом","сертификат"],"not_rendered":{"charts":0,"images":0,"macros":1,"external_links":0,"defined_names":3,"comments":0,"pivot_tables":0},"unopened":[],"bounds":{"document_bytes":16777216,"sheet_cells":100000,"rows_first":2000,"rows_last":500,"rows_between":2000,"halvings":0,"cell_chars":16384,"cell_head_chars":4096},"cells_cut":0,"cells_raw":0,"read":"whole","date_system":"1900"}

{"sheet":"сводная","index":0,"n_rows":11,"n_cols":6,"rows_kept":11,"cut":false,"hidden":false,"merged":[]}
[null,null,null,null,null,"Для сохранения документа дважды кликните \"распечатать документ\""]
[1,"Петров","Д/с №12","МОСКВА","диплом","Сохранить документ"]
[{"$f":"A2+1","v":2},"Иванов","Д/с №5","ТУЛА","сертификат","Сохранить документ"]
[{"$f":"A3+1","v":3},"Сидоров","Д/с №3","Тосмк","диплом","Сохранить документ"]
[4,"Колунов","Д/с №51","Сочи","диплом","Сохранить документ"]
[5,"Иванов","Д/с №5","ТУЛА","сертификат","Сохранить документ"]
[6,"Иванов","Д/с №5","ТУЛА","сертификат","Сохранить документ"]
[7,"Иванов","Д/с №5","ТУЛА","сертификат","Сохранить документ"]
[8,"Иванов","Д/с №5","ТУЛА","сертификат","Сохранить документ"]
[9,"Иванов","Д/с №5","ТУЛА","сертификат","Сохранить документ"]
[10,"Иванов","Д/с №5","ТУЛА","сертификат","Сохранить документ"]

{"sheet":"диплом","index":1,"n_rows":25,"n_cols":11,"rows_kept":25,"cut":false,"hidden":false,"merged":[[21,4,22,10],[9,10,9,11],[11,0,14,13],[24,4,25,10]]}
[]
[]
[]
[]
[]
[null,null,null,null,null,null,null,null,null,null,"Номер диплома"]
[]
[]
[]
[null,null,null,null,null,null,null,null,null,"БД",3]
[]
["Диплом"]
[]
[]
[]
[]
[]
[]
[]
[]
[]
[null,null,null,null,{"$f":"LOOKUP(K10,сводная!A:A,сводная!B:B)","v":"Сидоров"}]
[]
[]
[null,null,null,null,{"$f":"CONCATENATE(LOOKUP(K10,сводная!A:A,сводная!C:C),\", г. \",LOOKUP(K10,сводная!A:A,сводная!D:D))","v":"Д/с №3, г. Тосмк"}]

{"sheet":"сертификат","index":2,"n_rows":26,"n_cols":7,"rows_kept":26,"cut":false,"hidden":false,"merged":[[22,3,22,6],[25,2,26,7],[12,0,13,8]]}
[]
[]
[]
[]
[]
[]
[null,null,null,null,null,"ТР",2]
[]
[]
[]
[]
[]
["Сертификат"]
[]
[]
[]
[]
[]
[]
[]
[]
[]
[null,null,null,{"$f":"LOOKUP(G7,сводная!A:A,сводная!B:B)","v":"Иванов"}]
[]
[]
[null,null,{"$f":"CONCATENATE(LOOKUP(сертификат,сводная!A:A,сводная!C:C),\", г. \",LOOKUP(сертификат,сводная!A:A,сводная!D:D))","v":"Д/с №5, г. ТУЛА"}]