{"text_format":"1","workbook":"xlsx","n_sheets":9,"sheets":["Начало","Ссылки","Лист1","Лист2","Лист3","EUR USD","GBP USD","AUD USD","USD JPY"],"not_rendered":{"charts":4,"images":0,"macros":0,"external_links":0,"defined_names":5,"comments":0,"pivot_tables":0},"unopened":[],"bounds":{"document_bytes":16777216,"sheet_cells":100000,"rows_first":2000,"rows_last":500,"rows_between":2000,"halvings":0,"cell_chars":16384,"cell_head_chars":4096},"cells_cut":0,"cells_raw":0,"read":"whole","date_system":"1900"}

{"sheet":"Начало","index":0,"n_rows":31,"n_cols":10,"rows_kept":31,"cut":false,"hidden":false,"merged":[]}
[]
[]
[null,"EUR/USD",null,"Сылки",null,"Лист 1"]
[null,"GBP/USD",null,null,null,"Лист 2"]
[null,"AUD/USD",null,null,null,"Лист 3",null,null,null,"EUR"]
[null,"NZD/USD",null,null,null,null,null,null,null,"USD"]
[null,"USD/CAD",null,null,null,null,null,null,null,"GBP"]
[null,"USD/JPY",null,null,null,null,null,null,null,"AUD"]
[null,"USD/CHF",null,null,null,null,null,null,null,"NZD"]
[null,"XAU/USD",null,null,null,null,null,null,null,"CAD"]
[null,"EUR/GBP",null,null,null,null,null,null,null,"JPY"]
[null,"GBP/AUD",null,null,null,null,null,null,null,"CHF"]
[null,"GBP/NZD"]
[null,"GBP/CAD"]
[null,"GBP/JPY"]
[null,"GBP/CHF"]
[null,"EUR/AUD"]
[null,"AUD/NZD"]
[null,"AUD/CAD"]
[null,"AUD/JPY"]
{"$rows_left_out":12}
{"sheet":"Ссылки","index":1,"n_rows":32,"n_cols":8,"rows_kept":32,"cut":false,"hidden":false,"merged":[]}
["Начало","Тренд",null,"Работа",null,"Перечень"]
[null,null,null,null,null,null,null,6]
[null,"Лонг",null,"Лонг",null,"EUR/USD",null,{"$f":"IFERROR(HYPERLINK(SUBSTITUTE(INDEX(Листы1_,ROW(J1)+H$2-1),\"]\",\"]'\")&\"'!A1\",SUBSTITUTE(INDEX(Листы1,ROW(J1)+5),\" \",\"/\")),\"\")&TEXT(RAND(),\";;;\")","v":"EUR/USD"}]
[null,"Шорт",null,"Шорт",null,"GBP/USD",null,{"$f":"IFERROR(HYPERLINK(SUBSTITUTE(INDEX(Листы1_,ROW(J2)+H$2-1),\"]\",\"]'\")&\"'!A1\",SUBSTITUTE(INDEX(Листы1,ROW(J2)+5),\" \",\"/\")),\"\")&TEXT(RAND(),\";;;\")","v":"GBP/USD"}]
[null,"Флет",null,"Забор",null,"AUD/USD",null,{"$f":"IFERROR(HYPERLINK(SUBSTITUTE(INDEX(Листы1_,ROW(J3)+H$2-1),\"]\",\"]'\")&\"'!A1\",SUBSTITUTE(INDEX(Листы1,ROW(J3)+5),\" \",\"/\")),\"\")&TEXT(RAND(),\";;;\")","v":"AUD/USD"}]
[null,null,null,"Монитор",null,"NZD/USD",null,{"$f":"IFERROR(HYPERLINK(SUBSTITUTE(INDEX(Листы1_,ROW(J4)+H$2-1),\"]\",\"]'\")&\"'!A1\",SUBSTITUTE(INDEX(Листы1,ROW(J4)+5),\" \",\"/\")),\"\")&TEXT(RAND(),\";;;\")","v":"USD/JPY"}]
[null,null,null,null,null,"USD/CAD",null,{"$f":"IFERROR(HYPERLINK(SUBSTITUTE(INDEX(Листы1_,ROW(J5)+H$2-1),\"]\",\"]'\")&\"'!A1\",SUBSTITUTE(INDEX(Листы1,ROW(J5)+5),\" \",\"/\")),\"\")&TEXT(RAND(),\";;;\")","v":""}]
[null,null,null,null,null,"USD/JPY",null,{"$f":"IFERROR(HYPERLINK(SUBSTITUTE(INDEX(Листы1_,ROW(J6)+H$2-1),\"]\",\"]'\")&\"'!A1\",SUBSTITUTE(INDEX(Листы1,ROW(J6)+5),\" \",\"/\")),\"\")&TEXT(RAND(),\";;;\")","v":""}]
[null,null,null,null,null,"USD/CHF",null,{"$f":"IFERROR(HYPERLINK(SUBSTITUTE(INDEX(Листы1_,ROW(J7)+H$2-1),\"]\",\"]'\")&\"'!A1\",SUBSTITUTE(INDEX(Листы1,ROW(J7)+5),\" \",\"/\")),\"\")&TEXT(RAND(),\";;;\")","v":""}]
[null,null,null,null,null,"XAU/USD",null,{"$f":"IFERROR(HYPERLINK(SUBSTITUTE(INDEX(Листы1_,ROW(J8)+H$2-1),\"]\",\"]'\")&\"'!A1\",SUBSTITUTE(INDEX(Листы1,ROW(J8)+5),\" \",\"/\")),\"\")&TEXT(RAND(),\";;;\")","v":""}]
[null,null,null,null,null,"EUR/GBP",null,{"$f":"IFERROR(HYPERLINK(SUBSTITUTE(INDEX(Листы1_,ROW(J9)+H$2-1),\"]\",\"]'\")&\"'!A1\",SUBSTITUTE(INDEX(Листы1,ROW(J9)+5),\" \",\"/\")),\"\")&TEXT(RAND(),\";;;\")","v":""}]
[null,null,null,null,null,"GBP/AUD",null,{"$f":"IFERROR(HYPERLINK(SUBSTITUTE(INDEX(Листы1_,ROW(J10)+H$2-1),\"]\",\"]'\")&\"'!A1\",SUBSTITUTE(INDEX(Листы1,ROW(J10)+5),\" \",\"/\")),\"\")&TEXT(RAND(),\";;;\")","v":""}]
[null,null,null,null,null,"GBP/NZD",null,{"$f":"IFERROR(HYPERLINK(SUBSTITUTE(INDEX(Листы1_,ROW(J11)+H$2-1),\"]\",\"]'\")&\"'!A1\",SUBSTITUTE(INDEX(Листы1,ROW(J11)+5),\" \",\"/\")),\"\")&TEXT(RAND(),\";;;\")","v":""}]
[null,null,null,null,null,"GBP/CAD",null,{"$f":"IFERROR(HYPERLINK(SUBSTITUTE(INDEX(Листы1_,ROW(J12)+H$2-1),\"]\",\"]'\")&\"'!A1\",SUBSTITUTE(INDEX(Листы1,ROW(J12)+5),\" \",\"/\")),\"\")&TEXT(RAND(),\";;;\")","v":""}]
[null,null,null,null,null,"GBP/JPY",null,{"$f":"IFERROR(HYPERLINK(SUBSTITUTE(INDEX(Листы1_,ROW(J13)+H$2-1),\"]\",\"]'\")&\"'!A1\",SUBSTITUTE(INDEX(Листы1,ROW(J13)+5),\" \",\"/\")),\"\")&TEXT(RAND(),\";;;\")","v":""}]
[null,null,null,null,null,"GBP/CHF",null,{"$f":"IFERROR(HYPERLINK(SUBSTITUTE(INDEX(Листы1_,ROW(J14)+H$2-1),\"]\",\"]'\")&\"'!A1\",SUBSTITUTE(INDEX(Листы1,ROW(J14)+5),\" \",\"/\")),\"\")&TEXT(RAND(),\";;;\")","v":""}]
[null,null,null,null,null,"EUR/AUD",null,{"$f":"IFERROR(HYPERLINK(SUBSTITUTE(INDEX(Листы1_,ROW(J15)+H$2-1),\"]\",\"]'\")&\"'!A1\",SUBSTITUTE(INDEX(Листы1,ROW(J15)+5),\" \",\"/\")),\"\")&TEXT(RAND(),\";;;\")","v":""}]
[null,null,null,null,null,"AUD/NZD",null,{"$f":"IFERROR(HYPERLINK(SUBSTITUTE(INDEX(Листы1_,ROW(J16)+H$2-1),\"]\",\"]'\")&\"'!A1\",SUBSTITUTE(INDEX(Листы1,ROW(J16)+5),\" \",\"/\")),\"\")&TEXT(RAND(),\";;;\")","v":""}]
[null,null,null,null,null,"AUD/CAD",null,{"$f":"IFERROR(HYPERLINK(SUBSTITUTE(INDEX(Листы1_,ROW(J17)+H$2-1),\"]\",\"]'\")&\"'!A1\",SUBSTITUTE(INDEX(Листы1,ROW(J17)+5),\" \",\"/\")),\"\")&TEXT(RAND(),\";;;\")","v":""}]
[null,null,null,null,null,"AUD/JPY",null,{"$f":"IFERROR(HYPERLINK(SUBSTITUTE(INDEX(Листы1_,ROW(J18)+H$2-1),\"]\",\"]'\")&\"'!A1\",SUBSTITUTE(INDEX(Листы1,ROW(J18)+5),\" \",\"/\")),\"\")&TEXT(RAND(),\";;;\")","v":""}]
{"$rows_left_out":13}
{"sheet":"Лист1","index":2,"n_rows":17,"n_cols":7,"rows_kept":17,"cut":false,"hidden":false,"merged":[[0,2,3,4],[4,2,4,4]]}
["Начало",null,"Лист 1                                             для инструментов в работу"]
[]
[]
[]
[null,null,{"$f":"TODAY()","v":"2016-01-22"}]
[]
[null,null,1,null,{"$f":"IFERROR(HYPERLINK(SUBSTITUTE(INDEX(Листы1_,SMALL(IF(N(INDIRECT(\"'\"&Листы1&\"'!B10\"))=--MID(C$1,6,1),COLUMN(A7:INDEX(7:7,COUNTA(Листы1)))),ROW(E1))),\"]\",\"]'\")&\"'!A1\",SUBSTITUTE(INDEX(Листы1,SMALL(IF(N(INDIRECT(\"'\"&Листы1&\"'!B10\"))=--MID(C$1,6,1),COLUMN(A7:INDEX(7:7,COUNTA(Листы1)))),ROW(E1))),\" \",\"/\")),\"\")","v":"EUR/USD"}]
[null,null,2,null,{"$f":"IFERROR(HYPERLINK(SUBSTITUTE(INDEX(Листы1_,SMALL(IF(N(INDIRECT(\"'\"&Листы1&\"'!B10\"))=--MID(C$1,6,1),COLUMN(A8:INDEX(8:8,COUNTA(Листы1)))),ROW(E2))),\"]\",\"]'\")&\"'!A1\",SUBSTITUTE(INDEX(Листы1,SMALL(IF(N(INDIRECT(\"'\"&Листы1&\"'!B10\"))=--MID(C$1,6,1),COLUMN(A8:INDEX(8:8,COUNTA(Листы1)))),ROW(E2))),\" \",\"/\")),\"\")","v":"USD/JPY"}]
[null,null,3,null,{"$f":"IFERROR(HYPERLINK(SUBSTITUTE(INDEX(Листы1_,SMALL(IF(N(INDIRECT(\"'\"&Листы1&\"'!B10\"))=--MID(C$1,6,1),COLUMN(A9:INDEX(9:9,COUNTA(Листы1)))),ROW(E3))),\"]\",\"]'\")&\"'!A1\",SUBSTITUTE(INDEX(Листы1,SMALL(IF(N(INDIRECT(\"'\"&Листы1&\"'!B10\"))=--MID(C$1,6,1),COLUMN(A9:INDEX(9:9,COUNTA(Листы1)))),ROW(E3))),\" \",\"/\")),\"\")","v":""}]
[null,null,4,null,{"$f":"IFERROR(HYPERLINK(SUBSTITUTE(INDEX(Листы1_,SMALL(IF(N(INDIRECT(\"'\"&Листы1&\"'!B10\"))=--MID(C$1,6,1),COLUMN(A10:INDEX(10:10,COUNTA(Листы1)))),ROW(E4))),\"]\",\"]'\")&\"'!A1\",SUBSTITUTE(INDEX(Листы1,SMALL(IF(N(INDIRECT(\"'\"&Листы1&\"'!B10\"))=--MID(C$1,6,1),COLUMN(A10:INDEX(10:10,COUNTA(Листы1)))),ROW(E4))),\" \",\"/\")),\"\")","v":""}]
[null,null,5,null,{"$f":"IFERROR(HYPERLINK(SUBSTITUTE(INDEX(Листы1_,SMALL(IF(N(INDIRECT(\"'\"&Листы1&\"'!B10\"))=--MID(C$1,6,1),COLUMN(A11:INDEX(11:11,COUNTA(Листы1)))),ROW(E5))),\"]\",\"]'\")&\"'!A1\",SUBSTITUTE(INDEX(Листы1,SMALL(IF(N(INDIRECT(\"'\"&Листы1&\"'!B10\"))=--MID(C$1,6,1),COLUMN(A11:INDEX(11:11,COUNTA(Листы1)))),ROW(E5))),\" \",\"/\")),\"\")","v":""}]
[null,null,6,null,{"$f":"IFERROR(HYPERLINK(SUBSTITUTE(INDEX(Листы1_,SMALL(IF(N(INDIRECT(\"'\"&Листы1&\"'!B10\"))=--MID(C$1,6,1),COLUMN(A12:INDEX(12:12,COUNTA(Листы1)))),ROW(E6))),\"]\",\"]'\")&\"'!A1\",SUBSTITUTE(INDEX(Листы1,SMALL(IF(N(INDIRECT(\"'\"&Листы1&\"'!B10\"))=--MID(C$1,6,1),COLUMN(A12:INDEX(12:12,COUNTA(Листы1)))),ROW(E6))),\" \",\"/\")),\"\")","v":""}]
[null,null,7,null,{"$f":"IFERROR(HYPERLINK(SUBSTITUTE(INDEX(Листы1_,SMALL(IF(N(INDIRECT(\"'\"&Листы1&\"'!B10\"))=--MID(C$1,6,1),COLUMN(A13:INDEX(13:13,COUNTA(Листы1)))),ROW(E7))),\"]\",\"]'\")&\"'!A1\",SUBSTITUTE(INDEX(Листы1,SMALL(IF(N(INDIRECT(\"'\"&Листы1&\"'!B10\"))=--MID(C$1,6,1),COLUMN(A13:INDEX(13:13,COUNTA(Листы1)))),ROW(E7))),\" \",\"/\")),\"\")","v":""},null,{"$f":"IFERROR(INDEX(Листы1,SMALL(IF(N(INDIRECT(\"'\"&Листы1&\"'!B10\"))=1,COLUMN(A13:INDEX(13:13,COUNTA(Листы1)))),ROW(G7))),\"\")","v":""}]
[null,null,8,null,{"$f":"IFERROR(HYPERLINK(SUBSTITUTE(INDEX(Листы1_,SMALL(IF(N(INDIRECT(\"'\"&Листы1&\"'!B10\"))=--MID(C$1,6,1),COLUMN(A14:INDEX(14:14,COUNTA(Листы1)))),ROW(E8))),\"]\",\"]'\")&\"'!A1\",SUBSTITUTE(INDEX(Листы1,SMALL(IF(N(INDIRECT(\"'\"&Листы1&\"'!B10\"))=--MID(C$1,6,1),COLUMN(A14:INDEX(14:14,COUNTA(Листы1)))),ROW(E8))),\" \",\"/\")),\"\")","v":""},null,{"$f":"IFERROR(INDEX(Листы1,SMALL(IF(N(INDIRECT(\"'\"&Листы1&\"'!B10\"))=1,COLUMN(A14:INDEX(14:14,COUNTA(Листы1)))),ROW(G8))),\"\")","v":""}]
[null,null,9,null,{"$f":"IFERROR(HYPERLINK(SUBSTITUTE(INDEX(Листы1_,SMALL(IF(N(INDIRECT(\"'\"&Листы1&\"'!B10\"))=--MID(C$1,6,1),COLUMN(A15:INDEX(15:15,COUNTA(Листы1)))),ROW(E9))),\"]\",\"]'\")&\"'!A1\",SUBSTITUTE(INDEX(Листы1,SMALL(IF(N(INDIRECT(\"'\"&Листы1&\"'!B10\"))=--MID(C$1,6,1),COLUMN(A15:INDEX(15:15,COUNTA(Листы1)))),ROW(E9))),\" \",\"/\")),\"\")","v":""},null,{"$f":"IFERROR(INDEX(Листы1,SMALL(IF(N(INDIRECT(\"'\"&Листы1&\"'!B10\"))=1,COLUMN(A15:INDEX(15:15,COUNTA(Листы1)))),ROW(G9))),\"\")","v":""}]
[null,null,10,null,{"$f":"IFERROR(HYPERLINK(SUBSTITUTE(INDEX(Листы1_,SMALL(IF(N(INDIRECT(\"'\"&Листы1&\"'!B10\"))=--MID(C$1,6,1),COLUMN(A16:INDEX(16:16,COUNTA(Листы1)))),ROW(E10))),\"]\",\"]'\")&\"'!A1\",SUBSTITUTE(INDEX(Листы1,SMALL(IF(N(INDIRECT(\"'\"&Листы1&\"'!B10\"))=--MID(C$1,6,1),COLUMN(A16:INDEX(16:16,COUNTA(Листы1)))),ROW(E10))),\" \",\"/\")),\"\")","v":""},null,{"$f":"IFERROR(INDEX(Листы1,SMALL(IF(N(INDIRECT(\"'\"&Листы1&\"'!B10\"))=1,COLUMN(A16:INDEX(16:16,COUNTA(Листы1)))),ROW(G10))),\"\")","v":""}]
[null,null,11,null,{"$f":"IFERROR(HYPERLINK(SUBSTITUTE(INDEX(Листы1_,SMALL(IF(N(INDIRECT(\"'\"&Листы1&\"'!B10\"))=--MID(C$1,6,1),COLUMN(A17:INDEX(17:17,COUNTA(Листы1)))),ROW(E11))),\"]\",\"]'\")&\"'!A1\",SUBSTITUTE(INDEX(Листы1,SMALL(IF(N(INDIRECT(\"'\"&Листы1&\"'!B10\"))=--MID(C$1,6,1),COLUMN(A17:INDEX(17:17,COUNTA(Листы1)))),ROW(E11))),\" \",\"/\")),\"\")","v":""},null,{"$f":"IFERROR(INDEX(Листы1,SMALL(IF(N(INDIRECT(\"'\"&Листы1&\"'!B10\"))=1,COLUMN(A17:INDEX(17:17,COUNTA(Листы1)))),ROW(G11))),\"\")","v":""}]

{"sheet":"Лист2","index":3,"n_rows":17,"n_cols":5,"rows_kept":17,"cut":false,"hidden":false,"merged":[[0,2,3,4]]}
["Начало",null,"Лист 2                                             для инструментов в работу"]
[]
[]
[]
[]
[]
[null,null,1,null,{"$f":"IFERROR(HYPERLINK(SUBSTITUTE(INDEX(Листы1_,SMALL(IF(N(INDIRECT(\"'\"&Листы1&\"'!B10\"))=--MID(C$1,6,1),COLUMN(A7:INDEX(7:7,COUNTA(Листы1)))),ROW(E1))),\"]\",\"]'\")&\"'!A1\",SUBSTITUTE(INDEX(Листы1,SMALL(IF(N(INDIRECT(\"'\"&Листы1&\"'!B10\"))=--MID(C$1,6,1),COLUMN(A7:INDEX(7:7,COUNTA(Листы1)))),ROW(E1))),\" \",\"/\")),\"\")","v":"GBP/USD"}]
[null,null,2,null,{"$f":"IFERROR(HYPERLINK(SUBSTITUTE(INDEX(Листы1_,SMALL(IF(N(INDIRECT(\"'\"&Листы1&\"'!B10\"))=--MID(C$1,6,1),COLUMN(A8:INDEX(8:8,COUNTA(Листы1)))),ROW(E2))),\"]\",\"]'\")&\"'!A1\",SUBSTITUTE(INDEX(Листы1,SMALL(IF(N(INDIRECT(\"'\"&Листы1&\"'!B10\"))=--MID(C$1,6,1),COLUMN(A8:INDEX(8:8,COUNTA(Листы1)))),ROW(E2))),\" \",\"/\")),\"\")","v":""}]
[null,null,3,null,{"$f":"IFERROR(HYPERLINK(SUBSTITUTE(INDEX(Листы1_,SMALL(IF(N(INDIRECT(\"'\"&Листы1&\"'!B10\"))=--MID(C$1,6,1),COLUMN(A9:INDEX(9:9,COUNTA(Листы1)))),ROW(E3))),\"]\",\"]'\")&\"'!A1\",SUBSTITUTE(INDEX(Листы1,SMALL(IF(N(INDIRECT(\"'\"&Листы1&\"'!B10\"))=--MID(C$1,6,1),COLUMN(A9:INDEX(9:9,COUNTA(Листы1)))),ROW(E3))),\" \",\"/\")),\"\")","v":""}]
[null,null,4,null,{"$f":"IFERROR(HYPERLINK(SUBSTITUTE(INDEX(Листы1_,SMALL(IF(N(INDIRECT(\"'\"&Листы1&\"'!B10\"))=--MID(C$1,6,1),COLUMN(A10:INDEX(10:10,COUNTA(Листы1)))),ROW(E4))),\"]\",\"]'\")&\"'!A1\",SUBSTITUTE(INDEX(Листы1,SMALL(IF(N(INDIRECT(\"'\"&Листы1&\"'!B10\"))=--MID(C$1,6,1),COLUMN(A10:INDEX(10:10,COUNTA(Листы1)))),ROW(E4))),\" \",\"/\")),\"\")","v":""}]
[null,null,5,null,{"$f":"IFERROR(HYPERLINK(SUBSTITUTE(INDEX(Листы1_,SMALL(IF(N(INDIRECT(\"'\"&Листы1&\"'!B10\"))=--MID(C$1,6,1),COLUMN(A11:INDEX(11:11,COUNTA(Листы1)))),ROW(E5))),\"]\",\"]'\")&\"'!A1\",SUBSTITUTE(INDEX(Листы1,SMALL(IF(N(INDIRECT(\"'\"&Листы1&\"'!B10\"))=--MID(C$1,6,1),COLUMN(A11:INDEX(11:11,COUNTA(Листы1)))),ROW(E5))),\" \",\"/\")),\"\")","v":""}]
[null,null,6,null,{"$f":"IFERROR(HYPERLINK(SUBSTITUTE(INDEX(Листы1_,SMALL(IF(N(INDIRECT(\"'\"&Листы1&\"'!B10\"))=--MID(C$1,6,1),COLUMN(A12:INDEX(12:12,COUNTA(Листы1)))),ROW(E6))),\"]\",\"]'\")&\"'!A1\",SUBSTITUTE(INDEX(Листы1,SMALL(IF(N(INDIRECT(\"'\"&Листы1&\"'!B10\"))=--MID(C$1,6,1),COLUMN(A12:INDEX(12:12,COUNTA(Листы1)))),ROW(E6))),\" \",\"/\")),\"\")","v":""}]
[null,null,7,null,{"$f":"IFERROR(HYPERLINK(SUBSTITUTE(INDEX(Листы1_,SMALL(IF(N(INDIRECT(\"'\"&Листы1&\"'!B10\"))=--MID(C$1,6,1),COLUMN(A13:INDEX(13:13,COUNTA(Листы1)))),ROW(E7))),\"]\",\"]'\")&\"'!A1\",SUBSTITUTE(INDEX(Листы1,SMALL(IF(N(INDIRECT(\"'\"&Листы1&\"'!B10\"))=--MID(C$1,6,1),COLUMN(A13:INDEX(13:13,COUNTA(Листы1)))),ROW(E7))),\" \",\"/\")),\"\")","v":""}]
[null,null,8,null,{"$f":"IFERROR(HYPERLINK(SUBSTITUTE(INDEX(Листы1_,SMALL(IF(N(INDIRECT(\"'\"&Листы1&\"'!B10\"))=--MID(C$1,6,1),COLUMN(A14:INDEX(14:14,COUNTA(Листы1)))),ROW(E8))),\"]\",\"]'\")&\"'!A1\",SUBSTITUTE(INDEX(Листы1,SMALL(IF(N(INDIRECT(\"'\"&Листы1&\"'!B10\"))=--MID(C$1,6,1),COLUMN(A14:INDEX(14:14,COUNTA(Листы1)))),ROW(E8))),\" \",\"/\")),\"\")","v":""}]
[null,null,9,null,{"$f":"IFERROR(HYPERLINK(SUBSTITUTE(INDEX(Листы1_,SMALL(IF(N(INDIRECT(\"'\"&Листы1&\"'!B10\"))=--MID(C$1,6,1),COLUMN(A15:INDEX(15:15,COUNTA(Листы1)))),ROW(E9))),\"]\",\"]'\")&\"'!A1\",SUBSTITUTE(INDEX(Листы1,SMALL(IF(N(INDIRECT(\"'\"&Листы1&\"'!B10\"))=--MID(C$1,6,1),COLUMN(A15:INDEX(15:15,COUNTA(Листы1)))),ROW(E9))),\" \",\"/\")),\"\")","v":""}]
[null,null,10,null,{"$f":"IFERROR(HYPERLINK(SUBSTITUTE(INDEX(Листы1_,SMALL(IF(N(INDIRECT(\"'\"&Листы1&\"'!B10\"))=--MID(C$1,6,1),COLUMN(A16:INDEX(16:16,COUNTA(Листы1)))),ROW(E10))),\"]\",\"]'\")&\"'!A1\",SUBSTITUTE(INDEX(Листы1,SMALL(IF(N(INDIRECT(\"'\"&Листы1&\"'!B10\"))=--MID(C$1,6,1),COLUMN(A16:INDEX(16:16,COUNTA(Листы1)))),ROW(E10))),\" \",\"/\")),\"\")","v":""}]
[null,null,11,null,{"$f":"IFERROR(HYPERLINK(SUBSTITUTE(INDEX(Листы1_,SMALL(IF(N(INDIRECT(\"'\"&Листы1&\"'!B10\"))=--MID(C$1,6,1),COLUMN(A17:INDEX(17:17,COUNTA(Листы1)))),ROW(E11))),\"]\",\"]'\")&\"'!A1\",SUBSTITUTE(INDEX(Листы1,SMALL(IF(N(INDIRECT(\"'\"&Листы1&\"'!B10\"))=--MID(C$1,6,1),COLUMN(A17:INDEX(17:17,COUNTA(Листы1)))),ROW(E11))),\" \",\"/\")),\"\")","v":""}]

{"sheet":"Лист3","index":4,"n_rows":17,"n_cols":5,"rows_kept":17,"cut":false,"hidden":false,"merged":[[0,2,3,4]]}
["Начало",null,"Лист 3                                             для инструментов в работу"]
[]
[]
[]
[]
[]
[null,null,1,null,{"$f":"IFERROR(HYPERLINK(SUBSTITUTE(INDEX(Листы1_,SMALL(IF(N(INDIRECT(\"'\"&Листы1&\"'!B10\"))=--MID(C$1,6,1),COLUMN(A7:INDEX(7:7,COUNTA(Листы1)))),ROW(E1))),\"]\",\"]'\")&\"'!A1\",SUBSTITUTE(INDEX(Листы1,SMALL(IF(N(INDIRECT(\"'\"&Листы1&\"'!B10\"))=--MID(C$1,6,1),COLUMN(A7:INDEX(7:7,COUNTA(Листы1)))),ROW(E1))),\" \",\"/\")),\"\")","v":"AUD/USD"}]
[null,null,2,null,{"$f":"IFERROR(HYPERLINK(SUBSTITUTE(INDEX(Листы1_,SMALL(IF(N(INDIRECT(\"'\"&Листы1&\"'!B10\"))=--MID(C$1,6,1),COLUMN(A8:INDEX(8:8,COUNTA(Листы1)))),ROW(E2))),\"]\",\"]'\")&\"'!A1\",SUBSTITUTE(INDEX(Листы1,SMALL(IF(N(INDIRECT(\"'\"&Листы1&\"'!B10\"))=--MID(C$1,6,1),COLUMN(A8:INDEX(8:8,COUNTA(Листы1)))),ROW(E2))),\" \",\"/\")),\"\")","v":""}]
[null,null,3,null,{"$f":"IFERROR(HYPERLINK(SUBSTITUTE(INDEX(Листы1_,SMALL(IF(N(INDIRECT(\"'\"&Листы1&\"'!B10\"))=--MID(C$1,6,1),COLUMN(A9:INDEX(9:9,COUNTA(Листы1)))),ROW(E3))),\"]\",\"]'\")&\"'!A1\",SUBSTITUTE(INDEX(Листы1,SMALL(IF(N(INDIRECT(\"'\"&Листы1&\"'!B10\"))=--MID(C$1,6,1),COLUMN(A9:INDEX(9:9,COUNTA(Листы1)))),ROW(E3))),\" \",\"/\")),\"\")","v":""}]
[null,null,4,null,{"$f":"IFERROR(HYPERLINK(SUBSTITUTE(INDEX(Листы1_,SMALL(IF(N(INDIRECT(\"'\"&Листы1&\"'!B10\"))=--MID(C$1,6,1),COLUMN(A10:INDEX(10:10,COUNTA(Листы1)))),ROW(E4))),\"]\",\"]'\")&\"'!A1\",SUBSTITUTE(INDEX(Листы1,SMALL(IF(N(INDIRECT(\"'\"&Листы1&\"'!B10\"))=--MID(C$1,6,1),COLUMN(A10:INDEX(10:10,COUNTA(Листы1)))),ROW(E4))),\" \",\"/\")),\"\")","v":""}]
[null,null,5,null,{"$f":"IFERROR(HYPERLINK(SUBSTITUTE(INDEX(Листы1_,SMALL(IF(N(INDIRECT(\"'\"&Листы1&\"'!B10\"))=--MID(C$1,6,1),COLUMN(A11:INDEX(11:11,COUNTA(Листы1)))),ROW(E5))),\"]\",\"]'\")&\"'!A1\",SUBSTITUTE(INDEX(Листы1,SMALL(IF(N(INDIRECT(\"'\"&Листы1&\"'!B10\"))=--MID(C$1,6,1),COLUMN(A11:INDEX(11:11,COUNTA(Листы1)))),ROW(E5))),\" \",\"/\")),\"\")","v":""}]
[null,null,6,null,{"$f":"IFERROR(HYPERLINK(SUBSTITUTE(INDEX(Листы1_,SMALL(IF(N(INDIRECT(\"'\"&Листы1&\"'!B10\"))=--MID(C$1,6,1),COLUMN(A12:INDEX(12:12,COUNTA(Листы1)))),ROW(E6))),\"]\",\"]'\")&\"'!A1\",SUBSTITUTE(INDEX(Листы1,SMALL(IF(N(INDIRECT(\"'\"&Листы1&\"'!B10\"))=--MID(C$1,6,1),COLUMN(A12:INDEX(12:12,COUNTA(Листы1)))),ROW(E6))),\" \",\"/\")),\"\")","v":""}]
[null,null,7,null,{"$f":"IFERROR(HYPERLINK(SUBSTITUTE(INDEX(Листы1_,SMALL(IF(N(INDIRECT(\"'\"&Листы1&\"'!B10\"))=--MID(C$1,6,1),COLUMN(A13:INDEX(13:13,COUNTA(Листы1)))),ROW(E7))),\"]\",\"]'\")&\"'!A1\",SUBSTITUTE(INDEX(Листы1,SMALL(IF(N(INDIRECT(\"'\"&Листы1&\"'!B10\"))=--MID(C$1,6,1),COLUMN(A13:INDEX(13:13,COUNTA(Листы1)))),ROW(E7))),\" \",\"/\")),\"\")","v":""}]
[null,null,8,null,{"$f":"IFERROR(HYPERLINK(SUBSTITUTE(INDEX(Листы1_,SMALL(IF(N(INDIRECT(\"'\"&Листы1&\"'!B10\"))=--MID(C$1,6,1),COLUMN(A14:INDEX(14:14,COUNTA(Листы1)))),ROW(E8))),\"]\",\"]'\")&\"'!A1\",SUBSTITUTE(INDEX(Листы1,SMALL(IF(N(INDIRECT(\"'\"&Листы1&\"'!B10\"))=--MID(C$1,6,1),COLUMN(A14:INDEX(14:14,COUNTA(Листы1)))),ROW(E8))),\" \",\"/\")),\"\")","v":""}]
[null,null,9,null,{"$f":"IFERROR(HYPERLINK(SUBSTITUTE(INDEX(Листы1_,SMALL(IF(N(INDIRECT(\"'\"&Листы1&\"'!B10\"))=--MID(C$1,6,1),COLUMN(A15:INDEX(15:15,COUNTA(Листы1)))),ROW(E9))),\"]\",\"]'\")&\"'!A1\",SUBSTITUTE(INDEX(Листы1,SMALL(IF(N(INDIRECT(\"'\"&Листы1&\"'!B10\"))=--MID(C$1,6,1),COLUMN(A15:INDEX(15:15,COUNTA(Листы1)))),ROW(E9))),\" \",\"/\")),\"\")","v":""}]
[null,null,10,null,{"$f":"IFERROR(HYPERLINK(SUBSTITUTE(INDEX(Листы1_,SMALL(IF(N(INDIRECT(\"'\"&Листы1&\"'!B10\"))=--MID(C$1,6,1),COLUMN(A16:INDEX(16:16,COUNTA(Листы1)))),ROW(E10))),\"]\",\"]'\")&\"'!A1\",SUBSTITUTE(INDEX(Листы1,SMALL(IF(N(INDIRECT(\"'\"&Листы1&\"'!B10\"))=--MID(C$1,6,1),COLUMN(A16:INDEX(16:16,COUNTA(Листы1)))),ROW(E10))),\" \",\"/\")),\"\")","v":""}]
[null,null,11,null,{"$f":"IFERROR(HYPERLINK(SUBSTITUTE(INDEX(Листы1_,SMALL(IF(N(INDIRECT(\"'\"&Листы1&\"'!B10\"))=--MID(C$1,6,1),COLUMN(A17:INDEX(17:17,COUNTA(Листы1)))),ROW(E11))),\"]\",\"]'\")&\"'!A1\",SUBSTITUTE(INDEX(Листы1,SMALL(IF(N(INDIRECT(\"'\"&Листы1&\"'!B10\"))=--MID(C$1,6,1),COLUMN(A17:INDEX(17:17,COUNTA(Листы1)))),ROW(E11))),\" \",\"/\")),\"\")","v":""}]

{"sheet":"EUR USD","index":5,"n_rows":23,"n_cols":14,"rows_kept":23,"cut":false,"hidden":false,"merged":[[14,9,14,10],[0,1,0,7],[0,9,1,11],[1,1,2,7],[3,2,3,7],[4,2,4,7],[5,2,5,7],[6,2,6,7],[7,2,7,7],[8,2,8,7],[7,0,8,1],[9,2,9,7],[10,2,10,7],[11,2,11,7],[12,2,12,7],[13,2,13,7],[14,0,14,2],[14,3,14,6],[14,7,14,8],[15,0,15,2],[15,3,15,4],[15,5,15,6],[16,0,16,2],[16,3,16,4],[16,5,16,6],[20,5,20,6],[21,0,21,2],[21,3,21,4],[21,5,21,6],[17,0,17,2],[17,3,17,4],[17,5,17,6],[18,0,18,2],[18,3,18,4],[18,5,18,6],[24,0,24,2],[24,3,24,4],[24,5,24,6],[14,11,14,12],[19,13,24,19],[22,0,22,2],[22,3,22,4],[22,5,22,6],[23,0,23,2],[23,3,23,4],[23,5,23,6],[19,0,19,2],[19,3,19,4],[19,5,19,6],[20,0,20,2],[20,3,20,4]]}
["Начало",{"$f":"NOW()","v":"2016-01-22T21:30:35.510"},null,null,null,null,null,null,null,"Значимые уровни поддержки/сопротивления",null,null,null,"Место скрина"]
[null,{"$f":"REPLACE(MID(CELL(\"имяфайла\",B2),SEARCH(\"]\",CELL(\"имяфайла\",B2))+1,9),4,,\"/\")","v":"EUR/ USD"}]
["Лист 1"]
["Лист 2"]
["Лист 3",null,"Глобальный тренд",null,null,null,null,null,"Шорт"]
[null,null,"Локальный тренд",null,null,null,null,null,"Флет"]
[null,null,"Дневной тренд",null,null,null,null,null,"Лонг"]
["Отправитьна лист"]
[null,null,"Направление в работе",null,null,null,null,null,"Монитор"]
["Лист 1",1]
["Лист 2"]
["Лист 3"]
["OFF"]
[]
[null,null,null,"Лотность",null,null,null,"Вход",null,"Стоп",null,"Профит"]
[null,null,null,"авто",null,"руки",null,"авто","руки","авто","руки","авто","руки"]
["Точка входа 1"]
[]
[]
["Точка входа 2",null,null,null,null,null,null,null,null,null,null,null,null,"Примечание"]
{"$rows_left_out":4}
{"sheet":"GBP USD","index":6,"n_rows":23,"n_cols":14,"rows_kept":23,"cut":false,"hidden":false,"merged":[[19,13,24,19],[20,0,20,2],[20,3,20,4],[20,5,20,6],[21,0,21,2],[21,3,21,4],[21,5,21,6],[22,0,22,2],[22,3,22,4],[22,5,22,6],[23,0,23,2],[23,3,23,4],[23,5,23,6],[24,0,24,2],[24,3,24,4],[24,5,24,6],[19,0,19,2],[19,3,19,4],[19,5,19,6],[15,0,15,2],[15,3,15,4],[15,5,15,6],[16,0,16,2],[16,3,16,4],[16,5,16,6],[17,0,17,2],[17,3,17,4],[17,5,17,6],[18,0,18,2],[18,3,18,4],[18,5,18,6],[14,0,14,2],[14,3,14,6],[14,7,14,8],[14,9,14,10],[14,11,14,12],[0,9,1,11],[1,1,2,7],[3,2,3,7],[4,2,4,7],[13,2,13,7],[5,2,5,7],[6,2,6,7],[7,2,7,7],[8,2,8,7],[0,1,0,7],[9,2,9,7],[10,2,10,7],[11,2,11,7],[12,2,12,7],[7,0,8,1]]}
["Начало",{"$f":"NOW()","v":"2016-01-22T21:30:35.510"},null,null,null,null,null,null,null,"Значимые уровни поддержки/сопротивления"]
[null,{"$f":"REPLACE(MID(CELL(\"имяфайла\",B2),SEARCH(\"]\",CELL(\"имяфайла\",B2))+1,9),4,,\"/\")","v":"GBP/ USD"}]
["Лист 1",null,null,null,null,null,null,null,null,1.581,1.4677,1.4555]
["Лист 2",null,null,null,null,null,null,null,null,1.5169999999999999,1.464]
["Лист 3",null,"Глобальный тренд",null,null,null,null,null,"Шорт",1.482]
[null,null,"Локальный тренд",null,null,null,null,null,"Флет",1.458]
[null,null,"Дневной тренд",null,null,null,null,null,"Лонг",1.4239999999999999]
["Отправитьна лист"]
[null,null,"Направление в работе",null,null,null,null,null,"Монитор"]
["Лист 1",2]
["Лист 2"]
["Лист 3"]
["OFF"]
[]
[null,null,null,"Лотность",null,null,null,"Вход",null,"Стоп",null,"Профит"]
[null,null,null,"авто",null,"руки",null,"авто","руки","авто","руки","авто","руки"]
["Точка входа 1"]
[]
[]
["Точка входа 2",null,null,null,null,null,null,null,null,null,null,null,null,"Примечание"]
{"$rows_left_out":4}
{"sheet":"AUD USD","index":7,"n_rows":23,"n_cols":14,"rows_kept":23,"cut":false,"hidden":false,"merged":[[19,0,19,2],[18,3,18,4],[19,13,24,19],[20,0,20,2],[20,3,20,4],[20,5,20,6],[21,0,21,2],[21,3,21,4],[21,5,21,6],[24,0,24,2],[24,3,24,4],[24,5,24,6],[22,0,22,2],[22,3,22,4],[22,5,22,6],[23,0,23,2],[23,3,23,4],[23,5,23,6],[18,5,18,6],[14,11,14,12],[15,0,15,2],[15,3,15,4],[15,5,15,6],[16,0,16,2],[16,3,16,4],[16,5,16,6],[19,3,19,4],[19,5,19,6],[14,9,14,10],[17,0,17,2],[17,3,17,4],[17,5,17,6],[18,0,18,2],[11,2,11,7],[12,2,12,7],[13,2,13,7],[14,0,14,2],[14,3,14,6],[14,7,14,8],[10,2,10,7],[0,1,0,7],[0,9,1,11],[1,1,2,7],[3,2,3,7],[4,2,4,7],[5,2,5,7],[6,2,6,7],[7,0,8,1],[7,2,7,7],[8,2,8,7],[9,2,9,7]]}
["Начало",{"$f":"NOW()","v":"2016-01-22T21:30:35.510"},null,null,null,null,null,null,null,"Значимые уровни поддержки/сопротивления",null,null,null,"Место скрина"]
[null,{"$f":"REPLACE(MID(CELL(\"имяфайла\",B2),SEARCH(\"]\",CELL(\"имяфайла\",B2))+1,9),4,,\"/\")","v":"AUD/ USD"}]
["Лист 1"]
["Лист 2"]
["Лист 3",null,"Глобальный тренд",null,null,null,null,null,"Шорт"]
[null,null,"Локальный тренд",null,null,null,null,null,"Флет"]
[null,null,"Дневной тренд",null,null,null,null,null,"Лонг"]
["Отправитьна лист"]
[null,null,"Направление в работе",null,null,null,null,null,"Монитор"]
["Лист 1",3]
["Лист 2"]
["Лист 3"]
["OFF"]
[]
[null,null,null,"Лотность",null,null,null,"Вход",null,"Стоп",null,"Профит"]
[null,null,null,"авто",null,"руки",null,"авто","руки","авто","руки","авто","руки"]
["Точка входа 1"]
[]
[]
["Точка входа 2",null,null,null,null,null,null,null,null,null,null,null,null,"Примечание"]
{"$rows_left_out":4}
{"sheet":"USD JPY","index":8,"n_rows":23,"n_cols":14,"rows_kept":23,"cut":false,"hidden":false,"merged":[[19,0,19,2],[18,3,18,4],[19,13,24,19],[20,0,20,2],[20,3,20,4],[20,5,20,6],[21,0,21,2],[21,3,21,4],[21,5,21,6],[24,0,24,2],[24,3,24,4],[24,5,24,6],[22,0,22,2],[22,3,22,4],[22,5,22,6],[23,0,23,2],[23,3,23,4],[23,5,23,6],[18,5,18,6],[14,11,14,12],[15,0,15,2],[15,3,15,4],[15,5,15,6],[16,0,16,2],[16,3,16,4],[16,5,16,6],[19,3,19,4],[19,5,19,6],[14,9,14,10],[17,0,17,2],[17,3,17,4],[17,5,17,6],[18,0,18,2],[11,2,11,7],[12,2,12,7],[13,2,13,7],[14,0,14,2],[14,3,14,6],[14,7,14,8],[10,2,10,7],[0,1,0,7],[0,9,1,11],[1,1,2,7],[3,2,3,7],[4,2,4,7],[5,2,5,7],[6,2,6,7],[7,0,8,1],[7,2,7,7],[8,2,8,7],[9,2,9,7]]}
["Начало",{"$f":"NOW()","v":"2016-01-22T21:30:35.510"},null,null,null,null,null,null,null,"Значимые уровни поддержки/сопротивления",null,null,null,"Место скрина"]
[null,{"$f":"REPLACE(MID(CELL(\"имяфайла\",B2),SEARCH(\"]\",CELL(\"имяфайла\",B2))+1,9),4,,\"/\")","v":"USD/ JPY"}]
["Лист 1"]
["Лист 2"]
["Лист 3",null,"Глобальный тренд",null,null,null,null,null,"Шорт"]
[null,null,"Локальный тренд",null,null,null,null,null,"Флет"]
[null,null,"Дневной тренд",null,null,null,null,null,"Лонг"]
["Отправитьна лист"]
[null,null,"Направление в работе",null,null,null,null,null,"Монитор"]
["Лист 1",1]
["Лист 2"]
["Лист 3"]
["OFF"]
[]
[null,null,null,"Лотность",null,null,null,"Вход",null,"Стоп",null,"Профит"]
[null,null,null,"авто",null,"руки",null,"авто","руки","авто","руки","авто","руки"]
["Точка входа 1"]
[]
[]
["Точка входа 2",null,null,null,null,null,null,null,null,null,null,null,null,"Примечание"]
{"$rows_left_out":3}