{"text_format":"1","workbook":"xlsx","n_sheets":2,"sheets":["Машины","TDSheet"],"not_rendered":{"charts":0,"images":0,"macros":1,"external_links":0,"defined_names":3,"comments":0,"pivot_tables":0},"unopened":[],"bounds":{"document_bytes":16777216,"sheet_cells":100000,"rows_first":2000,"rows_last":500,"rows_between":2000,"halvings":0,"cell_chars":16384,"cell_head_chars":4096},"cells_cut":0,"cells_raw":0,"read":"whole","date_system":"1900"}

{"sheet":"Машины","index":0,"n_rows":27,"n_cols":2,"rows_kept":27,"cut":false,"hidden":false,"merged":[]}
[{"$f":"CONCATENATE(\"а/м \",B1)","v":"а/м 127"},127]
["а/м 128",128]
["а/м 129",129]
["а/м 292",292]
["а/м 296",296]
["а/м 297",297]
[{"$f":"CONCATENATE(\"а/м \",B7)","v":"а/м 1081"},1081]
["а/м 1083",1083]
["а/м 1084",1084]
["а/м 1085",1085]
["а/м 1086",1086]
["а/м 1090",1090]
["а/м 1094",1094]
["а/м 1095",1095]
["а/м 1129",1129]
["а/м 1131",1131]
["а/м 1132",1132]
[{"$f":"CONCATENATE(\"а/м \",B18)","v":"а/м 3202"},3202]
["а/м 3291",3291]
[{"$f":"CONCATENATE(\"а/м \",B20)","v":"а/м 4553"},4553]
{"$rows_left_out":8}
{"sheet":"TDSheet","index":1,"n_rows":39,"n_cols":72,"rows_kept":39,"cut":false,"hidden":false,"merged":[[1,60,1,61],[1,62,1,63],[1,4,1,5],[1,6,1,7],[1,68,2,69],[1,64,1,65],[2,64,2,65],[1,50,1,51],[1,52,1,53],[1,54,1,55],[1,56,1,57],[1,58,1,59],[1,40,1,41],[1,42,1,43],[1,44,1,45],[1,46,1,47],[1,48,1,49],[1,30,1,31],[1,32,1,33],[1,34,1,35],[1,36,1,37],[1,38,1,39],[0,1,0,3],[2,16,2,17],[2,18,2,19],[2,20,2,21],[2,22,2,23],[1,10,1,11],[1,12,1,13],[1,14,1,15],[1,16,1,17],[1,18,1,19],[1,20,1,21],[1,22,1,23],[1,1,3,1],[1,2,2,3],[2,12,2,13],[2,14,2,15],[2,62,2,63],[2,60,2,61],[2,58,2,59],[2,56,2,57],[2,54,2,55],[2,52,2,53],[2,24,2,25],[2,26,2,27],[2,28,2,29],[2,30,2,31],[2,32,2,33],[2,34,2,35],[0,8,2,9],[0,66,2,67],[2,4,2,5],[2,10,2,11],[2,6,2,7],[2,36,2,37],[2,38,2,39],[2,40,2,41],[2,42,2,43],[2,44,2,45],[2,50,2,51],[2,48,2,49],[2,46,2,47],[1,24,1,25],[1,26,1,27],[1,28,1,29]]}
[null,"Остатки и обороты по ТМЗ с 10.08.2012 по 31.08.2012",null,null,null,null,null,null,"Всего\nПРИХОД",null,null,null,null,null,null,null,null,null,null,null,null,null,null,null,null,null,null,null,null,null,null,null,null,null,null,null,null,null,null,null,null,null,null,null,null,null,null,null,null,null,null,null,null,null,null,null,null,null,null,null,null,null,null,null,null,null,"Всего\nРАСХОД"]
[null,"Счет / Склад / Номенклатура","Остаток на начало",null,"П р и х о д",null,"П р и х о д",null,null,null,"Р а с х о д",null,"Р а с х о д",null,"Р а с х о д",null,"Р а с х о д",null,"Р а с х о д",null,"Р а с х о д",null,"Р а с х о д",null,"Р а с х о д",null,"Р а с х о д",null,"Р а с х о д",null,"Р а с х о д",null,"Р а с х о д",null,"Р а с х о д",null,"Р а с х о д",null,"Р а с х о д",null,"Р а с х о д",null,"Р а с х о д",null,"Р а с х о д",null,"Р а с х о д",null,"Р а с х о д",null,"Р а с х о д",null,"Р а с х о д",null,"Р а с х о д",null,"Р а с х о д",null,"Р а с х о д",null,"Р а с х о д",null,"Р а с х о д",null,"Р а с х о д",null,null,null,"ОСТАТОК на конец"]
[null,null,null,null,"Прих.согл. Акта ",null,"Прих.согл. А/О",null,null,null,{"$f":"INDEX(Машины!$A$1:$A$27,COLUMN(Машины!C:C)/2,ROW(Машины!1:1))","v":"а/м 127"},null,{"$f":"INDEX(Машины!$A$1:$A$27,COLUMN(Машины!E:E)/2,ROW(Машины!1:1))","v":"а/м 128"},null,{"$f":"INDEX(Машины!$A$1:$A$27,COLUMN(Машины!G:G)/2,ROW(Машины!1:1))","v":"а/м 129"},null,{"$f":"INDEX(Машины!$A$1:$A$27,COLUMN(Машины!I:I)/2,ROW(Машины!1:1))","v":"а/м 292"},null,{"$f":"INDEX(Машины!$A$1:$A$27,COLUMN(Машины!K:K)/2,ROW(Машины!1:1))","v":"а/м 296"},null,{"$f":"INDEX(Машины!$A$1:$A$27,COLUMN(Машины!M:M)/2,ROW(Машины!1:1))","v":"а/м 297"},null,{"$f":"INDEX(Машины!$A$1:$A$27,COLUMN(Машины!O:O)/2,ROW(Машины!1:1))","v":"а/м 1081"},null,{"$f":"INDEX(Машины!$A$1:$A$27,COLUMN(Машины!Q:Q)/2,ROW(Машины!1:1))","v":"а/м 1083"},null,{"$f":"INDEX(Машины!$A$1:$A$27,COLUMN(Машины!S:S)/2,ROW(Машины!1:1))","v":"а/м 1084"},null,{"$f":"INDEX(Машины!$A$1:$A$27,COLUMN(Машины!U:U)/2,ROW(Машины!1:1))","v":"а/м 1085"},null,{"$f":"INDEX(Машины!$A$1:$A$27,COLUMN(Машины!W:W)/2,ROW(Машины!1:1))","v":"а/м 1086"},null,{"$f":"INDEX(Машины!$A$1:$A$27,COLUMN(Машины!Y:Y)/2,ROW(Машины!1:1))","v":"а/м 1090"},null,{"$f":"INDEX(Машины!$A$1:$A$27,COLUMN(Машины!AA:AA)/2,ROW(Машины!1:1))","v":"а/м 1094"},null,{"$f":"INDEX(Машины!$A$1:$A$27,COLUMN(Машины!AC:AC)/2,ROW(Машины!1:1))","v":"а/м 1095"},null,{"$f":"INDEX(Машины!$A$1:$A$27,COLUMN(Машины!AE:AE)/2,ROW(Машины!1:1))","v":"а/м 1129"},null,{"$f":"INDEX(Машины!$A$1:$A$27,COLUMN(Машины!AG:AG)/2,ROW(Машины!1:1))","v":"а/м 1131"},null,{"$f":"INDEX(Машины!$A$1:$A$27,COLUMN(Машины!AI:AI)/2,ROW(Машины!1:1))","v":"а/м 1132"},null,{"$f":"INDEX(Машины!$A$1:$A$27,COLUMN(Машины!AK:AK)/2,ROW(Машины!1:1))","v":"а/м 3202"},null,{"$f":"INDEX(Машины!$A$1:$A$27,COLUMN(Машины!AM:AM)/2,ROW(Машины!1:1))","v":"а/м 3291"},null,{"$f":"INDEX(Машины!$A$1:$A$27,COLUMN(Машины!AO:AO)/2,ROW(Машины!1:1))","v":"а/м 4553"},null,{"$f":"INDEX(Машины!$A$1:$A$27,COLUMN(Машины!AQ:AQ)/2,ROW(Машины!1:1))","v":"а/м 4556"},null,{"$f":"INDEX(Машины!$A$1:$A$27,COLUMN(Машины!AS:AS)/2,ROW(Машины!1:1))","v":"а/м "},null,{"$f":"INDEX(Машины!$A$1:$A$27,COLUMN(Машины!AU:AU)/2,ROW(Машины!1:1))","v":"а/м "},null,{"$f":"INDEX(Машины!$A$1:$A$27,COLUMN(Машины!AW:AW)/2,ROW(Машины!1:1))","v":"а/м "},null,{"$f":"INDEX(Машины!$A$1:$A$27,COLUMN(Машины!AY:AY)/2,ROW(Машины!1:1))","v":"а/м "},null,{"$f":"INDEX(Машины!$A$1:$A$27,COLUMN(Машины!BA:BA)/2,ROW(Машины!1:1))","v":"а/м "},null,{"$f":"INDEX(Машины!$A$1:$A$27,COLUMN(Машины!BC:BC)/2,ROW(Машины!1:1))","v":"а/м "},null,"Согл. Акта"]
[null,null,"кол-во","сумма","кол-во","сумма","кол-во","сумма","кол-во","сумма","кол-во","сумма","кол-во","сумма","кол-во","сумма","кол-во","сумма","кол-во","сумма","кол-во","сумма","кол-во","сумма","кол-во","сумма","кол-во","сумма","кол-во","сумма","кол-во","сумма","кол-во","сумма","кол-во","сумма","кол-во","сумма","кол-во","сумма","кол-во","сумма","кол-во","сумма","кол-во","сумма","кол-во","сумма","кол-во","сумма","кол-во","сумма","кол-во","сумма","кол-во","сумма","кол-во","сумма","кол-во","сумма","кол-во","сумма","кол-во","сумма","кол-во","сумма","кол-во","сумма","кол-во","сумма"]
[null,"Амортизатор задней кабины",53,4007.12,null,null,null,null,null,null,null,{"$f":"IF(ISERR(ROUND(K5*(($D5+$F5+$H5)/($C5+$E5+$G5)),2)),,ROUND(K5*(($D5+$F5+$H5)/($C5+$E5+$G5)),2))","v":0},null,{"$f":"IF(ISERR(ROUND(M5*(($D5+$F5+$H5)/($C5+$E5+$G5)),2)),,ROUND(M5*(($D5+$F5+$H5)/($C5+$E5+$G5)),2))","v":0},null,{"$f":"IF(ISERR(ROUND(O5*(($D5+$F5+$H5)/($C5+$E5+$G5)),2)),,ROUND(O5*(($D5+$F5+$H5)/($C5+$E5+$G5)),2))","v":0},null,{"$f":"IF(ISERR(ROUND(Q5*(($D5+$F5+$H5)/($C5+$E5+$G5)),2)),,ROUND(Q5*(($D5+$F5+$H5)/($C5+$E5+$G5)),2))","v":0},null,{"$f":"IF(ISERR(ROUND(S5*(($D5+$F5+$H5)/($C5+$E5+$G5)),2)),,ROUND(S5*(($D5+$F5+$H5)/($C5+$E5+$G5)),2))","v":0},null,{"$f":"IF(ISERR(ROUND(U5*(($D5+$F5+$H5)/($C5+$E5+$G5)),2)),,ROUND(U5*(($D5+$F5+$H5)/($C5+$E5+$G5)),2))","v":0},null,{"$f":"IF(ISERR(ROUND(W5*(($D5+$F5+$H5)/($C5+$E5+$G5)),2)),,ROUND(W5*(($D5+$F5+$H5)/($C5+$E5+$G5)),2))","v":0},null,{"$f":"IF(ISERR(ROUND(Y5*(($D5+$F5+$H5)/($C5+$E5+$G5)),2)),,ROUND(Y5*(($D5+$F5+$H5)/($C5+$E5+$G5)),2))","v":0},null,{"$f":"IF(ISERR(ROUND(AA5*(($D5+$F5+$H5)/($C5+$E5+$G5)),2)),,ROUND(AA5*(($D5+$F5+$H5)/($C5+$E5+$G5)),2))","v":0},null,{"$f":"IF(ISERR(ROUND(AC5*(($D5+$F5+$H5)/($C5+$E5+$G5)),2)),,ROUND(AC5*(($D5+$F5+$H5)/($C5+$E5+$G5)),2))","v":0},null,{"$f":"IF(ISERR(ROUND(AE5*(($D5+$F5+$H5)/($C5+$E5+$G5)),2)),,ROUND(AE5*(($D5+$F5+$H5)/($C5+$E5+$G5)),2))","v":0},null,{"$f":"IF(ISERR(ROUND(AG5*(($D5+$F5+$H5)/($C5+$E5+$G5)),2)),,ROUND(AG5*(($D5+$F5+$H5)/($C5+$E5+$G5)),2))","v":0},null,{"$f":"IF(ISERR(ROUND(AI5*(($D5+$F5+$H5)/($C5+$E5+$G5)),2)),,ROUND(AI5*(($D5+$F5+$H5)/($C5+$E5+$G5)),2))","v":0},null,{"$f":"IF(ISERR(ROUND(AK5*(($D5+$F5+$H5)/($C5+$E5+$G5)),2)),,ROUND(AK5*(($D5+$F5+$H5)/($C5+$E5+$G5)),2))","v":0},null,{"$f":"IF(ISERR(ROUND(AM5*(($D5+$F5+$H5)/($C5+$E5+$G5)),2)),,ROUND(AM5*(($D5+$F5+$H5)/($C5+$E5+$G5)),2))","v":0},null,{"$f":"IF(ISERR(ROUND(AO5*(($D5+$F5+$H5)/($C5+$E5+$G5)),2)),,ROUND(AO5*(($D5+$F5+$H5)/($C5+$E5+$G5)),2))","v":0},null,{"$f":"IF(ISERR(ROUND(AQ5*(($D5+$F5+$H5)/($C5+$E5+$G5)),2)),,ROUND(AQ5*(($D5+$F5+$H5)/($C5+$E5+$G5)),2))","v":0},null,{"$f":"IF(ISERR(ROUND(AS5*(($D5+$F5+$H5)/($C5+$E5+$G5)),2)),,ROUND(AS5*(($D5+$F5+$H5)/($C5+$E5+$G5)),2))","v":0},null,{"$f":"IF(ISERR(ROUND(AU5*(($D5+$F5+$H5)/($C5+$E5+$G5)),2)),,ROUND(AU5*(($D5+$F5+$H5)/($C5+$E5+$G5)),2))","v":0},null,{"$f":"IF(ISERR(ROUND(AW5*(($D5+$F5+$H5)/($C5+$E5+$G5)),2)),,ROUND(AW5*(($D5+$F5+$H5)/($C5+$E5+$G5)),2))","v":0},null,{"$f":"IF(ISERR(ROUND(AY5*(($D5+$F5+$H5)/($C5+$E5+$G5)),2)),,ROUND(AY5*(($D5+$F5+$H5)/($C5+$E5+$G5)),2))","v":0},null,{"$f":"IF(ISERR(ROUND(BA5*(($D5+$F5+$H5)/($C5+$E5+$G5)),2)),,ROUND(BA5*(($D5+$F5+$H5)/($C5+$E5+$G5)),2))","v":0},null,{"$f":"IF(ISERR(ROUND(BC5*(($D5+$F5+$H5)/($C5+$E5+$G5)),2)),,ROUND(BC5*(($D5+$F5+$H5)/($C5+$E5+$G5)),2))","v":0},null,{"$f":"IF(ISERR(ROUND(BE5*(($D5+$F5+$H5)/($C5+$E5+$G5)),2)),,ROUND(BE5*(($D5+$F5+$H5)/($C5+$E5+$G5)),2))","v":0},null,{"$f":"IF(ISERR(ROUND(BG5*(($D5+$F5+$H5)/($C5+$E5+$G5)),2)),,ROUND(BG5*(($D5+$F5+$H5)/($C5+$E5+$G5)),2))","v":0},null,{"$f":"IF(ISERR(ROUND(BI5*(($D5+$F5+$H5)/($C5+$E5+$G5)),2)),,ROUND(BI5*(($D5+$F5+$H5)/($C5+$E5+$G5)),2))","v":0},null,{"$f":"IF(ISERR(ROUND(BK5*(($D5+$F5+$H5)/($C5+$E5+$G5)),2)),,ROUND(BK5*(($D5+$F5+$H5)/($C5+$E5+$G5)),2))","v":0},null,{"$f":"IF(ISERR(ROUND(BM5*(($D5+$F5+$H5)/($C5+$E5+$G5)),2)),,ROUND(BM5*(($D5+$F5+$H5)/($C5+$E5+$G5)),2))","v":0},{"$f":"SUMIF($K$4:$BN$39,$K$4,$K5:$BL5)","v":0},{"$f":"SUMIF($K$4:$BN$39,$L$4,$K5:$BL5)","v":0},{"$f":"C5+I5-BO5","v":53},{"$f":"D5+J5-BP5","v":4007.12}]
[null,"Амортизатор переднего моста",30,1950.68,null,null,null,null,null,null,null,0,null,0,null,0,null,0,null,0,null,0,null,0,1,65.02,null,0,null,0,null,0,null,0,null,0,null,0,null,0,null,0,null,0,null,0,null,0,null,0,null,0,null,0,null,0,null,0,null,0,null,0,null,0,null,0,1,65.02,29,1885.66]
[null,"Амортизатор передней кабины",19,1423.72,null,null,null,null,null,null,null,0,null,0,null,0,null,0,1,74.930000000000007,null,0,null,0,null,0,null,0,null,0,null,0,null,0,null,0,null,0,null,0,null,0,null,0,null,0,null,0,null,0,null,0,null,0,null,0,null,0,null,0,null,0,null,0,null,0,1,74.930000000000007,18,1348.79]
[null,"Антигель",2,122.09,null,null,null,null,null,null,null,0,null,0,null,0,null,0,null,0,null,0,null,0,null,0,null,0,null,0,null,0,null,0,null,0,null,0,null,0,null,0,null,0,null,0,null,0,null,0,null,0,null,0,null,0,null,0,null,0,null,0,null,0,null,0,0,0,2,122.09]
[null,"Аппаратура №612600081236",1,2488.33,null,null,null,null,null,null,null,0,null,0,null,0,null,0,null,0,null,0,null,0,null,0,null,0,null,0,null,0,null,0,null,0,null,0,null,0,null,0,null,0,null,0,null,0,null,0,null,0,null,0,null,0,null,0,null,0,null,0,null,0,null,0,0,0,1,2488.33]
[null,"Хомут турбонадува",37,423.46999999999991,null,null,null,null,null,null,null,{"$f":"IF(ISERR(ROUND(K10*(($D10+$F10+$H10)/($C10+$E10+$G10)),2)),,ROUND(K10*(($D10+$F10+$H10)/($C10+$E10+$G10)),2))","v":0},null,{"$f":"IF(ISERR(ROUND(M10*(($D10+$F10+$H10)/($C10+$E10+$G10)),2)),,ROUND(M10*(($D10+$F10+$H10)/($C10+$E10+$G10)),2))","v":0},null,{"$f":"IF(ISERR(ROUND(O10*(($D10+$F10+$H10)/($C10+$E10+$G10)),2)),,ROUND(O10*(($D10+$F10+$H10)/($C10+$E10+$G10)),2))","v":0},null,{"$f":"IF(ISERR(ROUND(Q10*(($D10+$F10+$H10)/($C10+$E10+$G10)),2)),,ROUND(Q10*(($D10+$F10+$H10)/($C10+$E10+$G10)),2))","v":0},null,{"$f":"IF(ISERR(ROUND(S10*(($D10+$F10+$H10)/($C10+$E10+$G10)),2)),,ROUND(S10*(($D10+$F10+$H10)/($C10+$E10+$G10)),2))","v":0},null,{"$f":"IF(ISERR(ROUND(U10*(($D10+$F10+$H10)/($C10+$E10+$G10)),2)),,ROUND(U10*(($D10+$F10+$H10)/($C10+$E10+$G10)),2))","v":0},null,{"$f":"IF(ISERR(ROUND(W10*(($D10+$F10+$H10)/($C10+$E10+$G10)),2)),,ROUND(W10*(($D10+$F10+$H10)/($C10+$E10+$G10)),2))","v":0},null,{"$f":"IF(ISERR(ROUND(Y10*(($D10+$F10+$H10)/($C10+$E10+$G10)),2)),,ROUND(Y10*(($D10+$F10+$H10)/($C10+$E10+$G10)),2))","v":0},null,{"$f":"IF(ISERR(ROUND(AA10*(($D10+$F10+$H10)/($C10+$E10+$G10)),2)),,ROUND(AA10*(($D10+$F10+$H10)/($C10+$E10+$G10)),2))","v":0},null,{"$f":"IF(ISERR(ROUND(AC10*(($D10+$F10+$H10)/($C10+$E10+$G10)),2)),,ROUND(AC10*(($D10+$F10+$H10)/($C10+$E10+$G10)),2))","v":0},null,{"$f":"IF(ISERR(ROUND(AE10*(($D10+$F10+$H10)/($C10+$E10+$G10)),2)),,ROUND(AE10*(($D10+$F10+$H10)/($C10+$E10+$G10)),2))","v":0},null,{"$f":"IF(ISERR(ROUND(AG10*(($D10+$F10+$H10)/($C10+$E10+$G10)),2)),,ROUND(AG10*(($D10+$F10+$H10)/($C10+$E10+$G10)),2))","v":0},null,{"$f":"IF(ISERR(ROUND(AI10*(($D10+$F10+$H10)/($C10+$E10+$G10)),2)),,ROUND(AI10*(($D10+$F10+$H10)/($C10+$E10+$G10)),2))","v":0},null,{"$f":"IF(ISERR(ROUND(AK10*(($D10+$F10+$H10)/($C10+$E10+$G10)),2)),,ROUND(AK10*(($D10+$F10+$H10)/($C10+$E10+$G10)),2))","v":0},null,{"$f":"IF(ISERR(ROUND(AM10*(($D10+$F10+$H10)/($C10+$E10+$G10)),2)),,ROUND(AM10*(($D10+$F10+$H10)/($C10+$E10+$G10)),2))","v":0},null,{"$f":"IF(ISERR(ROUND(AO10*(($D10+$F10+$H10)/($C10+$E10+$G10)),2)),,ROUND(AO10*(($D10+$F10+$H10)/($C10+$E10+$G10)),2))","v":0},null,{"$f":"IF(ISERR(ROUND(AQ10*(($D10+$F10+$H10)/($C10+$E10+$G10)),2)),,ROUND(AQ10*(($D10+$F10+$H10)/($C10+$E10+$G10)),2))","v":0},null,{"$f":"IF(ISERR(ROUND(AS10*(($D10+$F10+$H10)/($C10+$E10+$G10)),2)),,ROUND(AS10*(($D10+$F10+$H10)/($C10+$E10+$G10)),2))","v":0},null,{"$f":"IF(ISERR(ROUND(AU10*(($D10+$F10+$H10)/($C10+$E10+$G10)),2)),,ROUND(AU10*(($D10+$F10+$H10)/($C10+$E10+$G10)),2))","v":0},null,{"$f":"IF(ISERR(ROUND(AW10*(($D10+$F10+$H10)/($C10+$E10+$G10)),2)),,ROUND(AW10*(($D10+$F10+$H10)/($C10+$E10+$G10)),2))","v":0},null,{"$f":"IF(ISERR(ROUND(AY10*(($D10+$F10+$H10)/($C10+$E10+$G10)),2)),,ROUND(AY10*(($D10+$F10+$H10)/($C10+$E10+$G10)),2))","v":0},null,{"$f":"IF(ISERR(ROUND(BA10*(($D10+$F10+$H10)/($C10+$E10+$G10)),2)),,ROUND(BA10*(($D10+$F10+$H10)/($C10+$E10+$G10)),2))","v":0},null,{"$f":"IF(ISERR(ROUND(BC10*(($D10+$F10+$H10)/($C10+$E10+$G10)),2)),,ROUND(BC10*(($D10+$F10+$H10)/($C10+$E10+$G10)),2))","v":0},null,{"$f":"IF(ISERR(ROUND(BE10*(($D10+$F10+$H10)/($C10+$E10+$G10)),2)),,ROUND(BE10*(($D10+$F10+$H10)/($C10+$E10+$G10)),2))","v":0},null,{"$f":"IF(ISERR(ROUND(BG10*(($D10+$F10+$H10)/($C10+$E10+$G10)),2)),,ROUND(BG10*(($D10+$F10+$H10)/($C10+$E10+$G10)),2))","v":0},null,{"$f":"IF(ISERR(ROUND(BI10*(($D10+$F10+$H10)/($C10+$E10+$G10)),2)),,ROUND(BI10*(($D10+$F10+$H10)/($C10+$E10+$G10)),2))","v":0},null,{"$f":"IF(ISERR(ROUND(BK10*(($D10+$F10+$H10)/($C10+$E10+$G10)),2)),,ROUND(BK10*(($D10+$F10+$H10)/($C10+$E10+$G10)),2))","v":0},null,{"$f":"IF(ISERR(ROUND(BM10*(($D10+$F10+$H10)/($C10+$E10+$G10)),2)),,ROUND(BM10*(($D10+$F10+$H10)/($C10+$E10+$G10)),2))","v":0},0,0,37,423.46999999999991]
[null,"Шкворня",170,1144.52,null,null,null,null,null,null,null,0,null,0,null,0,null,0,null,0,null,0,null,0,null,0,null,0,null,0,null,0,null,0,null,0,null,0,null,0,null,0,null,0,null,0,null,0,null,0,null,0,null,0,null,0,null,0,null,0,null,0,null,0,null,0,0,0,170,1144.52]
[null,"Шланг высокого давления(шланг рулевой)",0,0,null,null,null,null,null,null,null,0,null,0,null,0,null,0,null,0,null,0,null,0,null,0,null,0,null,0,null,0,null,0,null,0,null,0,null,0,null,0,null,0,null,0,null,0,null,0,null,0,null,0,null,0,null,0,null,0,null,0,null,0,null,0,0,0,0,0]
[null,"Шланг д. 10(топливный)",0,0,null,null,null,null,null,null,null,0,null,0,null,0,null,0,null,0,null,0,null,0,null,0,null,0,null,0,null,0,null,0,null,0,null,0,null,0,null,0,null,0,null,0,null,0,null,0,null,0,null,0,null,0,null,0,null,0,null,0,null,0,null,0,0,0,0,0]
[null,"Шланг домкрата кабины",0,0,null,null,1,110,null,null,null,0,null,0,null,0,null,0,null,0,null,0,null,0,null,0,null,0,null,0,null,0,null,0,null,0,null,0,null,0,null,0,null,0,null,0,null,0,null,0,null,0,null,0,null,0,null,0,null,0,null,0,null,0,null,0,0,0,0,0]
[null,"Шланг повышенный -пониженный",0,0,null,null,null,null,null,null,null,0,null,0,null,0,null,0,null,0,null,0,null,0,null,0,null,0,null,0,null,0,null,0,null,0,null,0,null,0,null,0,null,0,null,0,null,0,null,0,null,0,null,0,null,0,null,0,null,0,null,0,null,0,null,0,0,0,0,0]
[null,"Шланг радиатора (компл.)",97,3294.36,null,null,null,null,null,null,null,0,null,0,null,0,null,0,null,0,null,0,null,0,null,0,null,0,null,0,1,33.96,null,0,null,0,null,0,null,0,null,0,null,0,null,0,null,0,null,0,null,0,null,0,null,0,null,0,null,0,null,0,null,0,null,0,1,33.96,96,3260.4]
[null,"Шланг тормоза",30,691.3,null,null,null,null,null,null,null,0,null,0,null,0,null,0,null,0,null,0,null,0,null,0,null,0,null,0,null,0,null,0,null,0,null,0,null,0,null,0,null,0,null,0,null,0,null,0,null,0,null,0,null,0,null,0,null,0,null,0,null,0,null,0,0,0,30,691.3]
[null,"Шланг электрический",4,147.66999999999996,null,null,null,null,null,null,null,0,null,0,null,0,null,0,null,0,null,0,null,0,null,0,null,0,null,0,null,0,null,0,null,0,null,0,null,0,null,0,null,0,null,0,null,0,null,0,null,0,null,0,null,0,null,0,null,0,null,0,null,0,null,0,0,0,4,147.66999999999996]
[null,"Шпилька турбонадув",161,118.81,null,null,null,null,null,null,null,0,null,0,null,0,null,0,null,0,null,0,null,0,null,0,null,0,null,0,null,0,null,0,null,0,null,0,null,0,null,0,null,0,null,0,null,0,null,0,null,0,null,0,null,0,null,0,null,0,null,0,null,0,null,0,0,0,161,118.81]
[null,"Штангер",4,140.47,null,null,null,null,null,null,null,0,null,0,null,0,null,0,null,0,null,0,null,0,null,0,null,0,null,0,null,0,null,0,null,0,null,0,null,0,null,0,null,0,null,0,null,0,null,0,null,0,null,0,null,0,null,0,null,0,null,0,null,0,null,0,0,0,4,140.47]
{"$rows_left_out":19}