{"text_format":"1","workbook":"xlsx","n_sheets":2,"sheets":["Товары","Форма"],"not_rendered":{"charts":0,"images":0,"macros":1,"external_links":1,"defined_names":0,"comments":0,"pivot_tables":0},"unopened":[],"bounds":{"document_bytes":16777216,"sheet_cells":100000,"rows_first":2000,"rows_last":500,"rows_between":2000,"halvings":0,"cell_chars":16384,"cell_head_chars":4096},"cells_cut":0,"cells_raw":0,"read":"whole","date_system":"1900"}

{"sheet":"Товары","index":0,"n_rows":29,"n_cols":18,"rows_kept":29,"cut":false,"hidden":false,"merged":[]}
["Артикул","Наименование товара","Цена","Категория","Подкатегория","Размер","Состояние","Материал","Визуальный осмотр","Описание","Ширина плеч","Объем груди","Объем талии","Объем бедер","Длина рукава","Длина по спине","Длина по шву","Рост"]
["09001","Джинсы Zara",1000,"Женская одежда","Джинсы",25,"Отличное",null,"Дефектов нет","Размер EUR 34, MEX 24",null,null,72,84,null,null,87]
["09002","Рубашка KOTON",300,"Женская одежда","Рубашки и блузки","40-42 (XS)","Отличное",null,"Дефектов нет",null,null,82,null,null,null,45]
["09003","Юбка-шорты Adidas",300,"Женская одежда","Шорты и бриджы","40-42 (XS)","Хорошее",null,"Дефектов нет",null,null,null,68,null,null,null,30]
["09004","Сарафан Adidas",300,"Женская одежда","Платья и юбки","40-42 (XS)","Хорошее",null,"Дефектов нет","Трикотажный сарафан свободного кроя",null,null,78,null,null,82]
["09005","Майка Adidas "]
["09006","Кофта Zara",700,"Женская одежда","Кофты и свитера","42-44 (S)","Отличное",null,"Дефектов нет","Свободный крой, укороченная",40,90,null,null,56,47]
["09007","Кофта Zara",500,"Женская одежда","Кофты и свитера","42-44 (S)","Отличное","Трикотаж","Дефектов нет","Свободный крой",null,112,null,null,null,66]
["09008","Платье Zara",500,"Женская одежда","Платья и юбки","42-44 (S)","Хорошее","Трикотаж","Дефектов нет","Немного катышков внизу",34,82,76,88,52,91]
["09009","Рубашка Zara",200,"Женская одежда","Рубашки и блузки","40-42 (XS)","Отличное",null,"Дефектов нет",null,36,86,null,null,44,62]
["09010","Рубашка Zara",400,"Женская одежда","Рубашки и блузки","40-42 (XS)","Отличное",null,"Дефектов нет",null,38,88,null,null,59,72]
["09011","Платье KOTON",300,"Женская одежда","Платья и юбки","40-42 (XS)","Хорошее","Вискоза","Дефектов нет","На подкладе, два кармана",null,84,null,null,null,81]
["09012","Юбка Zara",1000,"Женская одежда","Платья и юбки","40-42 (XS)","Отличное","Шелк","Дефектов нет","Очень легкая",null,null,68,84,null,null,63]
["09013","Шорты Zars",500,"Женская одежда","Шорты и бриджы","40-42 (XS)","Отличное",null,"Дефектов нет","Шорты с завышенной талией, два кармана",null,null,66,86,null,null,40]
["09014","Брюки Zara",500,"Женская одежда","Брюки","40-42 (XS)","Хорошее","Полиэстер, вискоза","Внизу немного катышков",null,null,null,66,82,null,null,96]
["09015","Брюки Zara",1000,"Женская одежда","Брюки","40-42 (XS)","Отличное",null,"Дефектов нет","Брюки темно-синие с завышенной талией",null,null,68,82,null,null,90]
["09016","Пиджак Zara",1000,"Женская одежда","Пиджаки и костюмы","40-42 (XS)","Отличное",null,"Дефектов нет","Пиджак кремового цвета",36,82,null,null,48,60]
["09017","Платье Zara",700,"Женская одежда","Платья и юбки","40-42 (XS)","Отличное","полиэстер","Дефектов нет","Свободный крой",null,null,null,null,null,null,94]
["09018","Платье Zara",600,"Женская одежда","Платья и юбки","40-42 (XS)","Отличное","Полиэстер","Дефектов нет","На спине разрез, Талия на резинке",null,82,null,null,null,null,87]
["09019","Платье Zara",1500,"Женская одежда","Платья и юбки","40-42 (XS)","Отличное","Полиэстер","Дефектов нет","Прямого кроя",40,90,null,null,null,null,97]
["09020","Платье Zara",1500,"Женская одежда","Платья и юбки","40-42 (XS)","Отличное",null,"Дефектов нет","Верх платья кремового цвета, Юбка прямая с двумя карманами",null,null,72,null,null,null,35]
["09021","Сумка Zara",500,"Женская одежда","Аксессуары",null,"Отличное","Искусственная кожа","Дефектов нет","Сумка - один отдел, застежка на молнию"]
["10026","Босоножки",1500,"Женская одежда","Обувь",40,"Новое","Верх - натуральная кожа, подклада натуральная кожа","Дефектов нет","Высота каблука 8 см"]
["10027","Сабо желто-голубые",700,"Женская одежда","Обувь",38,"Новое","Верх - натуральная кожа, подклада - натуральная кожа","Дефектов нет","Высота каблука 9 см"]
["10027 - 1","Босоножки белые",1200,"Женская одежда","Обувь",40,"Новое","Верх - натуральная кожа, подклада- натуральная кожа","Дефектов нет","Высота каблука - 8 см"]
["10028","Босоножки черные",2000,"Женская одежда","Обувь",40,"Новое","Верх - натуральная кожа, Подклада - натуральная кожа","Дефектов нет","Высота каблука - 8 см"]
["10030","Сабо",1000,"Женская одежда","Обувь",39,"Новое","Верх - натуральная кожа, подклада - натуральная кожа","Дефектов нет","Высота спереди 2 см\r\nВысота каблука 9 см"]
["10031","Босоножки",1000,"Женская одежда","Обувь",40,"Новое","Верх - натуральная кожа, подклада - натуральная кожа","Дефектов нет","Высота каблука 8 см"]
["10032","Туфли серые с рисунком",2000,"Женская одежда","Обувь",39,"Новое","Верх - Натуральная кожа, подклада - натуральная кожа","Дефектов нет","Размер 39 - 39,5\r\nВысота платформы - 3 см\r\nВысота каблука - 12 см"]

{"sheet":"Форма","index":1,"n_rows":19,"n_cols":5,"rows_kept":19,"cut":false,"hidden":false,"merged":[]}
[null,null,null,"Артикул:","09009"]
["Название:",{"$f":"VLOOKUP(E1,[1]Товары!A:R,2,0)","v":"Рубашка Zara"}]
["Цена:",{"$f":"VLOOKUP(E1,[1]Товары!A:R,3,0)","v":200}]
["Артикул:",{"$f":"VLOOKUP(E1,[1]Товары!A:R,1,0)","v":"09009"}]
["Категория:",{"$f":"VLOOKUP(E1,[1]Товары!A:R,4,0)","v":"Женская одежда"}]
["Подкатегория:",{"$f":"VLOOKUP(E1,[1]Товары!A:R,5,0)","v":"Рубашки и блузки"}]
["Состояние:",{"$f":"VLOOKUP(E1,[1]Товары!A:R,7,0)","v":"Отличное"}]
["Размер:",{"$f":"VLOOKUP(E1,[1]Товары!A:R,6,0)","v":"40-42 (XS)"}]
["Материал:",{"$f":"VLOOKUP(E1,[1]Товары!A:R,8,0)","v":0}]
["Визуальный осмотр:",{"$f":"VLOOKUP(E1,[1]Товары!A:R,9,0)","v":"Дефектов нет"}]
["Ширина плеч:",{"$f":"VLOOKUP($E$1,[1]Товары!A:R,11,0)","v":36}]
["Объем груди:",{"$f":"VLOOKUP($E$1,[1]Товары!A:R,12,0)","v":86}]
["Объем талии:",{"$f":"VLOOKUP($E$1,[1]Товары!A:R,13,0)","v":0}]
["Объем бедер:",{"$f":"VLOOKUP($E$1,[1]Товары!A:R,14,0)","v":0}]
["Длина рукава:",{"$f":"VLOOKUP($E$1,[1]Товары!A:R,15,0)","v":44}]
["Длина по спине:",{"$f":"VLOOKUP($E$1,[1]Товары!A:R,16,0)","v":62}]
["Длина по шву:",{"$f":"VLOOKUP($E$1,[1]Товары!A:R,17,0)","v":0}]
["Рост:",{"$f":"VLOOKUP($E$1,[1]Товары!A:R,18,0)","v":0}]
["Описание:",{"$f":"VLOOKUP($E$1,[1]Товары!A:R,10,0)","v":0}]