{"text_format":"1","workbook":"xlsx","n_sheets":2,"sheets":["БЛАНК","январь"],"not_rendered":{"charts":0,"images":0,"macros":1,"external_links":0,"defined_names":1,"comments":0,"pivot_tables":0},"unopened":[],"bounds":{"document_bytes":16777216,"sheet_cells":100000,"rows_first":2000,"rows_last":500,"rows_between":2000,"halvings":0,"cell_chars":16384,"cell_head_chars":4096},"cells_cut":0,"cells_raw":0,"read":"whole","date_system":"1900"}

{"sheet":"БЛАНК","index":0,"n_rows":9,"n_cols":8,"rows_kept":9,"cut":false,"hidden":false,"merged":[[7,1,7,4]]}
[]
[null,null,null,null,null,null,{"$f":"VLOOKUP(\"x\",январь!B3:F10,4,0)","v":{"$error":"#N/A"}}," "]
[null,null,null,null,null,null,{"$f":"IFERROR(VLOOKUP(\"xx\",январь!B3:F10,4,0),\"\")","v":""}," '-   тут условие, если данные равны ячеек, вносить сюда, условно \"xx\""]
[]
[null,null,null,null,null,null,{"$f":"VLOOKUP(\"x\",INDIRECT(A1&\"!B3:F10\"),3,0)","v":{"$error":"#REF!"}}]
[null,null,null,null,null,"СУММА ",{"$f":"SUM(G2:G3)","v":{"$error":"#N/A"}}]
[]
[null,"БЛАНК с первой строкой"]
[null,"x","2016-03-28",100,51]

{"sheet":"январь","index":1,"n_rows":16,"n_cols":9,"rows_kept":16,"cut":false,"hidden":false,"merged":[[0,1,0,5]]}
[{"$f":"MID(CELL(\"ИМЯФАЙЛА\",A1),SEARCH(\"]\",CELL(\"ИМЯФАЙЛА\",A1))+1,255)","v":"январь"},"ЯНВАРЬ"]
[null,null,"дата ","Данные"]
[null,null,"2016-03-19",250,500]
[null,null,"2016-03-21",200,800]
[null,null,"2016-03-21",200,519,null,"макрос нужно чтобы спрашивал какой диапазон ячеек выводить  на печать (где условно ставить x  или xx)"]
[null,null,"2016-03-23",300,6196,null,"Когда С3 и следующая ячейка С4 НЕ РАВНЫ, тогда пускаем на печать бранка данные только со строкой \"3\", иначе в С4 поставим \"xx\" и занесем в БЛАНК данные с двух строк и пустим не печать "]
[null,null,"2016-03-24",400,941]
[null,null,"2016-03-25",250,968541]
[null,null,"2016-03-25",250,9541,null,null,null,"\"x\" - данные в первой строке на бланку? В примере G2"]
[null,null,"2016-03-27",100,251,null,null,null,"\"xx\" - данные во второй строке на бланку, в примере G3"]
[null,"x","2016-03-28",100,51]
[null,null,"2016-03-29",800,588]
[null,null,"2016-03-30",900,825]
[null,null,"2016-03-31",1000,545]
[null,null,"2016-03-31",1000,51]
[null,null,"2016-04-02",800,651]