{"text_format":"1","workbook":"xlsx","n_sheets":9,"sheets":["test","dop_uslug","price_dop","price_kvart","price_home","formula","card","инф","dop_uslug (2)"],"not_rendered":{"charts":0,"images":0,"macros":1,"external_links":0,"defined_names":9,"comments":0,"pivot_tables":0},"unopened":[],"bounds":{"document_bytes":16777216,"sheet_cells":100000,"rows_first":2000,"rows_last":500,"rows_between":2000,"halvings":0,"cell_chars":16384,"cell_head_chars":4096},"cells_cut":0,"cells_raw":0,"read":"whole","date_system":"1900"}

{"sheet":"test","index":0,"n_rows":10,"n_cols":14,"rows_kept":10,"cut":false,"hidden":false,"merged":[]}
["№","дата          заказа","тип           помещения","услуги","S","цена,        м2","сумма","№          карты","Фамилия","Имя","Отчество","адрес","контакт","примечание"]
[{"$f":"ROW()-1","v":1},"2016-01-01","квартира","уборка",81,{"$f":"IFERROR(IF(COUNTA(C2:E2),INDEX(IF(C2=\"дом\",price_home!$B$3:$E$4,price_kvart!$B$3:$E$4),MATCH(D2,price_kvart!$A$3:$A$4,0),MATCH(E2,price_kvart!$B$2:$E$2)),\"\"),\"\")","v":33},{"$f":"IFERROR((IF(dop_uslug!$K2=\"да\",price_dop!$B$4,price_dop!$C$4))+(IF(dop_uslug!$L2=\"да\",price_dop!$B$5,price_dop!$C$5))+(test!$E2*test!$F2)+(IF(dop_uslug!$H2=\"да\",price_dop!$B$3,price_dop!$C$3)*dop_uslug!$I2),\"\")","v":4973},5,{"$f":"IFERROR(INDEX(card!$B$2:$E$102,MATCH($H2,\ncard!$B$2:$B$102),2),\"\")","v":"сидоров"},{"$f":"IFERROR(INDEX(card!$B$2:$E$102,MATCH($H2,\ncard!$B$2:$B$102),3),\"\")","v":"сидр"},{"$f":"IFERROR(INDEX(card!$B$2:$E$102,MATCH($H2,\ncard!$B$2:$B$102),4),\"\")","v":"сидорович"},"гоголя 16/78","8-000-000-00-00"]
[2,"2016-01-02","дом","послестрой",60,{"$f":"IFERROR(IF(COUNTA(C3:E3),INDEX(IF(C3=\"дом\",price_home!$B$3:$E$4,price_kvart!$B$3:$E$4),MATCH(D3,price_kvart!$A$3:$A$4,0),MATCH(E3,price_kvart!$B$2:$E$2)),\"\"),\"\")","v":70},{"$f":"IFERROR((IF(dop_uslug!$K3=\"да\",price_dop!$B$4,price_dop!$C$4))+(IF(dop_uslug!$L3=\"да\",price_dop!$B$5,price_dop!$C$5))+(test!$E3*test!$F3)+(IF(dop_uslug!$H3=\"да\",price_dop!$B$3,price_dop!$C$3)*dop_uslug!$I3),\"\")","v":5700},2,{"$f":"IFERROR(INDEX(card!$B$2:$E$102,MATCH($H3,\ncard!$B$2:$B$102),2),\"\")","v":"булко"},{"$f":"IFERROR(INDEX(card!$B$2:$E$102,MATCH($H3,\ncard!$B$2:$B$102),3),\"\")","v":"александр"},{"$f":"IFERROR(INDEX(card!$B$2:$E$102,MATCH($H3,\ncard!$B$2:$B$102),4),\"\")","v":"владимирович"},"кр.проспект 73/4/6","8-000-000-00-00"]
[3,"2016-01-02","квартира","послестрой",60,{"$f":"IFERROR(IF(COUNTA(C4:E4),INDEX(IF(C4=\"дом\",price_home!$B$3:$E$4,price_kvart!$B$3:$E$4),MATCH(D4,price_kvart!$A$3:$A$4,0),MATCH(E4,price_kvart!$B$2:$E$2)),\"\"),\"\")","v":60},{"$f":"IFERROR((IF(dop_uslug!$K4=\"да\",price_dop!$B$4,price_dop!$C$4))+(IF(dop_uslug!$L4=\"да\",price_dop!$B$5,price_dop!$C$5))+(test!$E4*test!$F4)+(IF(dop_uslug!$H4=\"да\",price_dop!$B$3,price_dop!$C$3)*dop_uslug!$I4),\"\")","v":3600},4,{"$f":"IFERROR(INDEX(card!$B$2:$E$102,MATCH($H4,\ncard!$B$2:$B$102),2),\"\")","v":"петров"},{"$f":"IFERROR(INDEX(card!$B$2:$E$102,MATCH($H4,\ncard!$B$2:$B$102),3),\"\")","v":"петр"},{"$f":"IFERROR(INDEX(card!$B$2:$E$102,MATCH($H4,\ncard!$B$2:$B$102),4),\"\")","v":"петрович"},"гагарина 84/455","8-000-000-00-00"]
[4,"2016-01-02","дом","уборка",95,{"$f":"IFERROR(IF(COUNTA(C5:E5),INDEX(IF(C5=\"дом\",price_home!$B$3:$E$4,price_kvart!$B$3:$E$4),MATCH(D5,price_kvart!$A$3:$A$4,0),MATCH(E5,price_kvart!$B$2:$E$2)),\"\"),\"\")","v":48},{"$f":"IFERROR((IF(dop_uslug!$K5=\"да\",price_dop!$B$4,price_dop!$C$4))+(IF(dop_uslug!$L5=\"да\",price_dop!$B$5,price_dop!$C$5))+(test!$E5*test!$F5)+(IF(dop_uslug!$H5=\"да\",price_dop!$B$3,price_dop!$C$3)*dop_uslug!$I5),\"\")","v":4560},2,{"$f":"IFERROR(INDEX(card!$B$2:$E$102,MATCH($H5,\ncard!$B$2:$B$102),2),\"\")","v":"булко"},{"$f":"IFERROR(INDEX(card!$B$2:$E$102,MATCH($H5,\ncard!$B$2:$B$102),3),\"\")","v":"александр"},{"$f":"IFERROR(INDEX(card!$B$2:$E$102,MATCH($H5,\ncard!$B$2:$B$102),4),\"\")","v":"владимирович"},"кр.проспект 73/4/6","8-000-000-00-00"]
[5,"2016-01-06","квартира","уборка",60,{"$f":"IFERROR(IF(COUNTA(C6:E6),INDEX(IF(C6=\"дом\",price_home!$B$3:$E$4,price_kvart!$B$3:$E$4),MATCH(D6,price_kvart!$A$3:$A$4,0),MATCH(E6,price_kvart!$B$2:$E$2)),\"\"),\"\")","v":35},{"$f":"IFERROR((IF(dop_uslug!$K6=\"да\",price_dop!$B$4,price_dop!$C$4))+(IF(dop_uslug!$L6=\"да\",price_dop!$B$5,price_dop!$C$5))+(test!$E6*test!$F6)+(IF(dop_uslug!$H6=\"да\",price_dop!$B$3,price_dop!$C$3)*dop_uslug!$I6),\"\")","v":2100},5,{"$f":"IFERROR(INDEX(card!$B$2:$E$102,MATCH($H6,\ncard!$B$2:$B$102),2),\"\")","v":"сидоров"},{"$f":"IFERROR(INDEX(card!$B$2:$E$102,MATCH($H6,\ncard!$B$2:$B$102),3),\"\")","v":"сидр"},{"$f":"IFERROR(INDEX(card!$B$2:$E$102,MATCH($H6,\ncard!$B$2:$B$102),4),\"\")","v":"сидорович"},"гоголя 16/78","8-000-000-00-00"]
[6,"2016-01-07","дом","послестрой",80,{"$f":"IFERROR(IF(COUNTA(C7:E7),INDEX(IF(C7=\"дом\",price_home!$B$3:$E$4,price_kvart!$B$3:$E$4),MATCH(D7,price_kvart!$A$3:$A$4,0),MATCH(E7,price_kvart!$B$2:$E$2)),\"\"),\"\")","v":70},{"$f":"IFERROR((IF(dop_uslug!$K7=\"да\",price_dop!$B$4,price_dop!$C$4))+(IF(dop_uslug!$L7=\"да\",price_dop!$B$5,price_dop!$C$5))+(test!$E7*test!$F7)+(IF(dop_uslug!$H7=\"да\",price_dop!$B$3,price_dop!$C$3)*dop_uslug!$I7),\"\")","v":6800},4,{"$f":"IFERROR(INDEX(card!$B$2:$E$102,MATCH($H7,\ncard!$B$2:$B$102),2),\"\")","v":"петров"},{"$f":"IFERROR(INDEX(card!$B$2:$E$102,MATCH($H7,\ncard!$B$2:$B$102),3),\"\")","v":"петр"},{"$f":"IFERROR(INDEX(card!$B$2:$E$102,MATCH($H7,\ncard!$B$2:$B$102),4),\"\")","v":"петрович"},"гагарина 84/455","8-000-000-00-00"]
[7,"2016-01-08","квартира","уборка",15,{"$f":"IFERROR(IF(COUNTA(C8:E8),INDEX(IF(C8=\"дом\",price_home!$B$3:$E$4,price_kvart!$B$3:$E$4),MATCH(D8,price_kvart!$A$3:$A$4,0),MATCH(E8,price_kvart!$B$2:$E$2)),\"\"),\"\")","v":35},{"$f":"IFERROR((IF(dop_uslug!$K8=\"да\",price_dop!$B$4,price_dop!$C$4))+(IF(dop_uslug!$L8=\"да\",price_dop!$B$5,price_dop!$C$5))+(test!$E8*test!$F8)+(IF(dop_uslug!$H8=\"да\",price_dop!$B$3,price_dop!$C$3)*dop_uslug!$I8),\"\")","v":525},7,{"$f":"IFERROR(INDEX(card!$B$2:$E$102,MATCH($H8,\ncard!$B$2:$B$102),2),\"\")","v":"ишметов"},{"$f":"IFERROR(INDEX(card!$B$2:$E$102,MATCH($H8,\ncard!$B$2:$B$102),3),\"\")","v":"руслан"},{"$f":"IFERROR(INDEX(card!$B$2:$E$102,MATCH($H8,\ncard!$B$2:$B$102),4),\"\")","v":"фаритович"},"высоцкого 101/45","8-000-000-00-00"]
[8,"2016-01-10","дом","уборка",120,{"$f":"IFERROR(IF(COUNTA(C9:E9),INDEX(IF(C9=\"дом\",price_home!$B$3:$E$4,price_kvart!$B$3:$E$4),MATCH(D9,price_kvart!$A$3:$A$4,0),MATCH(E9,price_kvart!$B$2:$E$2)),\"\"),\"\")","v":48},{"$f":"IFERROR((IF(dop_uslug!$K9=\"да\",price_dop!$B$4,price_dop!$C$4))+(IF(dop_uslug!$L9=\"да\",price_dop!$B$5,price_dop!$C$5))+(test!$E9*test!$F9)+(IF(dop_uslug!$H9=\"да\",price_dop!$B$3,price_dop!$C$3)*dop_uslug!$I9),\"\")","v":6560},7,{"$f":"IFERROR(INDEX(card!$B$2:$E$102,MATCH($H9,\ncard!$B$2:$B$102),2),\"\")","v":"ишметов"},{"$f":"IFERROR(INDEX(card!$B$2:$E$102,MATCH($H9,\ncard!$B$2:$B$102),3),\"\")","v":"руслан"},{"$f":"IFERROR(INDEX(card!$B$2:$E$102,MATCH($H9,\ncard!$B$2:$B$102),4),\"\")","v":"фаритович"},"высоцкого 101/45","8-000-000-00-00"]
[{"$f":"ROW()-1","v":9},"2016-01-11","дом","уборка",50,{"$f":"IFERROR(IF(COUNTA(C10:E10),INDEX(IF(C10=\"дом\",price_home!$B$3:$E$4,price_kvart!$B$3:$E$4),MATCH(D10,price_kvart!$A$3:$A$4,0),MATCH(E10,price_kvart!$B$2:$E$2)),\"\"),\"\")","v":40},{"$f":"IFERROR((IF(dop_uslug!$K10=\"да\",price_dop!$B$4,price_dop!$C$4))+(IF(dop_uslug!$L10=\"да\",price_dop!$B$5,price_dop!$C$5))+(test!$E10*test!$F10)+(IF(dop_uslug!$H10=\"да\",price_dop!$B$3,price_dop!$C$3)*dop_uslug!$I10),\"\")","v":2000},6,{"$f":"IFERROR(INDEX(card!$B$2:$E$102,MATCH($H10,\ncard!$B$2:$B$102),2),\"\")","v":"мамонтов"},{"$f":"IFERROR(INDEX(card!$B$2:$E$102,MATCH($H10,\ncard!$B$2:$B$102),3),\"\")","v":"сергей"},{"$f":"IFERROR(INDEX(card!$B$2:$E$102,MATCH($H10,\ncard!$B$2:$B$102),4),\"\")","v":"владимирович"}]
{"$rows_left_out":1}
{"sheet":"dop_uslug","index":1,"n_rows":10,"n_cols":19,"rows_kept":10,"cut":false,"hidden":false,"merged":[]}
["№","Фамилия","Имя","Отчество","адрес","дата заказа","тип помещения","окно","цена окно","ковры","стирка","посуда","территория","территория2","территория3","S тер.","Столбец1","Столбец2","Столбец3"]
[{"$f":"test!A2","v":1},{"$f":"Таблица1[[#This Row],[Фамилия]]","v":"сидоров"},{"$f":"Таблица1[[#This Row],[Имя]]","v":"сидр"},{"$f":"Таблица1[[#This Row],[Отчество]]","v":"сидорович"},{"$f":"Таблица1[[#This Row],[адрес]]","v":"гоголя 16/78"},{"$f":"Таблица1[[#This Row],[дата          заказа]]","v":"2016-01-01"},{"$f":"Таблица1[[#This Row],[тип           помещения]]","v":"квартира"},"да",5,"есть","да","да","чистка снега",null,null,null,{"$f":"IF(dop_uslug!$M2=\"промести\",price_dop!$B$6,IF(dop_uslug!$M2=\"чистка снега\",price_dop!$B$7,IF(dop_uslug!$M2=\"чистка крыш\",price_dop!$B$8,IF(price_dop!$B$8,price_dop!$C$8,price_dop!$B$8))))","v":60}]
[{"$f":"test!A3","v":2},{"$f":"Таблица1[[#This Row],[Фамилия]]","v":"булко"},{"$f":"Таблица1[[#This Row],[Имя]]","v":"александр"},{"$f":"Таблица1[[#This Row],[Отчество]]","v":"владимирович"},{"$f":"Таблица1[[#This Row],[адрес]]","v":"кр.проспект 73/4/6"},{"$f":"Таблица1[[#This Row],[дата          заказа]]","v":"2016-01-02"},{"$f":"Таблица1[[#This Row],[тип           помещения]]","v":"дом"},"да",5,"нету",null,null,"чистка снега",null,null,null,{"$f":"IF(dop_uslug!$M3=\"промести\",price_dop!$B$6,IF(dop_uslug!$M3=\"чистка снега\",price_dop!$B$7,IF(dop_uslug!$M3=\"чистка крыш\",price_dop!$B$8,IF(price_dop!$B$8,price_dop!$C$8,price_dop!$B$8))))","v":60}]
[{"$f":"test!A4","v":3},{"$f":"Таблица1[[#This Row],[Фамилия]]","v":"петров"},{"$f":"Таблица1[[#This Row],[Имя]]","v":"петр"},{"$f":"Таблица1[[#This Row],[Отчество]]","v":"петрович"},{"$f":"Таблица1[[#This Row],[адрес]]","v":"гагарина 84/455"},{"$f":"Таблица1[[#This Row],[дата          заказа]]","v":"2016-01-02"},{"$f":"Таблица1[[#This Row],[тип           помещения]]","v":"квартира"},"нет",null,null,null,null,"снег с крыши",null,null,null,{"$f":"IF(dop_uslug!$M4=\"промести\",price_dop!$B$6,IF(dop_uslug!$M4=\"чистка снега\",price_dop!$B$7,IF(dop_uslug!$M4=\"чистка крыш\",price_dop!$B$8,IF(price_dop!$B$8,price_dop!$C$8,price_dop!$B$8))))","v":0}]
[{"$f":"test!A5","v":4},{"$f":"Таблица1[[#This Row],[Фамилия]]","v":"булко"},{"$f":"Таблица1[[#This Row],[Имя]]","v":"александр"},{"$f":"Таблица1[[#This Row],[Отчество]]","v":"владимирович"},{"$f":"Таблица1[[#This Row],[адрес]]","v":"кр.проспект 73/4/6"},{"$f":"Таблица1[[#This Row],[дата          заказа]]","v":"2016-01-02"},{"$f":"Таблица1[[#This Row],[тип           помещения]]","v":"дом"},"нет",null,null,null,null,null,null,null,null,{"$f":"IF(dop_uslug!$M5=\"промести\",price_dop!$B$6,IF(dop_uslug!$M5=\"чистка снега\",price_dop!$B$7,IF(dop_uslug!$M5=\"чистка крыш\",price_dop!$B$8,IF(price_dop!$B$8,price_dop!$C$8,price_dop!$B$8))))","v":0}]
[{"$f":"test!A6","v":5},{"$f":"Таблица1[[#This Row],[Фамилия]]","v":"сидоров"},{"$f":"Таблица1[[#This Row],[Имя]]","v":"сидр"},{"$f":"Таблица1[[#This Row],[Отчество]]","v":"сидорович"},{"$f":"Таблица1[[#This Row],[адрес]]","v":"гоголя 16/78"},{"$f":"Таблица1[[#This Row],[дата          заказа]]","v":"2016-01-06"},{"$f":"Таблица1[[#This Row],[тип           помещения]]","v":"квартира"},"нет",null,null,null,null,null,null,null,null,{"$f":"IF(dop_uslug!$M6=\"промести\",price_dop!$B$6,IF(dop_uslug!$M6=\"чистка снега\",price_dop!$B$7,IF(dop_uslug!$M6=\"чистка крыш\",price_dop!$B$8,IF(price_dop!$B$8,price_dop!$C$8,price_dop!$B$8))))","v":0}]
[{"$f":"test!A7","v":6},{"$f":"Таблица1[[#This Row],[Фамилия]]","v":"петров"},{"$f":"Таблица1[[#This Row],[Имя]]","v":"петр"},{"$f":"Таблица1[[#This Row],[Отчество]]","v":"петрович"},{"$f":"Таблица1[[#This Row],[адрес]]","v":"гагарина 84/455"},{"$f":"Таблица1[[#This Row],[дата          заказа]]","v":"2016-01-07"},{"$f":"Таблица1[[#This Row],[тип           помещения]]","v":"дом"},"да",4,null,null,null,null,null,null,null,{"$f":"IF(dop_uslug!$M7=\"промести\",price_dop!$B$6,IF(dop_uslug!$M7=\"чистка снега\",price_dop!$B$7,IF(dop_uslug!$M7=\"чистка крыш\",price_dop!$B$8,IF(price_dop!$B$8,price_dop!$C$8,price_dop!$B$8))))","v":0}]
[{"$f":"test!A8","v":7},{"$f":"Таблица1[[#This Row],[Фамилия]]","v":"ишметов"},{"$f":"Таблица1[[#This Row],[Имя]]","v":"руслан"},{"$f":"Таблица1[[#This Row],[Отчество]]","v":"фаритович"},{"$f":"Таблица1[[#This Row],[адрес]]","v":"высоцкого 101/45"},{"$f":"Таблица1[[#This Row],[дата          заказа]]","v":"2016-01-08"},{"$f":"Таблица1[[#This Row],[тип           помещения]]","v":"квартира"},null,null,null,null,null,null,null,null,null,{"$f":"IF(dop_uslug!$M8=\"промести\",price_dop!$B$6,IF(dop_uslug!$M8=\"чистка снега\",price_dop!$B$7,IF(dop_uslug!$M8=\"чистка крыш\",price_dop!$B$8,IF(price_dop!$B$8,price_dop!$C$8,price_dop!$B$8))))","v":0}]
[{"$f":"test!A9","v":8},{"$f":"Таблица1[[#This Row],[Фамилия]]","v":"ишметов"},{"$f":"Таблица1[[#This Row],[Имя]]","v":"руслан"},{"$f":"Таблица1[[#This Row],[Отчество]]","v":"фаритович"},{"$f":"Таблица1[[#This Row],[адрес]]","v":"высоцкого 101/45"},{"$f":"Таблица1[[#This Row],[дата          заказа]]","v":"2016-01-10"},{"$f":"Таблица1[[#This Row],[тип           помещения]]","v":"дом"},null,4,"нету","да","да",null,null,null,null,{"$f":"IF(dop_uslug!$M9=\"промести\",price_dop!$B$6,IF(dop_uslug!$M9=\"чистка снега\",price_dop!$B$7,IF(dop_uslug!$M9=\"чистка крыш\",price_dop!$B$8,IF(price_dop!$B$8,price_dop!$C$8,price_dop!$B$8))))","v":0}]
[{"$f":"test!A10","v":9},{"$f":"Таблица1[[#This Row],[Фамилия]]","v":"мамонтов"},{"$f":"Таблица1[[#This Row],[Имя]]","v":"сергей"},{"$f":"Таблица1[[#This Row],[Отчество]]","v":"владимирович"},{"$f":"Таблица1[[#This Row],[адрес]]","v":0},{"$f":"Таблица1[[#This Row],[дата          заказа]]","v":"2016-01-11"},{"$f":"Таблица1[[#This Row],[тип           помещения]]","v":"дом"},null,null,null,null,null,null,null,null,null,{"$f":"IF(dop_uslug!$M10=\"промести\",price_dop!$B$6,IF(dop_uslug!$M10=\"чистка снега\",price_dop!$B$7,IF(dop_uslug!$M10=\"чистка крыш\",price_dop!$B$8,IF(price_dop!$B$8,price_dop!$C$8,price_dop!$B$8))))","v":0}]
{"$rows_left_out":1}
{"sheet":"price_dop","index":2,"n_rows":8,"n_cols":3,"rows_kept":8,"cut":false,"hidden":false,"merged":[]}
[]
["доп.услага",1,"нет"]
["окна",300,0]
["стирка",300,0]
["посуда",500,0]
["прометание территории",30,0]
["чистка снега",60,0]
["чистка крыш",150,0]

{"sheet":"price_kvart","index":3,"n_rows":6,"n_cols":5,"rows_kept":6,"cut":false,"hidden":false,"merged":[]}
[]
["квартира",1,81,151,251]
["уборка",35,33,31,29]
["послестрой",60,57,54,51]
["посуда",500,500,500,500]
["окна",300,300,300,300]

{"sheet":"price_home","index":4,"n_rows":4,"n_cols":5,"rows_kept":4,"cut":false,"hidden":false,"merged":[]}
[]
["дом",1,81,151,251]
["уборка",40,48,46,44]
["послестрой",70,67,64,61]

{"sheet":"formula","index":5,"n_rows":21,"n_cols":14,"rows_kept":21,"cut":false,"hidden":false,"merged":[]}
["форм","тип помещения","услуг","доп услуги","ковры","окно","территория","стирка/посуда"]
[]
[null,"квартира","уборка","стирка","есть","да","промести","нет"]
[null,"дом","послестрой","посуда","нету","нет","чистка снега","да"]
[null,null,null,null,null,null,"снег с крыши"]
[]
[]
[null,null,null,null,null,null,null,null,null,null,null,"цена за м2",null,"автоматическое выставление по карте"]
[null,null,null,null,null,null,null,null,null,null,null,{"$f":"IF(COUNTA(test!$C2:$E2),INDEX(IF(test!C2=\"дом\",price_home!$B$3:$E$4,price_kvart!$B$3:$E$4),MATCH(test!D2,price_kvart!$A$3:$A$4,0),MATCH(test!E2,price_kvart!$B$2:$E$2)),\"\")","v":33},null,"ИНДЕКС(card!$B$2:$E$102;ПОИСКПОЗ(test!$H2;card!$B$2:$B$102);2)"]
[null,null,null,null,null,null,null,{"$f":"9/1.5","v":6},null,null,null,null,null,"ИНДЕКС(card!$B$2:$E$102;ПОИСКПОЗ(test!$H2;card!$B$2:$B$102);3)"]
{"$rows_left_out":12}
{"sheet":"card","index":6,"n_rows":102,"n_cols":10,"rows_kept":102,"cut":false,"hidden":false,"merged":[]}
["п/п","№ карты","Фамилия","Имя","Отчество","%","коэф","телефон","e-mail","адрес"]
[]
[1,1,"иванов","иван","иванович",5,{"$f":"F3/100","v":0.05}]
[2,2,"булко","александр","владимирович",10,{"$f":"F4/100","v":0.1}]
[3,3,"сергеев","сергей","сергеевич",15,0.15]
[4,4,"петров","петр","петрович",null,0]
[5,5,"сидоров","сидр","сидорович",null,0]
[6,6,"мамонтов","сергей","владимирович",null,0]
[7,7,"ишметов","руслан","фаритович",null,0]
[8,8,"смирнов","смирн","смирнович",null,0]
{"$rows_left_out":93}
{"sheet":"инф","index":7,"n_rows":15,"n_cols":4,"rows_kept":15,"cut":false,"hidden":false,"merged":[]}
[]
[null,"цена за м2"]
[null,"ЕСЛИ(СЧЁТЗ(test!C2:E2);ИНДЕКС(ЕСЛИ(test!C2=\"дом\";price_home!$B$3:$E$4;price_kvart!$B$3:$E$4);ПОИСКПОЗ(test!D2;price_kvart!$A$3:$A$4;0);ПОИСКПОЗ(test!E2;price_kvart!$B$2:$E$2));\"\")",null,"автоматическое выставление по карте"]
[null,null,null,"ИНДЕКС(card!$B$2:$E$102;ПОИСКПОЗ(test!$H2;card!$B$2:$B$102);2)"]
[null,"стирка (да/нет)",null,"ИНДЕКС(card!$B$2:$E$102;ПОИСКПОЗ(test!$H2;card!$B$2:$B$102);3)"]
[null,"ЕСЛИ(dop_uslug!$K2=\"да\";price_dop!$B$4;price_dop!$C$4)",null,"ИНДЕКС(card!$B$2:$E$102;ПОИСКПОЗ(test!$H2;card!$B$2:$B$102);4)"]
[]
[null,"посуда (да/нет)",null,"посуда, стирка (доп усл1)"]
[null,"ЕСЛИ(dop_uslug!$L2=\"да\";price_dop!$B$5;price_dop!$C$5)",null,"ЕСЛИ(dop_uslug!$K2=\"стирка\";price_dop!$B$4;ЕСЛИ(dop_uslug!$K2=\"посуда\";price_dop!$B$5;price_dop!$C$4))"]
[]
{"$rows_left_out":6}
{"sheet":"dop_uslug (2)","index":8,"n_rows":110,"n_cols":19,"rows_kept":110,"cut":false,"hidden":false,"merged":[]}
["№","Фамилия","Имя","Отчество","адрес","дата заказа","тип помещения","окно","цена окно","ковры","доп усл1","доп усл2","доп усл3","доп усл4","территория","S тер.","доп.услуга1","доп.услуга2","итого"]
[{"$f":"Таблица1[[#This Row],[№]]","v":1},{"$f":"Таблица1[[#This Row],[Фамилия]]","v":"сидоров"},{"$f":"Таблица1[[#This Row],[Имя]]","v":"сидр"},{"$f":"Таблица1[[#This Row],[Отчество]]","v":"сидорович"},{"$f":"Таблица1[[#This Row],[адрес]]","v":"гоголя 16/78"},{"$f":"Таблица1[[#This Row],[дата          заказа]]","v":"2016-01-01"},{"$f":"Таблица1[[#This Row],[тип           помещения]]","v":"квартира"},"да",5,null,"посуда","стирка",null,null,null,null,{"$f":"IF('dop_uslug (2)'!$K2=\"стирка\",price_dop!$B$4,IF('dop_uslug (2)'!$K2=\"посуда\",price_dop!$B$5,price_dop!$C$4))","v":500},{"$f":"IF('dop_uslug (2)'!$L2=\"стирка\",price_dop!$B$4,IF('dop_uslug (2)'!$L2=\"посуда\",price_dop!$B$5,price_dop!$C$4))","v":300},{"$f":"Таблица24[[#This Row],[доп.услуга1]]+Таблица24[[#This Row],[доп.услуга2]]","v":800}]
[{"$f":"Таблица1[[#This Row],[№]]","v":2},{"$f":"Таблица1[[#This Row],[Фамилия]]","v":"булко"},{"$f":"Таблица1[[#This Row],[Имя]]","v":"александр"},{"$f":"Таблица1[[#This Row],[Отчество]]","v":"владимирович"},{"$f":"Таблица1[[#This Row],[адрес]]","v":"кр.проспект 73/4/6"},{"$f":"Таблица1[[#This Row],[дата          заказа]]","v":"2016-01-02"},{"$f":"Таблица1[[#This Row],[тип           помещения]]","v":"дом"},"нет",5,null,null,null,null,null,null,null,{"$f":"IF('dop_uslug (2)'!$K3=\"стирка\",price_dop!$B$4,IF('dop_uslug (2)'!$K3=\"посуда\",price_dop!$B$5,price_dop!$C$4))","v":0},{"$f":"IF('dop_uslug (2)'!$L3=\"стирка\",price_dop!$B$4,IF('dop_uslug (2)'!$L3=\"посуда\",price_dop!$B$5,price_dop!$C$4))","v":0},{"$f":"Таблица24[[#This Row],[доп.услуга1]]+Таблица24[[#This Row],[доп.услуга2]]","v":0}]
[{"$f":"Таблица1[[#This Row],[№]]","v":3},{"$f":"Таблица1[[#This Row],[Фамилия]]","v":"петров"},{"$f":"Таблица1[[#This Row],[Имя]]","v":"петр"},{"$f":"Таблица1[[#This Row],[Отчество]]","v":"петрович"},{"$f":"Таблица1[[#This Row],[адрес]]","v":"гагарина 84/455"},{"$f":"Таблица1[[#This Row],[дата          заказа]]","v":"2016-01-02"},{"$f":"Таблица1[[#This Row],[тип           помещения]]","v":"квартира"},null,null,null,null,null,null,null,null,null,{"$f":"IF('dop_uslug (2)'!$K4=\"стирка\",price_dop!$B$4,IF('dop_uslug (2)'!$K4=\"посуда\",price_dop!$B$5,price_dop!$C$4))","v":0},{"$f":"IF('dop_uslug (2)'!$L4=\"стирка\",price_dop!$B$4,IF('dop_uslug (2)'!$L4=\"посуда\",price_dop!$B$5,price_dop!$C$4))","v":0},{"$f":"Таблица24[[#This Row],[доп.услуга1]]+Таблица24[[#This Row],[доп.услуга2]]","v":0}]
[{"$f":"Таблица1[[#This Row],[№]]","v":4},{"$f":"Таблица1[[#This Row],[Фамилия]]","v":"булко"},{"$f":"Таблица1[[#This Row],[Имя]]","v":"александр"},{"$f":"Таблица1[[#This Row],[Отчество]]","v":"владимирович"},{"$f":"Таблица1[[#This Row],[адрес]]","v":"кр.проспект 73/4/6"},{"$f":"Таблица1[[#This Row],[дата          заказа]]","v":"2016-01-02"},{"$f":"Таблица1[[#This Row],[тип           помещения]]","v":"дом"},null,null,null,null,null,null,null,null,null,{"$f":"IF('dop_uslug (2)'!$K5=\"стирка\",price_dop!$B$4,IF('dop_uslug (2)'!$K5=\"посуда\",price_dop!$B$5,price_dop!$C$4))","v":0},{"$f":"IF('dop_uslug (2)'!$L5=\"стирка\",price_dop!$B$4,IF('dop_uslug (2)'!$L5=\"посуда\",price_dop!$B$5,price_dop!$C$4))","v":0},{"$f":"Таблица24[[#This Row],[доп.услуга1]]+Таблица24[[#This Row],[доп.услуга2]]","v":0}]
[{"$f":"Таблица1[[#This Row],[№]]","v":5},{"$f":"Таблица1[[#This Row],[Фамилия]]","v":"сидоров"},{"$f":"Таблица1[[#This Row],[Имя]]","v":"сидр"},{"$f":"Таблица1[[#This Row],[Отчество]]","v":"сидорович"},{"$f":"Таблица1[[#This Row],[адрес]]","v":"гоголя 16/78"},{"$f":"Таблица1[[#This Row],[дата          заказа]]","v":"2016-01-06"},{"$f":"Таблица1[[#This Row],[тип           помещения]]","v":"квартира"},null,null,null,null,null,null,null,null,null,{"$f":"IF('dop_uslug (2)'!$K6=\"стирка\",price_dop!$B$4,IF('dop_uslug (2)'!$K6=\"посуда\",price_dop!$B$5,price_dop!$C$4))","v":0},{"$f":"IF('dop_uslug (2)'!$L6=\"стирка\",price_dop!$B$4,IF('dop_uslug (2)'!$L6=\"посуда\",price_dop!$B$5,price_dop!$C$4))","v":0},{"$f":"Таблица24[[#This Row],[доп.услуга1]]+Таблица24[[#This Row],[доп.услуга2]]","v":0}]
[{"$f":"Таблица1[[#This Row],[№]]","v":6},{"$f":"Таблица1[[#This Row],[Фамилия]]","v":"петров"},{"$f":"Таблица1[[#This Row],[Имя]]","v":"петр"},{"$f":"Таблица1[[#This Row],[Отчество]]","v":"петрович"},{"$f":"Таблица1[[#This Row],[адрес]]","v":"гагарина 84/455"},{"$f":"Таблица1[[#This Row],[дата          заказа]]","v":"2016-01-07"},{"$f":"Таблица1[[#This Row],[тип           помещения]]","v":"дом"},null,null,null,null,null,null,null,null,null,{"$f":"IF('dop_uslug (2)'!$K7=\"стирка\",price_dop!$B$4,IF('dop_uslug (2)'!$K7=\"посуда\",price_dop!$B$5,price_dop!$C$4))","v":0},{"$f":"IF('dop_uslug (2)'!$L7=\"стирка\",price_dop!$B$4,IF('dop_uslug (2)'!$L7=\"посуда\",price_dop!$B$5,price_dop!$C$4))","v":0},{"$f":"Таблица24[[#This Row],[доп.услуга1]]+Таблица24[[#This Row],[доп.услуга2]]","v":0}]
[{"$f":"Таблица1[[#This Row],[№]]","v":7},{"$f":"Таблица1[[#This Row],[Фамилия]]","v":"ишметов"},{"$f":"Таблица1[[#This Row],[Имя]]","v":"руслан"},{"$f":"Таблица1[[#This Row],[Отчество]]","v":"фаритович"},{"$f":"Таблица1[[#This Row],[адрес]]","v":"высоцкого 101/45"},{"$f":"Таблица1[[#This Row],[дата          заказа]]","v":"2016-01-08"},{"$f":"Таблица1[[#This Row],[тип           помещения]]","v":"квартира"},null,null,null,null,null,null,null,null,null,{"$f":"IF('dop_uslug (2)'!$K8=\"стирка\",price_dop!$B$4,IF('dop_uslug (2)'!$K8=\"посуда\",price_dop!$B$5,price_dop!$C$4))","v":0},{"$f":"IF('dop_uslug (2)'!$L8=\"стирка\",price_dop!$B$4,IF('dop_uslug (2)'!$L8=\"посуда\",price_dop!$B$5,price_dop!$C$4))","v":0},{"$f":"Таблица24[[#This Row],[доп.услуга1]]+Таблица24[[#This Row],[доп.услуга2]]","v":0}]
[{"$f":"Таблица1[[#This Row],[№]]","v":8},{"$f":"Таблица1[[#This Row],[Фамилия]]","v":"ишметов"},{"$f":"Таблица1[[#This Row],[Имя]]","v":"руслан"},{"$f":"Таблица1[[#This Row],[Отчество]]","v":"фаритович"},{"$f":"Таблица1[[#This Row],[адрес]]","v":"высоцкого 101/45"},{"$f":"Таблица1[[#This Row],[дата          заказа]]","v":"2016-01-10"},{"$f":"Таблица1[[#This Row],[тип           помещения]]","v":"дом"},null,null,null,null,null,null,null,null,null,{"$f":"IF('dop_uslug (2)'!$K9=\"стирка\",price_dop!$B$4,IF('dop_uslug (2)'!$K9=\"посуда\",price_dop!$B$5,price_dop!$C$4))","v":0},{"$f":"IF('dop_uslug (2)'!$L9=\"стирка\",price_dop!$B$4,IF('dop_uslug (2)'!$L9=\"посуда\",price_dop!$B$5,price_dop!$C$4))","v":0},{"$f":"Таблица24[[#This Row],[доп.услуга1]]+Таблица24[[#This Row],[доп.услуга2]]","v":0}]
[{"$f":"Таблица1[[#This Row],[№]]","v":9},{"$f":"Таблица1[[#This Row],[Фамилия]]","v":"мамонтов"},{"$f":"Таблица1[[#This Row],[Имя]]","v":"сергей"},{"$f":"Таблица1[[#This Row],[Отчество]]","v":"владимирович"},{"$f":"Таблица1[[#This Row],[адрес]]","v":0},{"$f":"Таблица1[[#This Row],[дата          заказа]]","v":"2016-01-11"},{"$f":"Таблица1[[#This Row],[тип           помещения]]","v":"дом"},null,null,null,null,null,null,null,null,null,{"$f":"IF('dop_uslug (2)'!$K10=\"стирка\",price_dop!$B$4,IF('dop_uslug (2)'!$K10=\"посуда\",price_dop!$B$5,price_dop!$C$4))","v":0},{"$f":"IF('dop_uslug (2)'!$L10=\"стирка\",price_dop!$B$4,IF('dop_uslug (2)'!$L10=\"посуда\",price_dop!$B$5,price_dop!$C$4))","v":0},{"$f":"Таблица24[[#This Row],[доп.услуга1]]+Таблица24[[#This Row],[доп.услуга2]]","v":0}]
{"$rows_left_out":100}